{
  "wording": {
    "title": "Construire l’avenir des jeunes en Hauts-de-France",
    "question": "Comment vous aider à construire votre avenir en Hauts-de-France ?",
    "metas": {
      "title": "Comment vous aider à construire votre avenir en Hauts-de-France ?",
      "description": "Vous avez une idée sur le sujet ? Participez à la consultation initiée par la Région Hauts-de-France avec Make.org",
      "picture": "https://uploads-ssl.webflow.com/59833d390a24e50001b873d8/5bd073e6ae57fd558cc90165_meta%20hdf.jpg"
    }
  },
  "theme": {
    "color": "#3dbfff",
    "gradient-start": "#fea8fe",
    "gradient-end": "#35bfff",
    "footerFontColor": "black"
  },
  "consultationUrl": "https://make.org/#/FR/consultation/jeunesse-hautsdefrance/consultation",
  "aboutUrl": "https://about.make.org/about-jeunesse-hautsdefrance",
  "sequenceExtraSlidesWording": {
    "introCard": {
      "title": "Les jeunes des Hauts-de-France proposent des solutions.",
      "description": [
        "Prenez position sur ces solutions ou proposez les vôtres.",
        "Les plus soutenues seront mises en oeuvre par la Région."
      ]
    },
    "signUpCard": {
      "title": "Soyez informés des résultats de la consultation",
      "nextCTA": "Non merci, je ne souhaite pas être informé des résultats"
    }
  },
  "sequenceExtraSlidesConfig": {
    "introCard": {
      "customTitle": true,
      "customDescription": true,
      "partners": [
        {
          "name": "Région Hauts-de-France+",
          "imageUrl": "/images/operations/jeunesse-hautsdefrance/sequence/hdf.svg"
        }
      ],
      "inPartnershipWith": true,
      "extraLogo": false
    },
    "signUpCard": {
      "customTitle": true,
      "customNextCTA": true
    },
    "pushProposal": true,
    "finalCard": {
      "customTitle": false,
      "linkUrl": "https://make.org/#/FR/consultation/jeunesse-hautsdefrance/consultation",
      "withSharing": false
    }
  },
  "sequenceSignUpForm": {
    "firstName": true,
    "age": true,
    "job": true,
    "postalCode": true,
    "csp": true,
    "gender": true,
    "hiddenOptOut": true,
    "partnerOptin": {
      "language": "fr",
      "label": "J'autorise la région Hauts-de-France à me recontacter dans le cadre de cette opération."
    }
  }
}
