{
  "wording": {
    "title": "WeEuropeans",
    "question": "Hoe kunnen we Europa concreet vernieuwen?",
    "metas": {
      "title": "Hoe kunnen we Europa concreet vernieuwen?",
      "description": "Heeft u een idee over dit onderwerp? Neem deel aan de grote burgerraadpleging van Make.org",
      "picture": "https://assets.make.org/assets/images/meta-we-europeans-no-copy.png"
    }
  },
  "sequenceExtraSlidesWording": {
    "introCard": {
      "title": "Duizenden burgers stellen oplossingen voor om Europa te vernieuwen.",
      "description": [
        "Neem een standpunt in over deze oplossingen of stel zelf oplossingen voor.",
        "De ideeën met de grootste aanhang moeten worden verdedigd door de kandidaten voor de Europese verkiezingen."
      ]
    },
    "signUpCard": {
      "title": "Ontvang de resultaten van de raadpleging en blijf op de hoogte van toekomstige acties",
      "nextCTA": "Nee, bedankt. Ik wil niet op de hoogte blijven van de resultaten"
    },
    "finalCard": {
      "title": "Bedankt voor uw deelname",
      "share": [
        "Wilt u meer doen om Europa te vernieuwen?",
        "Nodig uw familie, vrienden en/of gemeenschap uit om deel te nemen"
      ],
      "learn_more_title": "Ontdek alles over het project WeEuropeans",
      "learn_more_button": "Meer informatie"
    }
  },
  "theme": {
    "color": "#3839ca",
    "gradient-start": "#3839ca",
    "gradient-end": "#3839ca",
    "footerFontColor": "white",
    "weEuropeansTheme": true
  },
  "consultationUrl": "https://weeuropeans.eu/be/nl/about",
  "aboutUrl": "https://weeuropeans.eu/be/nl/about",
  "sequenceExtraSlidesConfig": {
    "introCard": {
      "title": true,
      "description": true,
      "partners": [],
      "inPartnershipWith": false,
      "extraLogo": false
    },
    "pushProposal": true,
    "signUpCard": true,
    "finalCard": {
      "customTitle": true,
      "linkUrl": "https://weeuropeans.eu/be/nl/about",
      "withSharing": true
    }
  },
  "sequenceSignUpForm": {
    "firstName": true,
    "age": true,
    "job": true,
    "postalCode": false,
    "csp": false,
    "gender": false,
    "hiddenOptOut": false,
    "partnerOptin": false
  }
}