1 0.752844 0.34218 0.0133542 0.0271406
1 0.6995 0.345625 0.0143333 0.0315625
1 0.838552 0.321305 0.0165208 0.0236406
1 0.603896 0.361047 0.0178333 0.0300938
1 0.978385 0.294898 0.0086875 0.0159844
1 0.853073 0.316797 0.00585417 0.0235313
1 0.587469 0.360648 0.0176458 0.0234531
