1 0.526875 0.612333 0.0765625 0.256333
1 0.627078 0.556594 0.0634375 0.161562
1 0.639531 0.504906 0.0172813 0.0421458
1 0.706898 0.482833 0.00948437 0.0245417
1 0.892414 0.564042 0.112922 0.18875
1 0.412344 0.700615 0.127094 0.455687
1 0.792578 0.594604 0.0779375 0.17975
1 0.951227 0.580198 0.0305469 0.128646
1 0.0890078 0.702833 0.116453 0.272958
1 0.683859 0.602365 0.0475938 0.224937
1 0.0240703 0.609875 0.0407344 0.345667
1 0.583336 0.509802 0.0400469 0.0919792
1 0.49043 0.50226 0.0180781 0.0354375
