1 0.586484 0.106174 0.0944062 0.154085
1 0.517531 0.774495 0.192 0.23777
1 0.332766 0.382265 0.133875 0.151338
1 0.439242 0.313275 0.139016 0.214718
1 0.365047 0.834308 0.295344 0.281526
1 0.403266 0.102582 0.0692813 0.155869
1 0.784234 0.198674 0.1355 0.375939
1 0.288687 0.88946 0.26325 0.193756
1 0.456273 0.0410094 0.0638594 0.0820188
1 0.634578 0.261491 0.0940625 0.219695
