1 0.0439141 0.2849 0.0312344 0.0935857
1 0.90425 0.439488 0.057625 0.15363
1 0.856742 0.358007 0.0402656 0.13392
1 0.873844 0.447617 0.069 0.153274
1 0.700594 0.301414 0.0289687 0.0851893
1 0.443297 0.27186 0.0209063 0.0228731
1 0.0276328 0.261693 0.0148281 0.0756347
1 0.731992 0.302049 0.0274844 0.0808909
1 0.0583672 0.266292 0.0139844 0.0704009
1 0.515773 0.450022 0.0817344 0.157327
