1 0.233844 0.764703 0.0418868 0.06325
1 0.188137 0.739219 0.0218396 0.0224375
1 0.172087 0.738805 0.0119104 0.0231406
1 0.153762 0.736914 0.0125708 0.0213906
1 0.0816509 0.766438 0.0411792 0.07125
