0 0.6765625 0.57578125 0.36796875 0.18984375
0 0.74609375 0.3375 0.459375 0.2234375
0 0.77421875 0.96875 0.3890625 0.053125
0 0.803125 0.83984375 0.26953125 0.20703125
0 0.7875 0.1359375 0.37734375 0.18984375
0 0.80078125 0.01953125 0.26953125 0.03828125
0 0.82578125 0.6625 0.2984375 0.165625