1 0.485719 0.494135 0.0961562 0.319438
1 0.388484 0.746073 0.274719 0.480896
1 0.630336 0.59101 0.128078 0.458437
1 0.235953 0.453604 0.119875 0.2055
1 0.103641 0.58975 0.099 0.227458
1 0.777406 0.63001 0.118156 0.499812
1 0.186008 0.694479 0.223547 0.447917
1 0.969102 0.569656 0.0617969 0.309062
1 0.921266 0.886583 0.157469 0.223542
