1 0.161797 0.71124 0.175281 0.546063
1 0.744633 0.315323 0.141109 0.235979
1 0.619703 0.336125 0.121 0.224583
1 0.358734 0.282104 0.142937 0.146167
1 0.914609 0.592135 0.170781 0.384271
1 0.898328 0.272698 0.154469 0.205021
1 0.525 0.242698 0.129781 0.238187
1 0.916102 0.404854 0.163453 0.198667
1 0.0734844 0.293917 0.126688 0.112625
1 0.711289 0.178458 0.0626094 0.104792
1 0.85125 0.193427 0.102219 0.139896
1 0.772594 0.644927 0.175656 0.229729
1 0.707305 0.143615 0.166703 0.137229
