1 0.752227 0.978638 0.0205156 0.042723
1 0.778797 0.983263 0.0227812 0.0334742
1 0.869563 0.968181 0.0310937 0.0636385
1 0.905977 0.975763 0.0292031 0.0470188
1 0.0787969 0.689014 0.0110625 0.0469484
1 0.0591172 0.691033 0.0133906 0.0623474
1 0.285547 0.983685 0.0258437 0.0322535
1 0.131039 0.959308 0.0570469 0.0809624
1 0.317516 0.982101 0.0226875 0.0347183
