               epoch,      train/box_loss,      train/obj_loss,      train/cls_loss,   metrics/precision,      metrics/recall,     metrics/mAP_0.5,metrics/mAP_0.5:0.95,        val/box_loss,        val/obj_loss,        val/cls_loss,               x/lr0,               x/lr1,               x/lr2
                   0,            0.061528,            0.029778,           0.0097193,             0.70198,             0.68175,             0.71823,             0.36753,            0.031872,           0.0084077,           0.0019595,            0.070052,           0.0033275,           0.0033275
                   1,            0.046002,            0.024202,           0.0032863,             0.72769,              0.6923,             0.73051,             0.39762,            0.028316,           0.0084751,           0.0011873,             0.04003,           0.0066389,           0.0066389
                   2,            0.044861,            0.025307,           0.0037635,             0.63193,             0.56844,             0.60457,             0.32765,            0.033222,            0.010155,            0.003874,           0.0099861,           0.0099283,           0.0099283
                   3,            0.047233,            0.028137,           0.0056318,             0.65837,             0.51495,             0.56095,             0.29745,            0.034051,             0.01067,           0.0037715,            0.009901,            0.009901,            0.009901
                   4,            0.046734,            0.028734,           0.0048346,             0.70481,              0.5961,             0.65475,             0.36417,            0.030039,           0.0098186,           0.0015109,            0.009901,            0.009901,            0.009901
                   5,            0.044792,            0.027725,           0.0043724,             0.68529,             0.59807,             0.64956,             0.34831,            0.029167,           0.0099418,            0.001378,            0.009868,            0.009868,            0.009868
                   6,            0.043847,            0.026998,           0.0041147,             0.62579,             0.57535,             0.62622,             0.34568,            0.029426,           0.0097362,           0.0037663,            0.009835,            0.009835,            0.009835
                   7,            0.042396,            0.026796,           0.0033866,             0.71454,             0.65543,              0.7142,             0.40897,             0.02813,           0.0092026,           0.0015225,            0.009802,            0.009802,            0.009802
                   8,            0.041819,            0.026105,            0.003424,             0.75385,             0.63533,             0.71493,             0.41621,            0.028314,           0.0090717,           0.0013846,            0.009769,            0.009769,            0.009769
                   9,            0.041806,            0.026184,            0.003304,             0.73656,             0.65004,             0.70578,              0.4041,            0.028748,           0.0092615,           0.0021945,            0.009736,            0.009736,            0.009736
                  10,            0.040935,            0.026147,           0.0030761,             0.71295,             0.68232,             0.72124,             0.41777,            0.026707,            0.009028,          0.00089026,            0.009703,            0.009703,            0.009703
                  11,            0.040597,            0.025758,           0.0029954,             0.75994,             0.65134,             0.72482,             0.41799,            0.026827,           0.0089134,            0.001063,             0.00967,             0.00967,             0.00967
                  12,            0.039746,            0.025711,            0.002765,             0.72331,             0.69046,             0.73757,               0.446,            0.026761,            0.008796,           0.0010971,            0.009637,            0.009637,            0.009637
                  13,            0.039527,             0.02517,           0.0028038,             0.76407,             0.68841,             0.74338,             0.44539,            0.026247,           0.0089526,          0.00065316,            0.009604,            0.009604,            0.009604
                  14,            0.038787,            0.024987,           0.0023957,             0.75938,             0.66071,             0.74039,             0.44457,            0.026671,           0.0088774,            0.001386,            0.009571,            0.009571,            0.009571
                  15,            0.038697,             0.02514,           0.0025609,             0.76159,             0.67506,             0.73247,             0.44682,            0.026343,            0.008952,           0.0011899,            0.009538,            0.009538,            0.009538
                  16,            0.038322,            0.024826,           0.0022572,               0.745,              0.7087,              0.7663,             0.47047,            0.025659,           0.0084407,            0.001071,            0.009505,            0.009505,            0.009505
                  17,            0.038105,            0.024771,           0.0024484,             0.77199,             0.70496,             0.76685,             0.47502,            0.025323,            0.008598,          0.00082309,            0.009472,            0.009472,            0.009472
                  18,            0.037938,             0.02468,           0.0022877,             0.75361,             0.70376,              0.7583,             0.47018,            0.025316,           0.0085691,          0.00051456,            0.009439,            0.009439,            0.009439
                  19,            0.037306,            0.024455,           0.0021532,             0.76335,             0.71243,             0.75839,             0.46309,            0.025019,           0.0084652,          0.00074533,            0.009406,            0.009406,            0.009406
                  20,            0.037329,            0.024269,            0.002247,             0.77003,             0.72356,             0.75996,             0.46193,            0.025435,           0.0083804,          0.00080189,            0.009373,            0.009373,            0.009373
                  21,            0.037176,            0.024061,           0.0019055,             0.75808,             0.69912,             0.76543,             0.47238,            0.026302,           0.0084746,           0.0006389,             0.00934,             0.00934,             0.00934
                  22,            0.037216,            0.024305,           0.0022019,             0.77018,             0.69318,             0.77397,             0.47568,            0.025737,           0.0083659,          0.00063984,            0.009307,            0.009307,            0.009307
                  23,            0.036563,            0.024067,           0.0019892,             0.75642,             0.72488,             0.76184,             0.47763,            0.025124,           0.0084832,          0.00046355,            0.009274,            0.009274,            0.009274
                  24,            0.036257,            0.024174,           0.0018989,             0.75718,             0.72487,             0.77498,             0.47819,            0.025349,           0.0083634,          0.00050016,            0.009241,            0.009241,            0.009241
                  25,            0.036288,            0.023663,           0.0020147,             0.78151,             0.70993,             0.77748,             0.47805,            0.024898,           0.0082942,          0.00065254,            0.009208,            0.009208,            0.009208
                  26,            0.036098,            0.023399,            0.001929,             0.77637,              0.7263,             0.78122,             0.48312,            0.024849,           0.0082699,          0.00064215,            0.009175,            0.009175,            0.009175
                  27,            0.035529,            0.023231,           0.0016201,             0.76769,             0.73212,             0.78291,             0.48856,            0.024139,           0.0082144,          0.00048375,            0.009142,            0.009142,            0.009142
                  28,            0.035736,            0.023166,           0.0019111,             0.80456,             0.71933,             0.79074,             0.50119,            0.024283,           0.0082518,          0.00056576,            0.009109,            0.009109,            0.009109
                  29,            0.035139,            0.023068,           0.0017367,             0.76979,             0.73207,             0.77788,             0.48578,            0.023314,            0.008194,          0.00055098,            0.009076,            0.009076,            0.009076
                  30,            0.035136,            0.023139,           0.0016861,             0.78569,              0.7293,             0.79493,             0.49639,            0.023646,           0.0081659,          0.00041003,            0.009043,            0.009043,            0.009043
                  31,            0.035284,            0.023109,           0.0017737,             0.79724,             0.71179,             0.78024,             0.49464,            0.024174,           0.0082188,           0.0005977,             0.00901,             0.00901,             0.00901
                  32,            0.035216,             0.02296,           0.0016907,             0.77871,             0.72756,             0.78896,             0.49195,            0.023894,           0.0081937,          0.00058587,            0.008977,            0.008977,            0.008977
                  33,            0.035057,            0.022927,           0.0017138,             0.80132,             0.71209,             0.79217,             0.50409,            0.023612,           0.0082369,           0.0005175,            0.008944,            0.008944,            0.008944
                  34,            0.034586,            0.022861,           0.0017683,             0.78562,             0.73304,             0.78932,             0.49971,            0.023492,           0.0081893,          0.00048368,            0.008911,            0.008911,            0.008911
                  35,            0.034667,            0.022823,           0.0016256,             0.79025,             0.72439,             0.79063,             0.50064,            0.023778,           0.0081067,          0.00052862,            0.008878,            0.008878,            0.008878
                  36,            0.034369,            0.022789,           0.0015839,              0.7912,             0.72756,             0.79823,              0.5081,            0.024026,           0.0081309,          0.00065725,            0.008845,            0.008845,            0.008845
                  37,            0.034297,            0.022699,           0.0016051,             0.79613,             0.73529,             0.80255,              0.5147,            0.023056,           0.0079794,          0.00029384,            0.008812,            0.008812,            0.008812
                  38,            0.033968,            0.022259,           0.0015767,             0.79018,             0.73862,             0.79339,             0.50758,             0.02306,            0.008066,          0.00025775,            0.008779,            0.008779,            0.008779
                  39,            0.033901,            0.022275,           0.0016049,             0.80547,             0.72101,             0.79929,             0.51593,            0.023607,           0.0080845,          0.00022304,            0.008746,            0.008746,            0.008746
                  40,            0.033633,            0.021872,           0.0014042,             0.79597,             0.73353,             0.80249,             0.51866,            0.022762,           0.0080356,          0.00038458,            0.008713,            0.008713,            0.008713
                  41,            0.033653,            0.022125,           0.0014886,             0.81319,             0.71784,             0.79813,             0.51734,            0.022988,           0.0079607,          0.00044293,             0.00868,             0.00868,             0.00868
                  42,            0.033475,            0.022113,           0.0014968,             0.81821,             0.72844,             0.79963,             0.51622,            0.023494,            0.007983,          0.00042417,            0.008647,            0.008647,            0.008647
                  43,            0.033631,            0.021885,           0.0014138,             0.80819,             0.72873,             0.80603,             0.51916,            0.023141,             0.00799,          0.00030877,            0.008614,            0.008614,            0.008614
                  44,            0.033333,            0.021868,           0.0014559,             0.80991,             0.72593,             0.80272,             0.51779,            0.023273,           0.0079082,          0.00038469,            0.008581,            0.008581,            0.008581
                  45,            0.033428,            0.022018,           0.0013429,             0.79667,             0.74715,             0.79616,             0.51751,            0.023342,           0.0079891,          0.00022408,            0.008548,            0.008548,            0.008548
                  46,            0.033611,            0.021709,           0.0014233,             0.78624,             0.74789,             0.80039,             0.51753,            0.023169,           0.0078896,           0.0003062,            0.008515,            0.008515,            0.008515
                  47,            0.032893,            0.021727,           0.0013914,             0.81179,             0.73581,             0.80014,             0.52036,            0.022551,           0.0079705,          0.00027762,            0.008482,            0.008482,            0.008482
                  48,            0.033234,            0.021899,           0.0014448,             0.79892,             0.73404,             0.80271,             0.52316,            0.022847,           0.0080337,          0.00033387,            0.008449,            0.008449,            0.008449
                  49,            0.032777,            0.021664,           0.0013717,             0.82463,             0.74409,             0.81245,             0.52722,            0.022735,           0.0079101,          0.00028082,            0.008416,            0.008416,            0.008416
                  50,            0.032633,            0.021663,           0.0012858,             0.80863,             0.73448,             0.80461,             0.52682,            0.022664,           0.0079124,          0.00029431,            0.008383,            0.008383,            0.008383
                  51,            0.032437,            0.021683,           0.0015085,             0.80463,             0.75452,             0.80952,              0.5272,            0.022642,           0.0079103,          0.00049218,             0.00835,             0.00835,             0.00835
                  52,            0.032802,            0.021596,           0.0012227,             0.81017,             0.73739,             0.80718,              0.5261,            0.022654,           0.0078525,          0.00040797,            0.008317,            0.008317,            0.008317
                  53,            0.032554,            0.021222,           0.0012439,             0.81836,             0.72313,             0.80191,             0.52204,            0.022935,            0.007936,          0.00040212,            0.008284,            0.008284,            0.008284
                  54,             0.03263,             0.02146,           0.0013193,             0.81185,             0.75373,             0.81185,             0.53192,             0.02289,           0.0079252,          0.00029502,            0.008251,            0.008251,            0.008251
                  55,            0.032272,            0.021223,           0.0012584,             0.81801,             0.74646,              0.8121,             0.53024,            0.022772,           0.0078596,          0.00044971,            0.008218,            0.008218,            0.008218
                  56,            0.032493,            0.020886,           0.0012862,             0.81864,             0.75818,             0.81831,             0.53732,             0.02237,           0.0077601,          0.00035837,            0.008185,            0.008185,            0.008185
                  57,            0.032446,             0.02131,           0.0012783,             0.82217,             0.75402,             0.82029,             0.53768,            0.022398,           0.0077319,          0.00030807,            0.008152,            0.008152,            0.008152
                  58,            0.032631,            0.021718,           0.0014246,             0.80489,             0.75253,             0.81513,             0.53695,            0.022512,           0.0078068,          0.00030981,            0.008119,            0.008119,            0.008119
                  59,            0.032318,            0.021353,           0.0013319,              0.8039,             0.75044,             0.81614,             0.53205,            0.022809,           0.0078384,          0.00031919,            0.008086,            0.008086,            0.008086
                  60,            0.031705,            0.021271,           0.0012236,              0.8152,             0.75185,             0.81902,             0.53454,            0.022274,           0.0078408,          0.00031187,            0.008053,            0.008053,            0.008053
                  61,             0.03195,            0.021137,           0.0012405,              0.8118,             0.75057,             0.81702,             0.53589,            0.022325,           0.0077613,          0.00037432,             0.00802,             0.00802,             0.00802
                  62,            0.031563,            0.020903,           0.0012309,             0.80543,             0.75429,              0.8161,             0.53914,            0.022116,           0.0077712,          0.00038295,            0.007987,            0.007987,            0.007987
                  63,            0.031931,            0.020798,           0.0013018,             0.81821,             0.73778,             0.81025,             0.53548,            0.022062,           0.0078155,          0.00038579,            0.007954,            0.007954,            0.007954
                  64,            0.031697,            0.020918,           0.0012897,             0.81161,             0.75208,              0.8165,             0.53486,            0.022086,           0.0078565,          0.00037179,            0.007921,            0.007921,            0.007921
                  65,            0.031646,            0.020721,           0.0012351,             0.79548,             0.74732,             0.81011,             0.53014,            0.022278,           0.0079234,          0.00032843,            0.007888,            0.007888,            0.007888
                  66,            0.031756,            0.020928,           0.0012551,              0.8084,             0.75047,              0.8044,             0.53008,            0.022199,           0.0078912,          0.00034883,            0.007855,            0.007855,            0.007855
                  67,            0.031455,            0.020891,            0.001123,              0.8088,             0.75247,             0.81219,             0.53543,            0.022231,           0.0078316,          0.00039346,            0.007822,            0.007822,            0.007822
                  68,            0.031354,            0.020597,           0.0011517,             0.83413,             0.73175,             0.81177,             0.53626,            0.022192,           0.0077642,          0.00037173,            0.007789,            0.007789,            0.007789
                  69,            0.031313,            0.020752,           0.0012171,             0.82703,             0.75548,             0.81935,             0.54402,            0.022197,           0.0077082,          0.00040531,            0.007756,            0.007756,            0.007756
                  70,            0.030928,            0.020515,           0.0013405,             0.82906,             0.74966,             0.81582,             0.54079,            0.022065,           0.0077163,          0.00043737,            0.007723,            0.007723,            0.007723
                  71,            0.031229,             0.02066,           0.0011817,             0.81802,              0.7546,             0.81943,               0.546,            0.021915,           0.0076615,          0.00043343,             0.00769,             0.00769,             0.00769
                  72,            0.031092,            0.020487,           0.0010508,              0.8175,             0.76617,             0.82289,             0.54761,            0.021912,           0.0076783,          0.00043308,            0.007657,            0.007657,            0.007657
                  73,            0.030844,            0.020249,             0.00105,             0.81832,             0.76184,             0.82273,             0.54811,            0.021989,           0.0077106,          0.00040705,            0.007624,            0.007624,            0.007624
                  74,            0.030971,            0.020318,            0.001053,             0.82134,             0.74791,             0.82169,              0.5452,            0.022153,           0.0077211,          0.00041728,            0.007591,            0.007591,            0.007591
                  75,            0.030943,            0.020519,           0.0010479,             0.82261,             0.74436,             0.81844,             0.54845,            0.021856,           0.0077253,            0.000437,            0.007558,            0.007558,            0.007558
                  76,             0.03062,            0.020475,           0.0011407,             0.82858,             0.74941,             0.82198,             0.54984,            0.021712,           0.0077161,          0.00043507,            0.007525,            0.007525,            0.007525
                  77,              0.0308,             0.02031,           0.0011148,             0.81733,             0.76629,             0.82115,             0.54897,            0.021546,           0.0077122,          0.00044737,            0.007492,            0.007492,            0.007492
                  78,            0.030647,             0.02028,           0.0011671,             0.81448,             0.77123,              0.8207,             0.55133,            0.021671,           0.0077064,          0.00041393,            0.007459,            0.007459,            0.007459
                  79,            0.031014,            0.020441,           0.0012363,             0.81705,             0.76887,             0.82319,             0.55345,            0.021523,           0.0076679,          0.00037536,            0.007426,            0.007426,            0.007426
                  80,            0.030855,            0.020399,           0.0011752,             0.83415,             0.75739,             0.82268,             0.55349,            0.021542,           0.0076987,          0.00038064,            0.007393,            0.007393,            0.007393
                  81,            0.030096,            0.020092,           0.0010191,             0.83357,             0.74712,             0.82133,             0.55541,            0.021448,           0.0076913,          0.00036685,             0.00736,             0.00736,             0.00736
                  82,            0.030448,            0.020356,           0.0011522,             0.81929,             0.76024,             0.81996,             0.55415,            0.021395,           0.0076911,          0.00035393,            0.007327,            0.007327,            0.007327
                  83,              0.0307,              0.0201,             0.00118,             0.81821,             0.76505,             0.81956,             0.55299,            0.021296,           0.0076974,          0.00032526,            0.007294,            0.007294,            0.007294
                  84,            0.030389,            0.019887,           0.0010939,             0.83218,             0.75691,             0.82232,             0.55478,            0.021264,           0.0076977,          0.00033465,            0.007261,            0.007261,            0.007261
                  85,            0.030042,            0.020153,            0.001226,             0.82809,              0.7658,             0.82506,             0.55721,            0.021291,           0.0076694,          0.00033259,            0.007228,            0.007228,            0.007228
                  86,            0.030404,            0.019942,           0.0010292,             0.84107,             0.76031,             0.82534,             0.55731,            0.021215,           0.0076908,          0.00033412,            0.007195,            0.007195,            0.007195
                  87,            0.029974,             0.01966,           0.0011036,             0.84545,             0.75496,             0.82287,             0.55623,            0.021253,           0.0076959,          0.00033297,            0.007162,            0.007162,            0.007162
                  88,                0.03,            0.019887,           0.0010678,             0.84015,             0.75467,             0.82606,             0.55835,            0.021201,           0.0076835,          0.00032639,            0.007129,            0.007129,            0.007129
                  89,            0.030075,             0.01994,           0.0010851,             0.84116,             0.75133,             0.82458,             0.55741,            0.021272,           0.0076973,          0.00032482,            0.007096,            0.007096,            0.007096
                  90,            0.030063,            0.019715,           0.0010732,             0.83628,              0.7544,             0.82407,             0.55793,            0.021224,           0.0077129,          0.00032413,            0.007063,            0.007063,            0.007063
                  91,            0.030041,            0.019983,           0.0011812,             0.84315,             0.75018,             0.82473,             0.55862,            0.021166,            0.007685,          0.00031578,             0.00703,             0.00703,             0.00703
                  92,            0.029837,            0.019905,           0.0011021,             0.84872,             0.75275,             0.82545,             0.55829,            0.021118,            0.007678,          0.00031475,            0.006997,            0.006997,            0.006997
                  93,            0.029717,            0.019494,           0.0010833,             0.84776,              0.7477,             0.82494,             0.55935,            0.021148,           0.0076864,          0.00031814,            0.006964,            0.006964,            0.006964
                  94,            0.029701,            0.019658,           0.0010556,             0.84374,             0.74904,             0.82749,             0.55998,            0.021137,           0.0076956,          0.00031834,            0.006931,            0.006931,            0.006931
                  95,            0.029546,            0.019714,           0.0010621,             0.84947,             0.75201,             0.82645,             0.56134,            0.021143,           0.0076964,            0.000313,            0.006898,            0.006898,            0.006898
                  96,            0.029566,            0.019769,          0.00098655,             0.85595,              0.7512,             0.82668,             0.56257,            0.021219,           0.0076954,          0.00031405,            0.006865,            0.006865,            0.006865
                  97,            0.029131,            0.019555,           0.0010912,              0.8484,             0.75201,             0.82619,             0.56492,             0.02123,           0.0076905,          0.00031436,            0.006832,            0.006832,            0.006832
                  98,            0.029498,            0.019678,           0.0010188,             0.84935,             0.75369,             0.82654,             0.56412,            0.021255,           0.0076922,          0.00031717,            0.006799,            0.006799,            0.006799
                  99,            0.029464,             0.01936,           0.0011192,             0.85172,             0.76015,             0.82749,             0.56458,            0.021272,           0.0076949,          0.00031991,            0.006766,            0.006766,            0.006766
                 100,            0.029208,            0.019405,           0.0011597,             0.85003,             0.76107,             0.82839,             0.56471,            0.021225,           0.0077013,          0.00032877,            0.006733,            0.006733,            0.006733
                 101,            0.029561,            0.019562,           0.0011267,             0.84364,             0.76195,             0.82912,             0.56572,            0.021189,           0.0077024,          0.00033188,              0.0067,              0.0067,              0.0067
                 102,             0.02885,            0.019088,          0.00098648,             0.84857,             0.75834,             0.82821,             0.56631,            0.021159,           0.0077054,          0.00033907,            0.006667,            0.006667,            0.006667
                 103,            0.028669,            0.019285,            0.001176,             0.85351,             0.75732,             0.82844,             0.56764,            0.021148,           0.0077101,          0.00034025,            0.006634,            0.006634,            0.006634
                 104,            0.028829,            0.019112,          0.00095184,             0.85519,             0.75584,             0.82746,             0.56636,            0.021129,           0.0077075,          0.00034346,            0.006601,            0.006601,            0.006601
                 105,            0.029241,            0.019442,           0.0010148,             0.83581,             0.76522,             0.82757,             0.56667,            0.021094,           0.0077146,          0.00034474,            0.006568,            0.006568,            0.006568
                 106,            0.028705,              0.0192,          0.00095756,             0.83618,             0.76483,             0.82684,             0.56563,            0.021077,           0.0077195,          0.00034635,            0.006535,            0.006535,            0.006535
                 107,            0.028834,            0.019038,          0.00098389,             0.83681,             0.76704,             0.82757,             0.56612,            0.021063,           0.0077294,          0.00035126,            0.006502,            0.006502,            0.006502
                 108,            0.028571,            0.019066,           0.0010311,             0.81514,             0.78286,             0.82834,             0.56546,            0.021045,           0.0077369,          0.00035581,            0.006469,            0.006469,            0.006469
                 109,            0.028747,            0.019209,          0.00099465,             0.80567,              0.7908,             0.82496,             0.56538,            0.021041,           0.0077384,          0.00035913,            0.006436,            0.006436,            0.006436
                 110,             0.02876,            0.019237,          0.00093025,             0.81852,             0.77034,             0.82632,             0.56583,            0.021063,           0.0077456,           0.0003611,            0.006403,            0.006403,            0.006403
                 111,            0.028502,            0.018904,          0.00093615,             0.82186,             0.77633,             0.82821,             0.56605,             0.02107,           0.0077441,          0.00036328,             0.00637,             0.00637,             0.00637
                 112,            0.028402,            0.018757,           0.0011102,             0.81856,             0.77722,             0.82809,             0.56582,            0.021072,           0.0077466,          0.00035967,            0.006337,            0.006337,            0.006337
                 113,            0.028438,            0.018944,           0.0010686,             0.82848,             0.77131,             0.82681,             0.56491,             0.02108,           0.0077466,          0.00035992,            0.006304,            0.006304,            0.006304
                 114,            0.028386,             0.01885,          0.00098203,             0.82815,             0.77164,             0.82646,             0.56429,            0.021091,           0.0077511,          0.00035623,            0.006271,            0.006271,            0.006271
                 115,            0.028191,            0.018761,          0.00091283,             0.82206,             0.77477,             0.82641,             0.56338,            0.021098,           0.0077527,          0.00035284,            0.006238,            0.006238,            0.006238
                 116,            0.028039,            0.018771,          0.00084219,             0.82488,             0.77282,             0.82636,             0.56335,              0.0211,           0.0077568,          0.00035146,            0.006205,            0.006205,            0.006205
                 117,            0.028321,            0.018704,          0.00096785,              0.8446,              0.7634,             0.82748,             0.56317,             0.02109,           0.0077602,          0.00035102,            0.006172,            0.006172,            0.006172
                 118,              0.0282,              0.0188,            0.000902,             0.84296,             0.76328,             0.82734,             0.56397,            0.021074,           0.0077601,           0.0003495,            0.006139,            0.006139,            0.006139
                 119,            0.028524,            0.018829,          0.00090182,             0.84579,             0.76441,             0.82704,             0.56422,            0.021057,           0.0077655,          0.00034991,            0.006106,            0.006106,            0.006106
                 120,            0.028295,            0.018506,          0.00084849,             0.84336,             0.76642,             0.82766,             0.56408,            0.021047,           0.0077652,          0.00034741,            0.006073,            0.006073,            0.006073
                 121,            0.027727,            0.018466,          0.00081046,              0.8385,             0.77058,             0.82752,             0.56431,            0.021029,           0.0077669,          0.00034411,             0.00604,             0.00604,             0.00604
                 122,            0.028069,            0.018417,          0.00089348,             0.83919,              0.7714,             0.82754,              0.5642,            0.021021,           0.0077665,          0.00034168,            0.006007,            0.006007,            0.006007
                 123,            0.027683,            0.018714,          0.00090244,             0.83725,             0.77621,             0.82936,             0.56471,            0.021011,           0.0077619,          0.00034029,            0.005974,            0.005974,            0.005974
                 124,            0.028019,            0.018598,          0.00087684,             0.84135,               0.772,             0.83012,             0.56464,            0.021001,           0.0077573,           0.0003376,            0.005941,            0.005941,            0.005941
                 125,            0.027693,            0.018447,          0.00083194,             0.83747,              0.7758,              0.8301,             0.56522,            0.021003,           0.0077564,          0.00033486,            0.005908,            0.005908,            0.005908
                 126,            0.027497,            0.018316,          0.00090354,              0.8357,             0.77363,             0.82867,             0.56486,            0.020998,           0.0077548,          0.00033372,            0.005875,            0.005875,            0.005875
                 127,            0.027461,             0.01828,          0.00092504,             0.83405,             0.77446,             0.82887,             0.56556,            0.020991,           0.0077538,          0.00033435,            0.005842,            0.005842,            0.005842
                 128,            0.027636,            0.018301,          0.00081762,             0.83058,             0.77679,             0.82931,             0.56559,             0.02099,           0.0077543,          0.00033459,            0.005809,            0.005809,            0.005809
                 129,            0.027104,            0.018132,          0.00093813,             0.82998,             0.77849,             0.82897,             0.56557,            0.020986,            0.007752,          0.00033538,            0.005776,            0.005776,            0.005776
                 130,            0.027539,            0.017998,          0.00082526,             0.82666,             0.77721,             0.82776,             0.56536,            0.020985,            0.007752,          0.00033564,            0.005743,            0.005743,            0.005743
                 131,             0.02758,            0.018483,          0.00080925,             0.82999,             0.77772,             0.82766,             0.56591,            0.020983,           0.0077514,          0.00033527,             0.00571,             0.00571,             0.00571
                 132,            0.027012,            0.018102,          0.00078514,             0.83087,             0.77862,              0.8298,             0.56575,             0.02098,           0.0077545,          0.00033636,            0.005677,            0.005677,            0.005677
                 133,            0.026788,             0.01804,          0.00074857,             0.83188,             0.77871,             0.83053,             0.56637,            0.020981,           0.0077564,          0.00033538,            0.005644,            0.005644,            0.005644
                 134,             0.02727,             0.01816,          0.00082303,              0.8326,               0.779,             0.83018,              0.5666,             0.02098,           0.0077555,          0.00033421,            0.005611,            0.005611,            0.005611
                 135,            0.027148,            0.017933,          0.00078201,             0.83595,             0.77508,             0.82836,             0.56674,            0.020975,           0.0077557,           0.0003341,            0.005578,            0.005578,            0.005578
                 136,            0.026894,            0.017904,          0.00082279,              0.8322,             0.77726,             0.82865,             0.56741,            0.020976,           0.0077561,          0.00033307,            0.005545,            0.005545,            0.005545
                 137,            0.027072,            0.017988,          0.00091437,             0.83495,             0.77575,             0.82849,             0.56784,            0.020974,           0.0077538,          0.00033236,            0.005512,            0.005512,            0.005512
                 138,            0.027088,            0.017961,          0.00087019,             0.83401,             0.77713,             0.82879,             0.56814,            0.020974,           0.0077545,          0.00033228,            0.005479,            0.005479,            0.005479
                 139,            0.026977,            0.018042,          0.00079281,             0.83426,              0.7778,             0.82882,             0.56868,            0.020973,           0.0077549,          0.00033348,            0.005446,            0.005446,            0.005446
                 140,            0.026723,            0.017664,          0.00082536,             0.83567,              0.7719,             0.82861,             0.56897,            0.020967,           0.0077536,          0.00033437,            0.005413,            0.005413,            0.005413
                 141,            0.026825,            0.017724,          0.00088475,             0.83643,             0.77275,             0.82824,             0.56903,            0.020966,           0.0077531,          0.00033486,             0.00538,             0.00538,             0.00538
                 142,            0.026913,            0.018016,          0.00088645,             0.83715,              0.7694,             0.82797,             0.56916,            0.020963,           0.0077538,          0.00033523,            0.005347,            0.005347,            0.005347
                 143,            0.026894,              0.0178,          0.00084994,             0.83711,              0.7691,             0.82822,             0.56816,            0.020958,           0.0077528,          0.00033548,            0.005314,            0.005314,            0.005314
                 144,            0.026849,            0.017704,          0.00084932,             0.83496,             0.76842,             0.82646,             0.56797,            0.020957,           0.0077521,          0.00033545,            0.005281,            0.005281,            0.005281
                 145,            0.026662,            0.017486,          0.00084979,              0.8342,             0.77234,             0.82666,             0.56813,            0.020954,            0.007752,          0.00033495,            0.005248,            0.005248,            0.005248
                 146,            0.026691,            0.017577,          0.00080475,             0.83404,             0.77323,             0.82681,             0.56865,            0.020954,           0.0077523,          0.00033589,            0.005215,            0.005215,            0.005215
                 147,            0.026385,            0.017801,          0.00083385,             0.83334,             0.76984,              0.8258,             0.56878,            0.020952,           0.0077511,          0.00033694,            0.005182,            0.005182,            0.005182
                 148,            0.026484,            0.017379,          0.00078799,             0.83377,             0.77313,             0.82608,             0.56868,             0.02095,           0.0077527,          0.00033796,            0.005149,            0.005149,            0.005149
                 149,            0.026195,            0.017595,          0.00073082,             0.83329,             0.77249,             0.82649,             0.56881,            0.020947,           0.0077543,          0.00033888,            0.005116,            0.005116,            0.005116
                 150,            0.026263,            0.017417,          0.00086157,             0.83439,             0.77122,             0.82566,             0.56904,            0.020942,           0.0077562,           0.0003392,            0.005083,            0.005083,            0.005083
                 151,            0.026207,            0.017577,          0.00083374,             0.83543,              0.7687,             0.82588,             0.56959,            0.020939,           0.0077569,          0.00033799,             0.00505,             0.00505,             0.00505
                 152,            0.026358,            0.017272,          0.00075098,             0.83379,             0.77044,              0.8258,             0.56951,            0.020934,           0.0077575,          0.00033648,            0.005017,            0.005017,            0.005017
                 153,            0.026068,            0.017321,          0.00079693,             0.83319,             0.77256,             0.82581,             0.56944,            0.020937,           0.0077596,          0.00033608,            0.004984,            0.004984,            0.004984
                 154,            0.025867,            0.017128,          0.00077199,             0.83066,              0.7754,             0.82697,             0.56981,            0.020932,           0.0077615,          0.00033496,            0.004951,            0.004951,            0.004951
                 155,            0.026235,            0.017322,          0.00072196,             0.82793,             0.77577,             0.82688,             0.57043,            0.020931,            0.007765,          0.00033444,            0.004918,            0.004918,            0.004918
                 156,            0.026253,            0.017353,          0.00074633,              0.8274,             0.77544,             0.82682,             0.57045,            0.020928,           0.0077673,          0.00033435,            0.004885,            0.004885,            0.004885
                 157,             0.02613,            0.017236,          0.00071427,             0.82969,             0.77394,             0.82659,              0.5708,            0.020925,           0.0077694,          0.00033526,            0.004852,            0.004852,            0.004852
                 158,            0.026044,             0.01711,          0.00080869,             0.82724,             0.77478,             0.82637,             0.57072,            0.020924,           0.0077722,          0.00033608,            0.004819,            0.004819,            0.004819
                 159,            0.025808,            0.017105,          0.00084244,              0.8275,              0.7739,             0.82653,             0.57047,            0.020928,            0.007774,          0.00033651,            0.004786,            0.004786,            0.004786
                 160,            0.025898,            0.017097,          0.00079797,             0.83194,             0.77158,             0.82653,              0.5704,            0.020928,           0.0077762,          0.00033725,            0.004753,            0.004753,            0.004753
                 161,            0.026241,            0.017148,          0.00072272,             0.82739,             0.77446,             0.82672,             0.57082,            0.020932,           0.0077797,          0.00033807,             0.00472,             0.00472,             0.00472
                 162,             0.02612,            0.017032,          0.00075318,             0.82596,             0.77315,             0.82713,             0.57046,            0.020937,           0.0077828,           0.0003383,            0.004687,            0.004687,            0.004687
                 163,            0.025775,            0.017071,          0.00079284,             0.82567,             0.77286,             0.82716,             0.57109,            0.020938,           0.0077819,          0.00033858,            0.004654,            0.004654,            0.004654
                 164,            0.025488,            0.017026,           0.0007773,             0.83126,             0.77237,             0.82752,             0.57074,            0.020937,           0.0077812,          0.00033861,            0.004621,            0.004621,            0.004621
                 165,            0.025525,            0.017083,          0.00078537,             0.82675,             0.77374,             0.82754,              0.5716,            0.020938,           0.0077819,          0.00033807,            0.004588,            0.004588,            0.004588
                 166,            0.025018,            0.016731,          0.00076378,             0.83064,              0.7722,             0.82773,              0.5721,            0.020938,           0.0077828,          0.00033689,            0.004555,            0.004555,            0.004555
                 167,            0.025715,            0.016901,          0.00071201,             0.82299,             0.78003,             0.82703,             0.57221,            0.020941,           0.0077823,          0.00033624,            0.004522,            0.004522,            0.004522
                 168,            0.025456,            0.016814,          0.00070068,             0.82072,             0.78008,             0.82716,             0.57231,             0.02094,           0.0077843,          0.00033537,            0.004489,            0.004489,            0.004489
                 169,            0.025246,            0.016857,          0.00078465,             0.83782,             0.76709,              0.8269,             0.57217,            0.020938,            0.007786,          0.00033459,            0.004456,            0.004456,            0.004456
                 170,            0.025324,            0.016887,          0.00074256,             0.83057,             0.77146,             0.82671,             0.57211,            0.020937,           0.0077878,          0.00033368,            0.004423,            0.004423,            0.004423
                 171,            0.025215,            0.016736,          0.00074142,             0.82909,             0.77307,             0.82693,             0.57206,            0.020938,           0.0077904,          0.00033283,             0.00439,             0.00439,             0.00439
                 172,            0.025518,            0.016933,          0.00068035,             0.81044,             0.78554,             0.82711,             0.57295,            0.020936,           0.0077918,          0.00033213,            0.004357,            0.004357,            0.004357
                 173,            0.025318,            0.016808,          0.00073881,             0.81232,              0.7856,             0.82737,             0.57335,            0.020937,           0.0077947,          0.00033132,            0.004324,            0.004324,            0.004324
                 174,            0.025418,            0.016754,          0.00069267,             0.81508,             0.78185,             0.82711,             0.57337,            0.020942,           0.0077959,          0.00033016,            0.004291,            0.004291,            0.004291
                 175,            0.025116,            0.016588,          0.00064586,             0.81706,             0.78286,             0.82816,             0.57359,            0.020946,           0.0077982,          0.00032985,            0.004258,            0.004258,            0.004258
                 176,             0.02507,            0.016584,          0.00068427,             0.81586,              0.7831,             0.82726,             0.57376,            0.020949,           0.0077988,           0.0003289,            0.004225,            0.004225,            0.004225
                 177,            0.024776,            0.016638,          0.00065353,             0.81337,             0.78468,             0.82769,             0.57411,             0.02095,            0.007798,          0.00032855,            0.004192,            0.004192,            0.004192
                 178,            0.024562,            0.016407,          0.00067146,             0.81324,             0.78488,             0.82746,             0.57384,            0.020947,           0.0078004,          0.00032837,            0.004159,            0.004159,            0.004159
                 179,            0.024213,            0.016196,          0.00074251,             0.81143,             0.78573,             0.82713,               0.574,            0.020943,           0.0078004,          0.00032757,            0.004126,            0.004126,            0.004126
                 180,            0.024642,            0.016319,          0.00063986,             0.83644,              0.7684,             0.82913,             0.57465,            0.020938,           0.0078002,          0.00032704,            0.004093,            0.004093,            0.004093
                 181,            0.024592,            0.016439,          0.00069755,             0.83749,             0.76888,             0.82934,               0.574,            0.020941,           0.0078034,          0.00032725,             0.00406,             0.00406,             0.00406
                 182,            0.024494,            0.016337,          0.00063416,             0.84113,             0.76407,             0.82871,             0.57513,            0.020938,           0.0078047,          0.00032764,            0.004027,            0.004027,            0.004027
                 183,            0.024601,            0.016194,          0.00071626,             0.84049,             0.76393,             0.82881,             0.57507,            0.020929,           0.0078049,           0.0003266,            0.003994,            0.003994,            0.003994
                 184,            0.024631,            0.016245,           0.0007802,             0.84463,             0.76364,             0.82928,             0.57544,            0.020924,           0.0078057,          0.00032591,            0.003961,            0.003961,            0.003961
                 185,            0.024815,            0.016398,          0.00066847,             0.83926,             0.76689,             0.82856,             0.57511,            0.020917,           0.0078089,          0.00032531,            0.003928,            0.003928,            0.003928
                 186,            0.024342,            0.016335,          0.00062528,             0.84481,             0.76328,             0.82848,             0.57504,             0.02092,           0.0078124,          0.00032464,            0.003895,            0.003895,            0.003895
                 187,            0.024357,            0.016117,          0.00065428,             0.83839,             0.77072,             0.82968,             0.57558,            0.020923,           0.0078147,          0.00032354,            0.003862,            0.003862,            0.003862
                 188,            0.024148,              0.0161,          0.00071772,             0.83724,             0.77065,             0.82945,             0.57573,            0.020928,            0.007817,           0.0003228,            0.003829,            0.003829,            0.003829
                 189,            0.024272,            0.015941,          0.00063869,              0.8368,             0.77124,              0.8287,             0.57569,            0.020923,             0.00782,          0.00032175,            0.003796,            0.003796,            0.003796
                 190,            0.024635,            0.015997,          0.00056665,             0.83964,             0.77035,             0.82904,             0.57541,            0.020917,           0.0078242,          0.00032109,            0.003763,            0.003763,            0.003763
                 191,            0.024081,            0.015879,          0.00058933,             0.83594,             0.77153,             0.82901,              0.5754,             0.02091,           0.0078266,          0.00032014,             0.00373,             0.00373,             0.00373
                 192,            0.024273,            0.016016,          0.00063178,             0.83773,             0.77105,             0.82893,             0.57599,            0.020907,           0.0078302,          0.00031967,            0.003697,            0.003697,            0.003697
                 193,            0.023985,            0.015859,          0.00063582,             0.84551,             0.76926,             0.82874,             0.57617,            0.020905,           0.0078352,           0.0003192,            0.003664,            0.003664,            0.003664
                 194,            0.023525,            0.015617,          0.00064832,              0.8471,             0.76769,             0.82873,             0.57657,            0.020904,           0.0078375,          0.00031908,            0.003631,            0.003631,            0.003631
                 195,            0.023872,            0.015646,          0.00071961,             0.84702,             0.76601,              0.8287,             0.57651,            0.020901,           0.0078395,          0.00031905,            0.003598,            0.003598,            0.003598
                 196,            0.024104,            0.015669,          0.00060668,               0.848,             0.76559,             0.82893,             0.57723,            0.020898,           0.0078413,          0.00031899,            0.003565,            0.003565,            0.003565
                 197,            0.023761,            0.015588,          0.00059087,             0.84579,             0.76498,             0.82882,             0.57678,            0.020897,           0.0078428,            0.000319,            0.003532,            0.003532,            0.003532
                 198,            0.023661,            0.015641,          0.00058823,             0.84752,             0.76597,             0.82868,             0.57678,              0.0209,           0.0078445,          0.00031909,            0.003499,            0.003499,            0.003499
                 199,            0.024046,            0.015547,          0.00057473,             0.84887,             0.76685,             0.82872,             0.57729,            0.020898,           0.0078477,          0.00031881,            0.003466,            0.003466,            0.003466
                 200,            0.023661,            0.015433,          0.00065018,             0.84987,             0.76719,             0.82921,             0.57692,            0.020898,           0.0078495,          0.00031842,            0.003433,            0.003433,            0.003433
                 201,            0.023627,            0.015469,          0.00058204,             0.84769,             0.76816,             0.82927,             0.57704,            0.020903,           0.0078509,          0.00031855,              0.0034,              0.0034,              0.0034
                 202,            0.023446,            0.015681,          0.00058193,              0.8406,             0.77455,              0.8294,             0.57675,             0.02091,           0.0078528,          0.00031918,            0.003367,            0.003367,            0.003367
                 203,            0.023563,            0.015534,          0.00062298,             0.84181,             0.77486,             0.82933,             0.57644,             0.02091,           0.0078554,          0.00031968,            0.003334,            0.003334,            0.003334
                 204,            0.023081,            0.015458,           0.0005448,             0.84136,              0.7763,             0.82914,              0.5767,            0.020913,           0.0078557,          0.00031982,            0.003301,            0.003301,            0.003301
                 205,            0.023156,            0.015355,          0.00066299,             0.84145,             0.77381,             0.82878,             0.57619,            0.020915,           0.0078597,          0.00031972,            0.003268,            0.003268,            0.003268
                 206,            0.023036,            0.015357,          0.00061948,             0.83915,             0.77706,             0.82861,              0.5765,            0.020921,           0.0078616,          0.00032023,            0.003235,            0.003235,            0.003235
                 207,            0.023394,            0.015079,          0.00052886,             0.83733,             0.77912,             0.82924,             0.57649,             0.02092,           0.0078656,          0.00032079,            0.003202,            0.003202,            0.003202
                 208,            0.022944,            0.015352,          0.00058868,             0.83584,              0.7784,             0.82812,              0.5763,             0.02092,           0.0078698,          0.00032099,            0.003169,            0.003169,            0.003169
                 209,            0.023106,            0.015223,          0.00055552,             0.83666,             0.77891,             0.82805,             0.57676,            0.020926,           0.0078752,          0.00032185,            0.003136,            0.003136,            0.003136
                 210,            0.022935,             0.01529,          0.00053848,             0.83885,             0.77934,             0.82944,             0.57682,            0.020928,             0.00788,          0.00032268,            0.003103,            0.003103,            0.003103
                 211,            0.023252,            0.015297,          0.00057157,             0.84102,             0.77708,             0.82944,             0.57707,            0.020933,           0.0078842,          0.00032355,             0.00307,             0.00307,             0.00307
                 212,            0.023166,            0.015098,          0.00059809,             0.83772,             0.77509,             0.82819,             0.57712,             0.02094,           0.0078897,          0.00032422,            0.003037,            0.003037,            0.003037
                 213,            0.023219,            0.014896,          0.00053734,             0.83766,             0.77912,             0.82932,             0.57731,            0.020947,           0.0078919,          0.00032452,            0.003004,            0.003004,            0.003004
                 214,            0.022822,            0.015191,          0.00067644,             0.83558,             0.77875,              0.8284,             0.57678,            0.020949,           0.0078972,          0.00032538,            0.002971,            0.002971,            0.002971
                 215,            0.022682,            0.015067,          0.00059386,             0.83456,             0.77873,             0.82855,             0.57699,            0.020952,           0.0079019,          0.00032619,            0.002938,            0.002938,            0.002938
                 216,            0.022504,            0.014833,          0.00052493,             0.83246,             0.78015,             0.82817,             0.57748,            0.020953,           0.0079055,          0.00032676,            0.002905,            0.002905,            0.002905
                 217,             0.02267,            0.014904,           0.0005709,             0.82077,             0.78607,             0.82817,             0.57746,            0.020955,           0.0079106,          0.00032805,            0.002872,            0.002872,            0.002872
                 218,            0.022211,            0.015075,          0.00055491,             0.82016,             0.78831,             0.82818,             0.57768,            0.020959,           0.0079159,          0.00032853,            0.002839,            0.002839,            0.002839
                 219,            0.022256,            0.014888,          0.00053939,              0.8188,             0.79066,             0.82944,             0.57811,            0.020967,           0.0079231,           0.0003286,            0.002806,            0.002806,            0.002806
                 220,            0.022632,            0.014628,          0.00049924,             0.81711,             0.79232,             0.82791,             0.57775,            0.020971,           0.0079283,          0.00032823,            0.002773,            0.002773,            0.002773
                 221,            0.022281,            0.014852,          0.00051061,             0.81543,             0.79245,             0.82819,             0.57807,            0.020967,           0.0079334,          0.00032742,             0.00274,             0.00274,             0.00274
                 222,            0.022371,             0.01487,          0.00049525,             0.81677,             0.79386,             0.82874,             0.57855,            0.020966,           0.0079388,          0.00032683,            0.002707,            0.002707,            0.002707
                 223,            0.022383,            0.014856,          0.00054055,             0.81621,              0.7929,              0.8285,              0.5786,            0.020965,           0.0079426,          0.00032676,            0.002674,            0.002674,            0.002674
                 224,            0.022282,            0.014731,          0.00047486,             0.81861,             0.79319,             0.82869,              0.5784,            0.020965,           0.0079474,           0.0003261,            0.002641,            0.002641,            0.002641
                 225,            0.022118,            0.014481,          0.00064804,             0.81926,              0.7949,             0.82889,             0.57869,            0.020964,           0.0079527,          0.00032606,            0.002608,            0.002608,            0.002608
                 226,            0.021997,             0.01466,          0.00049588,             0.81286,             0.79658,             0.82803,             0.57851,             0.02096,           0.0079577,          0.00032507,            0.002575,            0.002575,            0.002575
                 227,            0.022099,             0.01456,          0.00053421,             0.81397,             0.79658,             0.82868,             0.57858,            0.020958,           0.0079625,          0.00032437,            0.002542,            0.002542,            0.002542
                 228,            0.022026,            0.014634,          0.00049785,             0.81416,             0.79658,             0.82789,             0.57881,            0.020956,           0.0079674,          0.00032435,            0.002509,            0.002509,            0.002509
                 229,            0.021815,            0.014326,          0.00044882,             0.81689,             0.79562,             0.82745,             0.57822,            0.020953,           0.0079711,          0.00032462,            0.002476,            0.002476,            0.002476
                 230,            0.022065,            0.014333,          0.00054532,             0.87149,             0.75202,             0.82752,             0.57856,            0.020951,            0.007978,            0.000325,            0.002443,            0.002443,            0.002443
                 231,            0.021791,            0.014299,          0.00048068,             0.86944,             0.75175,             0.82753,             0.57878,            0.020957,           0.0079838,          0.00032528,             0.00241,             0.00241,             0.00241
                 232,            0.021918,             0.01438,           0.0004783,             0.87215,             0.75238,              0.8284,             0.57888,            0.020959,           0.0079908,          0.00032594,            0.002377,            0.002377,            0.002377
                 233,            0.021608,            0.014253,           0.0004534,             0.87353,             0.75149,             0.82809,             0.57817,            0.020961,           0.0079975,          0.00032582,            0.002344,            0.002344,            0.002344
                 234,            0.021723,            0.014091,          0.00046718,             0.87354,              0.7522,             0.82818,              0.5785,            0.020961,           0.0080054,          0.00032564,            0.002311,            0.002311,            0.002311
                 235,            0.021195,            0.014052,          0.00059925,             0.87363,             0.75267,              0.8286,             0.57824,            0.020964,           0.0080131,          0.00032568,            0.002278,            0.002278,            0.002278
                 236,            0.021001,            0.013921,          0.00050448,              0.8747,             0.75313,             0.82834,             0.57849,            0.020968,           0.0080213,          0.00032584,            0.002245,            0.002245,            0.002245
                 237,            0.021331,            0.013955,          0.00051474,             0.87384,             0.75385,             0.82769,             0.57837,            0.020967,           0.0080282,          0.00032577,            0.002212,            0.002212,            0.002212
                 238,            0.021403,            0.013978,          0.00047278,             0.87308,             0.75539,             0.82781,             0.57823,            0.020966,           0.0080363,          0.00032564,            0.002179,            0.002179,            0.002179
                 239,            0.021333,            0.013926,           0.0004265,             0.87279,             0.75565,             0.82758,             0.57759,            0.020968,           0.0080433,          0.00032502,            0.002146,            0.002146,            0.002146
                 240,            0.020823,            0.013677,          0.00051116,             0.87086,             0.75658,             0.82774,              0.5776,            0.020968,           0.0080501,          0.00032519,            0.002113,            0.002113,            0.002113
                 241,            0.021324,            0.013971,          0.00049003,             0.87171,             0.75569,             0.82719,             0.57756,            0.020966,            0.008056,           0.0003248,             0.00208,             0.00208,             0.00208
                 242,            0.021223,            0.013877,          0.00047083,             0.87229,             0.75585,             0.82736,             0.57743,            0.020971,           0.0080637,          0.00032472,            0.002047,            0.002047,            0.002047
                 243,            0.020994,             0.01377,          0.00046899,             0.87322,             0.75576,             0.82704,             0.57755,            0.020971,           0.0080734,          0.00032483,            0.002014,            0.002014,            0.002014
                 244,            0.020848,            0.013649,          0.00047804,             0.86449,              0.7652,             0.82778,             0.57738,            0.020974,           0.0080828,          0.00032541,            0.001981,            0.001981,            0.001981
                 245,            0.020878,            0.013682,            0.000414,             0.86407,              0.7656,             0.82789,             0.57712,            0.020975,           0.0080913,          0.00032549,            0.001948,            0.001948,            0.001948
                 246,            0.021072,            0.013586,          0.00048337,             0.86457,             0.76561,             0.82783,              0.5772,            0.020975,           0.0081001,          0.00032547,            0.001915,            0.001915,            0.001915
                 247,            0.020535,            0.013542,          0.00045366,             0.87344,             0.75709,             0.82643,             0.57661,             0.02097,           0.0081086,          0.00032574,            0.001882,            0.001882,            0.001882
                 248,            0.020455,            0.013469,          0.00046527,             0.87141,             0.75586,             0.82533,             0.57674,            0.020966,           0.0081165,          0.00032626,            0.001849,            0.001849,            0.001849
                 249,            0.020757,            0.013508,          0.00046481,              0.8719,             0.75632,             0.82526,             0.57634,            0.020968,           0.0081252,          0.00032656,            0.001816,            0.001816,            0.001816
                 250,            0.020438,            0.013332,          0.00040621,             0.87043,             0.75938,             0.82546,             0.57613,            0.020974,           0.0081339,          0.00032688,            0.001783,            0.001783,            0.001783
                 251,            0.020543,            0.013211,          0.00041528,             0.86818,             0.76006,             0.82553,             0.57628,            0.020973,           0.0081433,          0.00032744,             0.00175,             0.00175,             0.00175
                 252,            0.020462,            0.013484,          0.00045534,             0.86763,              0.7601,             0.82574,             0.57609,            0.020973,           0.0081528,          0.00032763,            0.001717,            0.001717,            0.001717
                 253,            0.020582,            0.013434,          0.00042764,             0.87357,             0.75711,             0.82548,             0.57598,            0.020975,           0.0081612,          0.00032705,            0.001684,            0.001684,            0.001684
                 254,            0.020115,             0.01331,           0.0003895,             0.87089,               0.758,             0.82492,             0.57636,            0.020979,           0.0081711,          0.00032682,            0.001651,            0.001651,            0.001651
                 255,            0.020147,            0.013216,          0.00040286,             0.87168,             0.76002,             0.82623,             0.57673,            0.020986,           0.0081809,          0.00032703,            0.001618,            0.001618,            0.001618
                 256,            0.019908,            0.012944,           0.0003901,             0.87203,             0.75965,             0.82668,              0.5766,            0.020987,           0.0081912,          0.00032744,            0.001585,            0.001585,            0.001585
                 257,             0.01995,            0.012977,          0.00040615,             0.86997,             0.75681,             0.82517,             0.57626,             0.02099,           0.0082013,          0.00032707,            0.001552,            0.001552,            0.001552
                 258,            0.019744,            0.013139,          0.00036812,             0.86947,             0.75901,             0.82715,             0.57673,            0.020988,           0.0082109,           0.0003263,            0.001519,            0.001519,            0.001519
                 259,            0.019791,            0.013134,          0.00032385,             0.87032,             0.75676,             0.82669,             0.57612,            0.020991,           0.0082215,          0.00032572,            0.001486,            0.001486,            0.001486
                 260,            0.019813,            0.013082,          0.00040117,             0.87054,             0.75672,             0.82664,             0.57578,            0.020993,           0.0082297,          0.00032512,            0.001453,            0.001453,            0.001453
                 261,            0.020166,            0.013158,          0.00046759,             0.87164,             0.75521,             0.82652,             0.57591,            0.020992,           0.0082393,          0.00032507,             0.00142,             0.00142,             0.00142
                 262,             0.01976,            0.012902,          0.00039623,             0.87173,             0.75566,             0.82669,             0.57658,            0.020997,           0.0082458,          0.00032433,            0.001387,            0.001387,            0.001387
                 263,            0.019794,             0.01281,          0.00041201,             0.87081,             0.76026,             0.82688,             0.57618,               0.021,           0.0082536,          0.00032354,            0.001354,            0.001354,            0.001354
                 264,            0.019539,            0.012854,          0.00035823,             0.87145,             0.75376,             0.82699,             0.57602,            0.021003,           0.0082622,          0.00032306,            0.001321,            0.001321,            0.001321
                 265,            0.019519,            0.012643,          0.00039306,             0.87235,             0.75324,             0.82684,             0.57599,            0.021005,           0.0082708,          0.00032281,            0.001288,            0.001288,            0.001288
                 266,            0.019207,            0.012752,          0.00041213,             0.87258,              0.7534,             0.82675,             0.57582,             0.02101,           0.0082799,          0.00032267,            0.001255,            0.001255,            0.001255
                 267,            0.019419,            0.012666,          0.00036287,             0.87482,              0.7543,             0.82698,             0.57606,            0.021015,           0.0082886,          0.00032247,            0.001222,            0.001222,            0.001222
                 268,            0.019317,              0.0128,          0.00040531,              0.8748,             0.75421,             0.82676,             0.57553,            0.021017,           0.0082976,          0.00032185,            0.001189,            0.001189,            0.001189
                 269,            0.019149,            0.012707,          0.00032834,             0.87382,             0.75432,             0.82677,             0.57551,            0.021023,           0.0083085,          0.00032184,            0.001156,            0.001156,            0.001156
                 270,            0.019187,            0.012669,          0.00034914,             0.87416,             0.75496,             0.82667,             0.57513,            0.021029,           0.0083187,          0.00032185,            0.001123,            0.001123,            0.001123
                 271,            0.019078,            0.012501,          0.00036871,             0.87177,              0.7552,             0.82655,             0.57552,            0.021036,            0.008329,           0.0003218,             0.00109,             0.00109,             0.00109
                 272,             0.01886,            0.012323,           0.0003796,             0.87165,             0.75521,             0.82662,             0.57591,            0.021043,           0.0083403,          0.00032135,            0.001057,            0.001057,            0.001057
                 273,            0.018831,            0.012426,          0.00031771,             0.86993,             0.75648,             0.82759,             0.57573,             0.02105,           0.0083487,          0.00032125,            0.001024,            0.001024,            0.001024
                 274,            0.018767,            0.012342,          0.00032593,             0.86598,             0.76282,             0.82715,              0.5758,            0.021051,           0.0083586,          0.00032113,            0.000991,            0.000991,            0.000991
                 275,            0.018786,            0.012156,          0.00034066,             0.86429,             0.76215,             0.82738,             0.57635,            0.021056,           0.0083694,          0.00032148,            0.000958,            0.000958,            0.000958
                 276,             0.01857,            0.012307,          0.00031042,             0.86016,             0.76159,             0.82643,             0.57713,            0.021058,           0.0083787,          0.00032174,            0.000925,            0.000925,            0.000925
                 277,            0.018458,            0.012243,          0.00031847,             0.85938,             0.76284,             0.82624,             0.57698,            0.021061,           0.0083891,           0.0003218,            0.000892,            0.000892,            0.000892
                 278,            0.018682,            0.012159,          0.00038123,             0.86335,             0.76164,             0.82671,             0.57706,            0.021066,           0.0083997,          0.00032176,            0.000859,            0.000859,            0.000859
                 279,            0.018462,            0.012258,          0.00031204,             0.86788,             0.76225,             0.82672,             0.57686,            0.021073,           0.0084103,          0.00032161,            0.000826,            0.000826,            0.000826
                 280,            0.018356,            0.012084,          0.00033391,             0.86682,             0.76173,               0.827,             0.57744,            0.021075,            0.008422,          0.00032156,            0.000793,            0.000793,            0.000793
                 281,             0.01808,            0.012031,          0.00030421,             0.86635,             0.76402,             0.82835,             0.57791,            0.021077,           0.0084323,          0.00032084,             0.00076,             0.00076,             0.00076
                 282,            0.018374,            0.011828,          0.00036895,              0.8669,             0.76343,              0.8279,              0.5775,             0.02108,           0.0084431,          0.00032075,            0.000727,            0.000727,            0.000727
                 283,            0.018237,            0.012026,          0.00029543,             0.86696,             0.76363,             0.82796,               0.578,            0.021084,           0.0084545,          0.00032053,            0.000694,            0.000694,            0.000694
                 284,            0.018311,            0.011929,          0.00033079,             0.86721,             0.76512,             0.82781,             0.57784,            0.021088,           0.0084655,          0.00032054,            0.000661,            0.000661,            0.000661
                 285,            0.018085,            0.011731,          0.00031012,             0.86972,             0.75795,             0.82731,             0.57788,            0.021097,           0.0084778,          0.00032052,            0.000628,            0.000628,            0.000628
                 286,            0.018397,            0.011974,          0.00027921,             0.87045,             0.75804,             0.82762,             0.57786,              0.0211,           0.0084893,          0.00032047,            0.000595,            0.000595,            0.000595
                 287,            0.018049,            0.011764,          0.00031015,             0.87062,             0.75812,             0.82754,             0.57763,            0.021105,           0.0085009,          0.00032106,            0.000562,            0.000562,            0.000562
                 288,            0.017922,            0.011606,          0.00028064,             0.86744,             0.75911,             0.82736,             0.57756,            0.021108,           0.0085135,          0.00032094,            0.000529,            0.000529,            0.000529
                 289,            0.017835,            0.011559,          0.00028789,             0.86389,             0.76532,             0.82686,             0.57781,            0.021112,           0.0085249,          0.00032089,            0.000496,            0.000496,            0.000496
                 290,            0.017755,            0.011461,          0.00028535,             0.86551,               0.763,             0.82676,              0.5774,            0.021114,           0.0085368,          0.00032071,            0.000463,            0.000463,            0.000463
                 291,            0.017704,            0.011715,          0.00030284,              0.8608,             0.76549,             0.82664,             0.57745,            0.021119,           0.0085484,          0.00032063,             0.00043,             0.00043,             0.00043
                 292,            0.017793,             0.01157,          0.00031685,             0.86079,             0.76551,             0.82744,             0.57766,            0.021121,           0.0085605,          0.00032027,            0.000397,            0.000397,            0.000397
                 293,            0.017477,            0.011523,          0.00028151,             0.86101,             0.76771,             0.82743,             0.57808,            0.021125,           0.0085726,          0.00031978,            0.000364,            0.000364,            0.000364
                 294,            0.017662,            0.011559,          0.00029287,             0.85983,             0.76648,             0.82623,             0.57788,            0.021133,           0.0085863,          0.00031963,            0.000331,            0.000331,            0.000331
                 295,            0.017419,            0.011474,          0.00031392,             0.85969,             0.76608,             0.82621,              0.5775,            0.021136,           0.0085984,           0.0003194,            0.000298,            0.000298,            0.000298
                 296,            0.017264,            0.011491,            0.000318,             0.85913,             0.76525,             0.82636,             0.57739,            0.021146,           0.0086102,          0.00031961,            0.000265,            0.000265,            0.000265
                 297,            0.017746,            0.011308,          0.00030798,             0.85812,             0.76503,             0.82604,             0.57736,            0.021154,           0.0086231,          0.00031979,            0.000232,            0.000232,            0.000232
                 298,            0.017222,             0.01119,          0.00029855,             0.85808,             0.76489,               0.826,             0.57752,            0.021161,           0.0086352,           0.0003197,            0.000199,            0.000199,            0.000199
                 299,            0.017333,            0.011221,          0.00025267,             0.85852,             0.76748,             0.82624,             0.57763,            0.021168,           0.0086497,          0.00031945,            0.000166,            0.000166,            0.000166
