1 0.466516 0.632436 0.206813 0.612225
1 0.363516 0.615293 0.1215 0.553302
1 0.776117 0.409297 0.0362969 0.15644
1 0.740437 0.494555 0.0376875 0.0623185
1 0.668344 0.491066 0.03875 0.0621311
1 0.917422 0.485457 0.0317188 0.0579391
1 0.952727 0.480059 0.0384844 0.071733
1 0.63125 0.484649 0.04375 0.0623653
1 0.733969 0.390269 0.018125 0.0311241
1 0.523953 0.479438 0.0295312 0.0502576
1 0.704555 0.488419 0.0390156 0.0700468
1 0.291312 0.44219 0.0404375 0.101241
1 0.984711 0.498033 0.0305781 0.0587354
