0 0.501523 0.718542 0.403672 0.281125
1 0.362938 0.414562 0.0145937 0.0512083
1 0.436742 0.485927 0.0211719 0.0638542
1 0.480617 0.485625 0.0200469 0.0605833
1 0.592797 0.616542 0.0199375 0.0680417
1 0.655922 0.397792 0.015875 0.0517083
1 0.691617 0.350479 0.0192344 0.047625
1 0.235242 0.481365 0.0200156 0.0679375
1 0.40782 0.610854 0.0216094 0.0342083
1 0.446648 0.261635 0.0133906 0.0404792
1 0.341062 0.303563 0.010125 0.0300833
