1 0.478773 0.505461 0.0606406 0.221347
1 0.63957 0.512232 0.0700469 0.222818
1 0.605031 0.50086 0.0619062 0.211945
1 0.151734 0.484289 0.0333437 0.11611
1 0.120211 0.472544 0.0250781 0.101746
1 0.671328 0.50116 0.0316563 0.198778
1 0.518375 0.501372 0.063125 0.194514
1 0.336383 0.453641 0.0158594 0.0407481
1 0.345008 0.447132 0.00942187 0.0347631
1 0.941328 0.457955 0.0174375 0.0777057
