1 0.414523 0.269177 0.0487031 0.159396
1 0.321547 0.255667 0.03075 0.112583
1 0.125641 0.219979 0.0135937 0.0398333
1 0.0988437 0.200594 0.0140625 0.0432708
1 0.151289 0.23501 0.0248594 0.0721875
1 0.580047 0.227646 0.0134062 0.034625
1 0.517992 0.218062 0.00829687 0.0333333
1 0.481687 0.216958 0.00634375 0.0345833
1 0.546258 0.217729 0.00392188 0.0303333
1 0.862945 0.232625 0.0143594 0.02825
