1 0.251539 0.403012 0.126016 0.333506
1 0.724117 0.385612 0.0994219 0.313294
1 0.924398 0.231106 0.0321406 0.0861176
1 0.49275 0.369388 0.013 0.0391529
1 0.470375 0.365824 0.0314063 0.0384706
1 0.57857 0.260576 0.00751562 0.006
1 0.823625 0.245153 0.00728125 0.00870588
