1 0.327891 0.51161 0.073375 0.381854
1 0.363414 0.504098 0.0484844 0.324585
1 0.800062 0.495951 0.039625 0.235317
1 0.402766 0.504378 0.04475 0.270951
1 0.42818 0.514976 0.0334844 0.231512
1 0.244516 0.522061 0.0723437 0.343341
1 0.202234 0.554293 0.0925625 0.408341
1 0.145406 0.608537 0.0850625 0.384341
1 0.952008 0.510244 0.0959844 0.587951
1 0.275398 0.519451 0.0629531 0.304902
1 0.838609 0.500805 0.0791875 0.250439
1 0.0856563 0.548317 0.0849375 0.561805
1 0.170555 0.401768 0.0397656 0.104317
