1 0.418336 0.738635 0.0445781 0.134146
1 0.462758 0.748927 0.0255469 0.112812
1 0.951687 0.761792 0.096625 0.305625
1 0.545055 0.74174 0.0401406 0.139729
1 0.49475 0.743833 0.0366563 0.123417
1 0.715797 0.749458 0.0565625 0.179333
1 0.382984 0.746823 0.02 0.107229
1 0.667445 0.708917 0.0310469 0.10625
1 0.645945 0.743229 0.0601719 0.201625
1 0.586078 0.745333 0.0354375 0.139458
1 0.278656 0.70951 0.0251875 0.0319792
1 0.107469 0.757833 0.014875 0.0544167
1 0.400188 0.739979 0.0204688 0.105083
