1 0.823513 0.539102 0.212178 0.519109
1 0.641148 0.595375 0.395831 0.641094
1 0.364578 0.560812 0.256557 0.720719
1 0.214005 0.29675 0.159251 0.116219
1 0.0690515 0.545508 0.138103 0.617984
1 0.61082 0.281359 0.19082 0.175844
1 0.072541 0.358172 0.0906089 0.119219
1 0.967494 0.333203 0.0650117 0.087
1 0.183443 0.458336 0.112787 0.0349531
