1 0.407328 0.752105 0.160281 0.310069
1 0.757781 0.789474 0.122406 0.278215
1 0.301461 0.56595 0.0436094 0.155515
1 0.0402891 0.544256 0.0377969 0.139085
1 0.901758 0.519657 0.0301719 0.0491076
1 0.914852 0.49873 0.0198281 0.0477574
1 0.56482 0.543661 0.0224844 0.0356979
1 0.11043 0.362986 0.0141094 0.0273455
1 0.330664 0.427048 0.0140781 0.0256293
1 0.846844 0.526579 0.0282813 0.0467048
1 0.651797 0.806728 0.152781 0.204989
1 0.252852 0.494497 0.0179531 0.0422197
