1 0.0574063 0.667646 0.0695313 0.328923
1 0.11993 0.613501 0.0528594 0.265082
1 0.157469 0.625492 0.076125 0.315433
1 0.0177187 0.657049 0.0354375 0.337002
1 0.216422 0.629965 0.0447813 0.279649
1 0.306711 0.392939 0.101609 0.245222
1 0.191211 0.617822 0.0384531 0.274005
