1 0.499583 0.465234 0.725177 0.690875
1 0.637386 0.419102 0.214268 0.235953
1 0.854407 0.458539 0.233965 0.291484
1 0.689773 0.577703 0.207475 0.204969
1 0.0928283 0.571602 0.157828 0.124266
1 0.240265 0.580516 0.186389 0.185125
1 0.380732 0.613047 0.0812626 0.0930312
1 0.948902 0.538383 0.0696717 0.0908906
