1 0.68597 0.738434 0.1327 0.35494
1 0.61389 0.754337 0.05006 0.174759
1 0.13652 0.765361 0.01936 0.088494
1 0.85056 0.73387 0.0278 0.0688253
1 0.86538 0.726009 0.01556 0.0441867
1 0.9488 0.732304 0.02216 0.0632229
1 0.99046 0.730151 0.01752 0.0707831
1 0.38043 0.754458 0.00918 0.0283735
1 0.01343 0.845286 0.02686 0.0802108
