1 0.586711 0.779188 0.215891 0.441625
1 0.160477 0.739969 0.146203 0.264229
1 0.223203 0.636302 0.040375 0.166479
1 0.894383 0.78876 0.211234 0.382021
1 0.786156 0.775333 0.166469 0.443958
1 0.841703 0.636615 0.0648438 0.186104
1 0.891359 0.588854 0.0486562 0.0853333
1 0.713336 0.631792 0.0329531 0.0753333
1 0.674602 0.801083 0.131734 0.397833
1 0.635477 0.582229 0.0260781 0.0455417
1 0.804594 0.593948 0.0438438 0.0890625
1 0.82257 0.579896 0.0246094 0.0397917
1 0.946195 0.571875 0.0687344 0.0543333
