0 0.46640625 0.1625 0.33203125 0.30078125
0 0.7828125 0.3421875 0.428125 0.684375
0 0.2640625 0.43046875 0.521875 0.728125
0 0.87734375 0.4015625 0.240625 0.803125
0 0.15390625 0.58671875 0.3078125 0.821875
0 0.3453125 0.6578125 0.4203125 0.678125
0 0.6265625 0.5640625 0.540625 0.86796875