0 0.43515625 0.7640625 0.64453125 0.46640625
0 0.50625 0.3640625 0.353125 0.30546875
0 0.5203125 0.17421875 0.56484375 0.3484375
0 0.334375 0.41796875 0.5265625 0.55546875
0 0.16484375 0.5984375 0.3296875 0.625