1 0.607096 0.936477 0.0145667 0.0290156
1 0.570644 0.939891 0.028267 0.0377188
1 0.39041 0.945555 0.0240047 0.0381406
1 0.359813 0.944492 0.0193443 0.0361406
1 0.288724 0.948961 0.0278454 0.0354844
1 0.582026 0.931766 0.0116393 0.0268125
1 0.413993 0.928211 0.0144496 0.0248281
1 0.0604098 0.951445 0.0241452 0.0388281
1 0.534075 0.941273 0.0184075 0.0408906
1 0.31877 0.946531 0.0255035 0.0405313
1 0.427283 0.949867 0.0248712 0.0336406
1 0.178056 0.94775 0.0228571 0.039375
1 0.503068 0.94475 0.0240749 0.0369063
