1 0.320844 0.564497 0.0377188 0.107593
1 0.475477 0.539179 0.0487656 0.106368
1 0.353687 0.573611 0.0351875 0.101575
1 0.582062 0.924551 0.0542813 0.128271
1 0.867836 0.869705 0.0624219 0.119672
1 0.505219 0.548775 0.0267188 0.111641
1 0.286438 0.527429 0.022125 0.0301751
1 0.128109 0.495547 0.0231562 0.0488621
1 0.381656 0.574847 0.0144063 0.0810284
1 0.371453 0.552932 0.0136875 0.0804814
1 0.616906 0.920689 0.033375 0.12895
