1 0.349695 0.674687 0.276797 0.331083
1 0.733148 0.588771 0.286516 0.462917
1 0.488406 0.264219 0.131219 0.358771
1 0.308695 0.272531 0.119891 0.343854
1 0.60218 0.271375 0.156484 0.328458
1 0.184844 0.244042 0.117094 0.384125
1 0.0598203 0.291115 0.119328 0.383063
1 0.142133 0.605229 0.177484 0.457875
