1 0.54733 0.511242 0.784778 0.761797
1 0.832482 0.349922 0.111429 0.145875
1 0.703888 0.286766 0.0334426 0.0529687
1 0.982845 0.354945 0.0343091 0.159859
1 0.165152 0.307906 0.0984543 0.150125
1 0.254356 0.330805 0.0781733 0.106891
1 0.772998 0.321352 0.070726 0.107859
1 0.0687471 0.307133 0.0847541 0.152953
1 0.322108 0.312328 0.0826698 0.163469
1 0.0264637 0.312562 0.0529274 0.0969688
