1 0.111047 0.552915 0.0317188 0.115645
1 0.629594 0.475737 0.446406 0.636566
1 0.230875 0.543643 0.0378125 0.103903
1 0.283055 0.527797 0.0149844 0.0532831
1 0.320508 0.545268 0.0250781 0.0970687
1 0.316281 0.567412 0.0209688 0.0660134
1 0.0726094 0.554255 0.0243438 0.0260972
1 0.323203 0.518492 0.0235313 0.0288777
1 0.157906 0.543995 0.0290625 0.111709
1 0.0894766 0.541466 0.0128594 0.0462479
