1 0.361288 0.806156 0.267728 0.172594
1 0.104227 0.548664 0.0608665 0.123328
1 0.451838 0.459516 0.0732787 0.0520938
1 0.53363 0.459828 0.0694145 0.0566562
1 0.59144 0.449187 0.0462061 0.0799375
1 0.745211 0.360008 0.045082 0.0675469
1 0.628384 0.435883 0.0380796 0.0480781
1 0.755012 0.445289 0.0420609 0.0570781
1 0.377447 0.346977 0.0470258 0.0491094
1 0.607611 0.330961 0.0395316 0.0518281
1 0.514028 0.392906 0.0364871 0.0486875
1 0.641651 0.460539 0.062178 0.0467344
1 0.819602 0.444039 0.0479157 0.0871406
