1 0.320102 0.566437 0.0692656 0.26125
1 0.2035 0.553604 0.0787812 0.262583
1 0.223453 0.569469 0.03425 0.234104
1 0.128945 0.540656 0.0583281 0.188896
1 0.147656 0.492312 0.0162188 0.0814583
1 0.415313 0.510927 0.0253437 0.0881042
1 0.453945 0.482271 0.0158906 0.051125
1 0.54243 0.517917 0.0200156 0.0711667
1 0.946203 0.520979 0.05 0.147542
1 0.387617 0.501208 0.0291094 0.104
1 0.669922 0.53751 0.0310312 0.0911875
1 0.561859 0.505135 0.0234375 0.0941875
1 0.816859 0.670792 0.222875 0.540042
