1 0.426461 0.652792 0.0932344 0.364208
1 0.920406 0.827583 0.159187 0.320625
1 0.547297 0.774781 0.1115 0.441437
1 0.58732 0.400927 0.0213594 0.0541042
1 0.463828 0.403677 0.0219688 0.0441042
1 0.763336 0.41349 0.0306094 0.0296875
