1 0.354445 0.221819 0.219328 0.338028
1 0.248234 0.251125 0.285687 0.449194
1 0.455391 0.0996528 0.095875 0.184694
1 0.410391 0.0565972 0.0250937 0.0748056
1 0.382742 0.0480833 0.0262031 0.0487778
