1 0.42732 0.578217 0.0422031 0.146597
1 0.236273 0.622552 0.0546094 0.261469
1 0.352109 0.611131 0.0745313 0.287622
1 0.567187 0.549172 0.0219688 0.110699
1 0.606258 0.550047 0.0259219 0.1262
1 0.636273 0.546061 0.0223281 0.089324
1 0.917828 0.574103 0.0380313 0.16289
1 0.954492 0.541876 0.0211406 0.0880886
1 0.731617 0.570618 0.0404219 0.116993
1 0.856344 0.562925 0.0225938 0.119091
1 0.666969 0.54542 0.021375 0.0870163
1 0.682133 0.52838 0.0116406 0.0604429
1 0.973156 0.543636 0.0135 0.0835431
