1 0.613805 0.7741 0.0150156 0.0311449
1 0.535719 0.755491 0.01075 0.0305607
1 0.525578 0.753984 0.00984375 0.0325935
1 0.639203 0.776121 0.0229687 0.0302804
1 0.879875 0.763516 0.0110937 0.0432477
1 0.845305 0.755491 0.00795313 0.0343925
1 0.434891 0.778084 0.0125312 0.0299533
1 0.85457 0.76118 0.00695313 0.0380607
1 0.919844 0.762196 0.0070625 0.0230841
1 0.394578 0.765829 0.0083125 0.0538084
1 0.37107 0.765047 0.0122344 0.056729
1 0.349812 0.764147 0.0119375 0.0635748
