1 0.237141 0.423281 0.155375 0.382688
1 0.763062 0.486688 0.029625 0.116625
1 0.386766 0.513479 0.0297812 0.118167
1 0.472117 0.504781 0.0310469 0.141313
1 0.533617 0.436354 0.108172 0.3475
1 0.0785312 0.426469 0.135875 0.343521
1 0.775891 0.517552 0.0144375 0.0406875
1 0.844914 0.515552 0.0226719 0.0686875
1 0.713055 0.502375 0.0170156 0.0578333
1 0.410687 0.471 0.0783125 0.241583
1 0.0327109 0.405573 0.0654219 0.312437
1 0.655758 0.466062 0.0269531 0.0955
1 0.790187 0.520156 0.0130938 0.0211875
