1 0.778461 0.439682 0.0392656 0.0900941
1 0.969805 0.497553 0.0551406 0.258871
1 0.880523 0.417965 0.0484531 0.147647
1 0.0390234 0.437847 0.0780469 0.0746588
1 0.987445 0.487388 0.0251094 0.224094
1 0.929273 0.409082 0.00979688 0.0104941
1 0.72357 0.446494 0.0308281 0.0844235
