1 0.483859 0.587834 0.495875 0.799555
1 0.496781 0.387319 0.0652188 0.179415
1 0.4685 0.114871 0.116031 0.223372
1 0.551289 0.103407 0.0982969 0.198899
1 0.87707 0.457307 0.245859 0.191007
1 0.747398 0.358431 0.121453 0.231475
1 0.40382 0.476815 0.101391 0.150679
1 0.326727 0.426534 0.126609 0.262155
1 0.173914 0.317974 0.0989531 0.361803
1 0.626797 0.102026 0.110688 0.199555
1 0.732281 0.14671 0.109656 0.115995
1 0.0805547 0.196019 0.114547 0.134333
1 0.282297 0.123899 0.128031 0.235902
