0 0.17578125 0.45703125 0.35078125 0.625
0 0.21015625 0.8125 0.4203125 0.35078125
0 0.37109375 0.1734375 0.44921875 0.34609375
0 0.5453125 0.7796875 0.85546875 0.43515625
0 0.65 0.5046875 0.69453125 0.446875