0 0.605648 0.455917 0.788703 0.907542
0 0.231453 0.907677 0.0453125 0.0759375
0 0.200445 0.781219 0.0292031 0.0691458
0 0.39482 0.879792 0.0565156 0.0697917
0 0.579219 0.841094 0.026625 0.0860625
