1 0.277438 0.525894 0.136094 0.700447
1 0.390234 0.549435 0.174594 0.874165
1 0.551391 0.629212 0.332781 0.719082
1 0.825305 0.495494 0.349391 0.988729
1 0.581883 0.320753 0.110359 0.361271
1 0.767023 0.2778 0.0458281 0.0891059
1 0.0757734 0.593035 0.144016 0.811059
1 0.122367 0.543812 0.0776094 0.719106
1 0.654453 0.259812 0.07925 0.0694588
1 0.751617 0.447682 0.139641 0.355647
