1 0.37158 0.553609 0.412877 0.481406
1 0.935083 0.341062 0.046533 0.0194062
1 0.976946 0.335773 0.0269575 0.0218906
1 0.992571 0.328914 0.0140094 0.0115156
1 0.160472 0.300648 0.0302358 0.0598281
1 0.182311 0.340367 0.0381132 0.0192656
1 0.0629835 0.33693 0.0221934 0.0184531
1 0.0226651 0.716555 0.0453302 0.0825469
