1 0.152117 0.230528 0.0664531 0.192277
1 0.295789 0.189308 0.0235781 0.146408
1 0.78725 0.288415 0.0662812 0.291948
1 0.862523 0.301549 0.0687344 0.251033
1 0.270273 0.203803 0.0372344 0.116338
1 0.659453 0.167077 0.0345 0.0282864
1 0.561484 0.197829 0.0292812 0.130493
1 0.202281 0.231784 0.0514063 0.194789
1 0.528352 0.204789 0.0320781 0.120282
1 0.514398 0.166138 0.0140156 0.0363146
1 0.825687 0.216315 0.0215 0.112488
1 0.225648 0.192559 0.0470469 0.122864
1 0.771141 0.204542 0.0180312 0.0974883
