1 0.829898 0.376802 0.110891 0.211396
1 0.488563 0.33425 0.038625 0.144458
1 0.796375 0.34951 0.0678438 0.149854
1 0.612492 0.31825 0.0382344 0.08725
1 0.554594 0.327292 0.0689063 0.162
1 0.582273 0.306229 0.0207969 0.0630833
1 0.515109 0.337073 0.0265 0.139229
1 0.463078 0.337521 0.035375 0.136417
1 0.429375 0.325656 0.0367188 0.0987708
1 0.385586 0.315156 0.0485469 0.106688
1 0.273883 0.326437 0.0369531 0.0990417
1 0.107719 0.313865 0.0419687 0.107396
