1 0.0286953 0.841792 0.0540156 0.105292
1 0.161516 0.848875 0.0295 0.0813333
1 0.186141 0.823521 0.0282813 0.0632083
1 0.426391 0.808792 0.025875 0.04175
1 0.414609 0.821354 0.0438125 0.101125
1 0.56882 0.816948 0.0157969 0.0226042
1 0.298531 0.829562 0.017625 0.0770417
