1 0.441218 0.443969 0.78815 0.658438
1 0.9126 0.211234 0.174801 0.417969
1 0.827061 0.141891 0.175527 0.281531
1 0.149157 0.261969 0.298314 0.523937
1 0.843044 0.395664 0.313911 0.397547
1 0.610246 0.494688 0.181897 0.217
1 0.320948 0.474414 0.219649 0.374359
