1 0.531852 0.580759 0.279766 0.597313
1 0.160437 0.61472 0.317875 0.746636
1 0.86982 0.631752 0.254547 0.713972
1 0.742937 0.43271 0.0490938 0.153879
1 0.0629766 0.625935 0.122953 0.450654
1 0.685523 0.508586 0.157734 0.362827
1 0.59325 0.491145 0.0927188 0.243645
