1 0.525344 0.275896 0.0641875 0.130625
1 0.72175 0.339167 0.0776563 0.0944167
1 0.720828 0.587115 0.0873125 0.162688
1 0.738461 0.464417 0.0452344 0.115708
1 0.793867 0.58826 0.0843594 0.259188
1 0.826156 0.499135 0.0444063 0.165729
1 0.846008 0.645365 0.0776094 0.162354
1 0.907164 0.615656 0.0651719 0.184438
1 0.948781 0.645458 0.0715937 0.103875
