0 0.18515625 0.57109375 0.3703125 0.63671875
0 0.2984375 0.85703125 0.4953125 0.28125
0 0.26171875 0.21015625 0.46171875 0.40625
0 0.6046875 0.75390625 0.7859375 0.48828125
0 0.64453125 0.453125 0.70703125 0.478125