1 0.177055 0.54716 0.145609 0.526901
1 0.215836 0.352007 0.0761094 0.233498
1 0.261477 0.377441 0.0592031 0.231127
1 0.591547 0.220904 0.0770625 0.13777
1 0.807703 0.156538 0.05825 0.129883
1 0.320453 0.164542 0.066 0.170399
1 0.318609 0.220317 0.0375937 0.0564554
1 0.933031 0.629214 0.133937 0.543826
1 0.41657 0.441573 0.261766 0.793239
1 0.171125 0.307559 0.0600938 0.124225
1 0.878539 0.355246 0.242922 0.609648
1 0.059625 0.246854 0.0316875 0.0743192
1 0.952086 0.321678 0.0941719 0.275704
