1 0.8478 0.662402 0.16676 0.37982
1 0.67872 0.66518 0.25292 0.305616
1 0.3705 0.581081 0.297 0.522523
1 0.65887 0.194384 0.0857 0.195075
1 0.57081 0.17494 0.12722 0.204595
1 0.36975 0.163303 0.1035 0.184685
1 0.29871 0.144039 0.09246 0.192222
1 0.93532 0.183514 0.12588 0.340661
1 0.47697 0.182252 0.09342 0.171832
1 0.84001 0.217808 0.0803 0.190931
1 0.11071 0.128138 0.10802 0.185405
1 0.79054 0.199054 0.2154 0.206697
