0 0.26953125 0.1109375 0.45703125 0.22109375
0 0.7546875 0.28984375 0.4859375 0.5796875
0 0.24296875 0.2703125 0.4859375 0.540625
0 0.77265625 0.3609375 0.4375 0.3921875
0 0.790625 0.771875 0.41328125 0.4515625
0 0.11328125 0.7609375 0.22578125 0.44921875
0 0.203125 0.82578125 0.37734375 0.334375
0 0.7171875 0.84375 0.5453125 0.3078125