0 0.809438 0.739948 0.0885 0.257896
1 0.492133 0.446823 0.289891 0.822479
1 0.0379219 0.498875 0.0724687 0.764042
1 0.196508 0.398458 0.147797 0.332333
1 0.318539 0.379083 0.158422 0.305625
1 0.177414 0.476677 0.247203 0.432729
