1 0.770784 0.634975 0.206732 0.689886
1 0.570629 0.792859 0.221977 0.36098
1 0.661299 0.801201 0.0810294 0.204199
1 0.375278 0.888766 0.112353 0.177533
1 0.305621 0.887639 0.0674183 0.188775
1 0.480711 0.834257 0.0432516 0.112565
1 0.89558 0.877141 0.0353431 0.0659804
1 0.0559069 0.908268 0.0554085 0.127222
0 0.437328 0.850703 0.0353758 0.0518301
