0 0.156611 0.86339 0.313222 0.246217
0 0.783191 0.579557 0.421763 0.228853
0 0.782933 0.170966 0.253404 0.337626
0 0.153647 0.189809 0.294347 0.336197
0 0.183815 0.5117 0.359179 0.314507
1 0.0966261 0.05334 0.0370821 0.0474447
1 0.0362462 0.0584909 0.0516413 0.0955332
0 0.926033 0.781559 0.0676292 0.090161
1 0.117796 0.0541348 0.0242249 0.0360765
1 0.558298 0.110996 0.0912462 0.137847
