1 0.891484 0.61764 0.217031 0.76472
1 0.786047 0.475853 0.2665 0.667266
1 0.499727 0.31903 0.212891 0.346379
1 0.123523 0.355876 0.174672 0.315304
1 0.0375703 0.261799 0.0751406 0.258411
1 0.108352 0.164217 0.0665469 0.114836
1 0.37925 0.216227 0.113031 0.252033
1 0.193125 0.31153 0.125469 0.297173
1 0.314844 0.119848 0.0459062 0.106005
1 0.411836 0.16646 0.0833906 0.156379
1 0.223891 0.156308 0.0883437 0.110701
1 0.326547 0.296565 0.198219 0.309579
