1 0.415313 0.492113 0.209156 0.935258
1 0.601164 0.497746 0.482734 0.894131
1 0.928375 0.311045 0.0778125 0.205376
1 0.0808984 0.220669 0.0907344 0.163122
1 0.101719 0.358627 0.0812187 0.145282
1 0.0568906 0.324073 0.0412813 0.0914789
1 0.299938 0.283545 0.0969688 0.286432
1 0.0368125 0.346878 0.073625 0.194131
1 0.601242 0.210117 0.0854531 0.141408
1 0.184508 0.294038 0.127609 0.261643
