1 0.8227 0.802222 0.0908 0.315255
1 0.73554 0.801607 0.08196 0.317267
1 0.68135 0.781802 0.0369 0.212492
1 0.65081 0.819429 0.06578 0.273934
1 0.56246 0.827913 0.07504 0.299489
1 0.25728 0.800195 0.04512 0.208438
1 0.09887 0.713168 0.02038 0.108018
1 0.2343 0.791682 0.02176 0.183544
1 0.60933 0.71479 0.02934 0.0725826
1 0.12013 0.718964 0.02086 0.109039
1 0.41972 0.86509 0.0628 0.171201
1 0.37907 0.841291 0.04366 0.154354
