1 0.0789141 0.922906 0.154859 0.127788
1 0.452164 0.873024 0.161172 0.231459
1 0.859547 0.848318 0.140281 0.294376
1 0.347047 0.566094 0.0174687 0.0388706
1 0.259289 0.654176 0.0420469 0.177812
1 0.191062 0.661541 0.098125 0.167788
1 0.166539 0.649412 0.0435469 0.146165
1 0.125977 0.683918 0.0462969 0.186424
1 0.0716328 0.7972 0.0925156 0.155059
1 0.244641 0.862012 0.203563 0.275976
1 0.901828 0.931682 0.141063 0.135271
1 0.143164 0.597659 0.0203281 0.0879765
1 0.295578 0.638741 0.0255312 0.154894
