1 0.0394141 0.63354 0.0577656 0.18392
1 0.053875 0.43687 0.039375 0.10082
1 0.0216484 0.43211 0.0171719 0.09738
1 0.468922 0.42383 0.0663125 0.13158
1 0.35375 0.35372 0.0309063 0.07232
1 0.932266 0.39763 0.0450938 0.06942
1 0.540867 0.42587 0.0897344 0.1615
1 0.310352 0.36481 0.0201094 0.03242
1 0.959063 0.40786 0.0205625 0.09392
1 0.128898 0.41321 0.0116406 0.09254
1 0.893961 0.39907 0.0293594 0.06878
1 0.492547 0.39483 0.0137187 0.03782
