1 0.700081 0.42125 0.100394 0.173531
1 0.891539 0.436719 0.0782176 0.152812
1 0.849144 0.467016 0.050787 0.097375
1 0.78456 0.402859 0.057963 0.0547813
1 0.859965 0.397875 0.0415972 0.07875
1 0.821898 0.425516 0.0561574 0.102813
1 0.927986 0.409664 0.0427315 0.0484531
1 0.820104 0.381461 0.0269676 0.0246094
