0 0.08671875 0.81640625 0.16328125 0.259375
0 0.20546875 0.48671875 0.23046875 0.196875
0 0.2859375 0.93359375 0.303125 0.12734375
0 0.31640625 0.78515625 0.28359375 0.21640625
0 0.32109375 0.31015625 0.28828125 0.2234375
0 0.34375 0.584375 0.22578125 0.2453125
0 0.4828125 0.4015625 0.22578125 0.2359375
0 0.69140625 0.8921875 0.3703125 0.21171875
0 0.71640625 0.63125 0.5171875 0.28828125
0 0.76171875 0.3234375 0.46875 0.30546875