1 0.170883 0.92699 0.0367344 0.0911042
1 0.277711 0.888708 0.0112031 0.0393333
1 0.34018 0.885417 0.00901562 0.0333333
1 0.616844 0.866771 0.0152812 0.0156667
1 0.47407 0.894896 0.0316406 0.0634583
1 0.500523 0.897458 0.0342031 0.058375
1 0.782516 0.88426 0.0180625 0.0578125
1 0.323797 0.886479 0.00678125 0.0110833
1 0.247945 0.893344 0.00810938 0.0212708
1 0.349984 0.889073 0.0126562 0.0395208
1 0.421523 0.890156 0.00601563 0.0111042
1 0.266313 0.891 0.011375 0.0435417
1 0.309125 0.891583 0.01125 0.0225
