1 0.120445 0.776656 0.132141 0.38634
1 0.252359 0.829891 0.157187 0.311852
1 0.791141 0.531645 0.0954375 0.348431
1 0.656078 0.819575 0.281781 0.359804
1 0.829203 0.797745 0.207906 0.319107
1 0.90625 0.535675 0.155219 0.414009
1 0.506859 0.588769 0.120875 0.530349
1 0.183656 0.577484 0.115094 0.427952
1 0.29793 0.578137 0.114016 0.427037
1 0.392437 0.548312 0.091875 0.422462
1 0.705883 0.610359 0.113078 0.448214
1 0.609211 0.543813 0.0967031 0.426972
1 0.388773 0.827288 0.317766 0.344553
