1 0.444547 0.530635 0.179781 0.751188
1 0.708062 0.315292 0.12975 0.145167
1 0.602953 0.229198 0.058625 0.145604
1 0.734398 0.190562 0.0821719 0.123042
1 0.565727 0.216563 0.0619531 0.152292
1 0.482266 0.131906 0.0979063 0.136979
1 0.717609 0.259688 0.0725 0.101625
1 0.328438 0.0309375 0.0594375 0.061875
1 0.520617 0.239229 0.0716719 0.124583
1 0.653836 0.182875 0.0648594 0.131167
1 0.483078 0.259979 0.0495937 0.0819583
1 0.570898 0.128812 0.106234 0.114083
1 0.885289 0.0382187 0.0700156 0.0764375
