1 0.443687 0.348592 0.0549063 0.103286
1 0.693633 0.288146 0.0885781 0.318685
1 0.631969 0.366291 0.0732812 0.157324
1 0.925555 0.546068 0.148891 0.260681
1 0.633344 0.208099 0.0179063 0.076385
1 0.651016 0.219378 0.0133125 0.0709155
1 0.238062 0.191784 0.013125 0.0591549
1 0.382211 0.210587 0.0268906 0.123286
1 0.430813 0.21115 0.0224375 0.0477934
1 0.505641 0.380599 0.139313 0.108756
1 0.589766 0.201878 0.0153125 0.0729108
1 0.0629453 0.214765 0.0270781 0.131362
1 0.850992 0.202289 0.0138594 0.0585681
