1 0.5 0.607867 1 0.761797
1 0.0823698 0.337633 0.16474 0.200828
1 0.261849 0.271047 0.0752604 0.036125
1 0.860495 0.35132 0.0500521 0.0813906
1 0.794805 0.430125 0.100599 0.0621875
1 0.377096 0.222688 0.0653385 0.03175
1 0.843177 0.296641 0.0505208 0.0533125
1 0.240469 0.324047 0.0515625 0.0507812
1 0.270599 0.429406 0.133333 0.167063
1 0.833125 0.492039 0.0588021 0.0623594
1 0.741706 0.323844 0.0259635 0.039125
1 0.936979 0.262594 0.0280208 0.0256875
1 0.906237 0.467687 0.050026 0.0329062
