1 0.432508 0.559545 0.429953 0.880909
1 0.810688 0.504019 0.120594 0.349731
1 0.949656 0.443326 0.072875 0.320248
1 0.622641 0.433884 0.0329688 0.190289
1 0.857672 0.410434 0.0458125 0.13124
1 0.711359 0.431229 0.0405 0.192789
1 0.744031 0.449907 0.0264375 0.159236
1 0.899352 0.438791 0.0563594 0.232748
1 0.687953 0.361198 0.019125 0.0483058
1 0.98757 0.435599 0.0246719 0.217562
1 0.757797 0.381839 0.0366563 0.103595
