1 0.919224 0.16094 0.0548529 0.0929248
1 0.713096 0.138015 0.0446242 0.0536765
1 0.676348 0.167361 0.0538072 0.112141
1 0.899657 0.142859 0.0252614 0.0477124
1 0.621087 0.162998 0.0552778 0.102173
