0 0.21875 0.48671875 0.2640625 0.31015625
0 0.23828125 0.18984375 0.47578125 0.3703125
0 0.59140625 0.8078125 0.80078125 0.3796875
0 0.7546875 0.40625 0.4859375 0.41796875
0 0.10546875 0.72109375 0.2015625 0.28359375
0 0.125 0.1671875 0.25 0.2953125