1 0.0899167 0.837844 0.0483333 0.0500625
1 0.956594 0.810734 0.0177292 0.0300938
1 0.808469 0.82125 0.0156042 0.0204688
1 0.983344 0.798023 0.0168958 0.0154531
1 0.774177 0.829148 0.0206042 0.00707813
1 0.86976 0.823523 0.00664583 0.0107031
