1 0.437328 0.96911 0.0107188 0.0216393
1 0.108898 0.981089 0.0159531 0.037822
1 0.667008 0.966499 0.0188906 0.0657845
1 0.227102 0.985913 0.0128281 0.0278923
1 0.0955156 0.924286 0.0105938 0.0271663
1 0.157234 0.977869 0.0370625 0.0442623
1 0.0903516 0.972201 0.0200781 0.0493677
1 0.488453 0.909169 0.0045625 0.0191335
1 0.457391 0.888829 0.0058125 0.0162998
1 0.2875 0.984824 0.009125 0.0303513
1 0.438289 0.989719 0.0111406 0.0205621
1 0.106086 0.923888 0.0155781 0.0329274
