1 0.281125 0.35281 0.136437 0.4
1 0.297531 0.686944 0.0540937 0.245504
1 0.337422 0.662576 0.0654687 0.237611
1 0.505281 0.690363 0.0818125 0.239274
1 0.577594 0.70466 0.0908438 0.253443
1 0.610289 0.690948 0.0503281 0.235293
1 0.693133 0.663314 0.0722344 0.236323
1 0.798367 0.68603 0.0786719 0.119696
1 0.839797 0.680937 0.0714687 0.205761
1 0.556648 0.651932 0.0376406 0.221007
1 0.721969 0.696265 0.060375 0.215152
