1 0.507633 0.438765 0.503109 0.656177
1 0.879 0.755828 0.147906 0.318695
1 0.937789 0.286445 0.0533281 0.191445
1 0.911984 0.435012 0.062375 0.254779
1 0.758016 0.280594 0.0602812 0.22035
1 0.805875 0.660513 0.117875 0.27296
1 0.969156 0.697483 0.0616875 0.217249
