0 0.96171875 0.35546875 0.07421875 0.2046875
0 0.43984375 0.40625 0.21875 0.290625
0 0.86796875 0.48046875 0.26171875 0.37734375
0 0.615625 0.696875 0.2640625 0.34609375
0 0.884375 0.8078125 0.22578125 0.38203125
0 0.0953125 0.86640625 0.18984375 0.2640625