1 0.794312 0.392283 0.0161563 0.0271897
1 0.775602 0.393642 0.0191094 0.0331382
1 0.761625 0.399555 0.00928125 0.0185012
1 0.752219 0.394742 0.0135 0.0289227
1 0.733516 0.399087 0.0204063 0.0263232
1 0.721055 0.401194 0.0142969 0.022904
1 0.831281 0.391768 0.0122813 0.0168384
1 0.847328 0.385457 0.00796875 0.021733
1 0.855297 0.38822 0.0078125 0.0142857
1 0.916547 0.372869 0.0138437 0.0342155
1 0.812836 0.504543 0.0122031 0.0167681
1 0.811492 0.392213 0.0174219 0.0286417
1 0.869648 0.39185 0.00726563 0.00669789
