1 0.570336 0.59535 0.0157344 0.123832
1 0.555133 0.640304 0.0211094 0.171963
1 0.246227 0.680689 0.0620781 0.261051
1 0.384742 0.693259 0.0864219 0.327593
1 0.306031 0.669276 0.0584063 0.301262
1 0.182016 0.633808 0.069 0.198832
1 0.437547 0.651157 0.0590313 0.231145
1 0.532086 0.600806 0.0535781 0.209883
1 0.497203 0.658586 0.0545312 0.193575
1 0.422117 0.546262 0.0374219 0.0597664
