0 0.50018 0.401731 0.210516 0.265513
0 0.83268 0.824872 0.309797 0.329017
0 0.718617 0.549135 0.176891 0.161987
0 0.17918 0.557308 0.337578 0.238462
0 0.154109 0.746229 0.308219 0.283868
0 0.157938 0.911987 0.249531 0.15765
0 0.136813 0.361293 0.273625 0.309679
1 0.750594 0.351688 0.498812 0.689872
0 0.350977 0.394209 0.159266 0.155171
0 0.278438 0.407885 0.153781 0.133504
