0 0.12734375 0.6390625 0.2546875 0.39921875
0 0.11875 0.25546875 0.2375 0.3640625
0 0.3265625 0.771875 0.59609375 0.4515625
0 0.3453125 0.46015625 0.68984375 0.58203125
0 0.75234375 0.53515625 0.490625 0.51171875