1 0.22472 0.8191 0.443467 0.32136
1 0.88656 0.46895 0.0757333 0.13358
1 0.852267 0.70494 0.295467 0.55556
1 0.725467 0.40359 0.20144 0.11922
1 0.431173 0.51089 0.841547 0.94026
1 0.529187 0.31149 0.0927733 0.05518
