1 0.444229 0.446883 0.34675 0.638234
1 0.201219 0.274313 0.138521 0.188437
1 0.550802 0.242813 0.0808958 0.0924062
1 0.31225 0.23793 0.0624583 0.0538594
1 0.977563 0.250945 0.034125 0.0428906
1 0.826146 0.21818 0.021625 0.0198281
