1 0.29293 0.595397 0.0267969 0.125272
1 0.105078 0.592751 0.0318125 0.109059
1 0.132336 0.606088 0.0102969 0.0451883
1 0.159289 0.600157 0.0173594 0.0509833
1 0.122164 0.602793 0.0130781 0.05341
1 0.239391 0.583232 0.01425 0.0374268
