1 0.603662 0.66666 0.377723 0.47636
1 0.278538 0.59141 0.0410154 0.02974
1 0.844185 0.34925 0.0897231 0.07494
1 0.727462 0.46644 0.0614462 0.05948
1 0.459154 0.50052 0.0709846 0.07748
1 0.236554 0.54226 0.0490462 0.0492
1 0.0602923 0.44933 0.0468 0.04274
1 0.233738 0.44395 0.0409538 0.05222
1 0.255446 0.27353 0.0386462 0.03834
1 0.406908 0.20351 0.0655077 0.06194
1 0.543708 0.21242 0.0324 0.02388
1 0.457662 0.59337 0.0576 0.0267
1 0.582415 0.56975 0.0488308 0.05634
