1 0.867766 0.608676 0.0332812 0.13784
1 0.342484 0.600279 0.0614688 0.141986
1 0.378227 0.572587 0.0350156 0.0755575
1 0.434586 0.592465 0.0429844 0.103293
1 0.681797 0.605679 0.0365 0.117003
1 0.102922 0.55872 0.0505938 0.0664983
1 0.790828 0.604451 0.0307187 0.123885
1 0.828969 0.602213 0.0383125 0.146969
1 0.292813 0.605784 0.0503125 0.153589
1 0.614555 0.569373 0.0127344 0.020662
1 0.210687 0.625976 0.101312 0.219582
1 0.528953 0.57466 0.0163438 0.0241638
