1 0.30117 0.46225 0.331211 0.609344
1 0.787659 0.449422 0.152485 0.151094
1 0.857741 0.445172 0.10308 0.129
1 0.897495 0.435289 0.078809 0.0979531
1 0.601869 0.489313 0.160246 0.165375
1 0.914148 0.508109 0.110349 0.111781
1 0.982094 0.506648 0.0302259 0.0410156
