1 0.770047 0.596067 0.431719 0.771032
1 0.583133 0.534977 0.0961719 0.23922
1 0.139445 0.252821 0.124484 0.0936239
1 0.402648 0.414048 0.155547 0.237225
1 0.346969 0.388177 0.113187 0.17883
1 0.166055 0.503888 0.141266 0.235528
1 0.195984 0.378739 0.171687 0.189908
1 0.450945 0.688452 0.201328 0.265619
1 0.0880234 0.561789 0.172984 0.193257
1 0.241852 0.677557 0.173797 0.157317
1 0.522289 0.468222 0.110328 0.241032
