1 0.677173 0.52703 0.645653 0.92342
1 0.388213 0.4584 0.257973 0.42732
1 0.21172 0.49304 0.15976 0.4426
1 0.522627 0.35865 0.0250933 0.05202
1 0.0628133 0.32449 0.0186933 0.02702
1 0.592413 0.35171 0.0214133 0.03886
1 0.617653 0.34518 0.0161067 0.02292
1 0.248187 0.37047 0.0292267 0.05186
1 0.0759467 0.32319 0.0183467 0.03186
1 0.483853 0.36039 0.02664 0.05054
1 0.0946 0.32684 0.0138933 0.02036
1 0.00597333 0.3124 0.0116267 0.03544
