1 0.597742 0.408986 0.156328 0.413491
1 0.757 0.428455 0.151281 0.451203
1 0.856273 0.462394 0.163047 0.558939
1 0.875172 0.539976 0.249656 0.869481
1 0.53182 0.438325 0.0654219 0.352406
1 0.332188 0.465719 0.254812 0.516958
1 0.154875 0.330142 0.0384062 0.0862736
1 0.185023 0.339929 0.0547344 0.0965094
1 0.253117 0.327889 0.0526719 0.11842
1 0.230789 0.317005 0.0177344 0.0623113
1 0.0387969 0.569693 0.0775937 0.336934
1 0.678039 0.329104 0.0202656 0.0533962
1 0.687367 0.332417 0.0316094 0.0933726
