1 0.67408 0.512444 0.16796 0.886056
1 0.28558 0.543833 0.17636 0.844944
1 0.81847 0.523792 0.16466 0.840806
1 0.1173 0.589889 0.1084 0.388778
1 0.94042 0.460042 0.0466 0.119361
1 0.19496 0.577528 0.04692 0.350556
1 0.59542 0.521347 0.09708 0.714583
1 0.02686 0.599097 0.05372 0.46075
1 0.35637 0.533083 0.10082 0.7535
1 0.47462 0.515986 0.23072 0.866861
1 0.07278 0.597833 0.0524 0.192889
