1 0.5 0.55586 1 0.86456
1 0.192147 0.22122 0.155547 0.16136
1 0.74288 0.22845 0.1008 0.17902
1 0.90524 0.34573 0.18952 0.1267
1 0.862733 0.20865 0.1492 0.26718
1 0.0809867 0.26365 0.161973 0.2909
