0 0.73671875 0.62265625 0.36796875 0.42578125
0 0.48828125 0.39765625 0.3078125 0.290625
0 0.4328125 0.6 0.38203125 0.3171875
0 0.3453125 0.8453125 0.31484375 0.3078125
0 0.15859375 0.375 0.3171875 0.75