1 0.906756 0.565672 0.186487 0.421406
1 0.653337 0.585047 0.250375 0.403375
1 0.498548 0.601461 0.216674 0.340328
1 0.32671 0.619531 0.235761 0.4
1 0.245984 0.471922 0.0502342 0.0414687
1 0.378993 0.511437 0.0483372 0.0825
1 0.0791569 0.637078 0.151569 0.325844
1 0.815176 0.562906 0.11808 0.281969
1 0.206874 0.628883 0.041897 0.0563594
