1 0.167375 0.739018 0.125281 0.521527
1 0.24032 0.747418 0.0576719 0.474255
1 0.381414 0.652964 0.0811094 0.307891
1 0.51018 0.544236 0.0561719 0.325273
1 0.805094 0.541891 0.0649687 0.391418
1 0.762922 0.702582 0.158625 0.505964
1 0.715336 0.511855 0.0552969 0.284436
1 0.0917578 0.696945 0.0688281 0.274691
1 0.271594 0.307691 0.00959375 0.018
1 0.979914 0.483418 0.0338281 0.337018
1 0.560984 0.558455 0.0903438 0.283818
1 0.90457 0.584418 0.0993281 0.488327
