0 0.859375 0.32421875 0.23046875 0.19453125
0 0.73828125 0.01953125 0.3703125 0.03828125
0 0.646875 0.09765625 0.5140625 0.19453125
0 0.55390625 0.21640625 0.6109375 0.31953125
0 0.490625 0.5140625 0.81015625 0.46171875
0 0.48828125 0.8734375 0.6296875 0.24765625
0 0.359375 0.6890625 0.71875 0.5265625