0 0.696875 0.6890625 0.1828125 0.196875
0 0.7046875 0.89296875 0.2546875 0.209375
0 0.78515625 0.22734375 0.415625 0.2015625
0 0.8234375 0.68359375 0.3484375 0.4640625
0 0.85546875 0.1109375 0.28359375 0.1828125