1 0.263188 0.766034 0.0426875 0.110998
1 0.927562 0.601192 0.0210938 0.11635
1 0.916359 0.745608 0.0345 0.129124
1 0.951531 0.770839 0.026875 0.133212
1 0.474445 0.566557 0.0266406 0.0900973
1 0.441961 0.333066 0.0125469 0.0647202
1 0.106492 0.695487 0.0390469 0.120949
1 0.290594 0.337968 0.0099375 0.0509732
1 0.158805 0.261399 0.0131094 0.0380292
1 0.995477 0.592372 0.00904687 0.0719465
1 0.992898 0.67865 0.0142031 0.101095
1 0.284289 0.330012 0.00939062 0.0518005
