1 0.39 0.42024 0.0913125 0.228063
1 0.290539 0.496625 0.0540469 0.177917
1 0.338562 0.438042 0.045625 0.112125
1 0.227344 0.482448 0.0779062 0.182188
1 0.209977 0.462844 0.0417969 0.0874375
1 0.142187 0.449865 0.060375 0.113854
1 0.165227 0.497219 0.0336406 0.144896
1 0.137992 0.418292 0.0232031 0.0423333
