1 0.753883 0.623411 0.0638594 0.31514
1 0.253227 0.632582 0.0556094 0.343808
1 0.826555 0.56993 0.0829531 0.231215
1 0.884797 0.531554 0.0225312 0.119883
1 0.126516 0.594591 0.1205 0.790537
1 0.415898 0.583458 0.0562031 0.252757
1 0.381773 0.506752 0.0302656 0.117664
1 0.960617 0.5266 0.0307031 0.150304
1 0.280305 0.493294 0.0148594 0.0698598
1 0.19218 0.502266 0.0277656 0.0961682
1 0.503867 0.60764 0.0706406 0.296028
1 0.84532 0.592185 0.0275781 0.172033
1 0.219211 0.493178 0.0184219 0.0742991
