1 0.326391 0.567823 0.0329375 0.0424375
1 0.298023 0.583229 0.0272344 0.0336667
1 0.290125 0.584865 0.023875 0.0546458
1 0.301086 0.570208 0.0270781 0.0480833
1 0.189648 0.59076 0.0396406 0.104021
1 0.28743 0.565792 0.00735937 0.0109583
1 0.276203 0.579688 0.012625 0.0294583
