1 0.369945 0.683292 0.446641 0.60225
1 0.633914 0.777687 0.141766 0.3775
1 0.559711 0.708594 0.0458594 0.133063
1 0.151203 0.72924 0.0130312 0.0568125
1 0.119945 0.722052 0.0362344 0.142396
1 0.893797 0.622469 0.016375 0.0681875
1 0.708219 0.697406 0.0275313 0.103021
1 0.614523 0.732323 0.0213906 0.0634375
1 0.0853047 0.726844 0.0137969 0.0597708
1 0.175727 0.733792 0.0153594 0.0526667
1 0.0930156 0.729333 0.0141563 0.0589167
1 0.517633 0.731771 0.00720313 0.0139167
1 0.0593672 0.72101 0.0410781 0.113896
