1 0.300156 0.366698 0.06775 0.112834
1 0.61393 0.39192 0.0360781 0.0774707
1 0.514672 0.428993 0.0210313 0.0844496
1 0.497891 0.409239 0.0107188 0.0348712
1 0.496805 0.417365 0.0110469 0.0198829
1 0.37243 0.461311 0.0588906 0.166323
1 0.243758 0.360644 0.0506094 0.104239
1 0.479609 0.429496 0.0455938 0.0642857
