1 0.96532 0.526729 0.00864063 0.0345417
1 0.941875 0.523031 0.0055625 0.0199375
1 0.255102 0.518719 0.0489219 0.0768125
1 0.392555 0.611688 0.0320781 0.276333
1 0.574055 0.525823 0.0152656 0.0566042
1 0.600391 0.514417 0.0170937 0.0293333
1 0.97557 0.5235 0.0120781 0.0419583
1 0.990047 0.519542 0.00971875 0.0416667
