0 0.27734375 0.646875 0.4015625 0.4515625
0 0.5015625 0.39765625 0.3296875 0.31484375
0 0.5765625 0.5921875 0.40390625 0.3484375
0 0.68984375 0.8265625 0.3390625 0.33203125
0 0.8140625 0.36171875 0.36796875 0.7234375