1 0.53997 0.549448 0.62118 0.878644
1 0.14461 0.0651577 0.1097 0.125836
1 0.26215 0.0617981 0.09402 0.119117
1 0.20914 0.0631703 0.0572 0.126341
1 0.3804 0.366293 0.09404 0.305647
1 0.53138 0.0593218 0.11644 0.118644
1 0.37028 0.0588013 0.12896 0.117603
1 0.03647 0.0690063 0.07294 0.131262
1 0.68534 0.053612 0.14828 0.107224
1 0.74856 0.0503628 0.10668 0.100726
1 0.93584 0.0438644 0.12832 0.0867823
1 0.7998 0.0491798 0.0678 0.0983596
1 0.88979 0.0430126 0.08922 0.085205
