0 0.67357 0.536143 0.264359 0.289941
1 0.455727 0.325078 0.185172 0.650156
1 0.610344 0.217979 0.163594 0.417988
1 0.947773 0.510928 0.104453 0.976582
1 0.0350547 0.502246 0.0665156 0.492148
1 0.123734 0.425332 0.247469 0.84
1 0.778828 0.153545 0.12075 0.30709
1 0.120203 0.398662 0.061375 0.157598
