1 0.715039 0.841967 0.0194844 0.0343794
1 0.987445 0.943665 0.0251094 0.0543091
1 0.866086 0.87185 0.0247656 0.0601874
1 0.899641 0.895691 0.0177813 0.0281967
1 0.55893 0.904895 0.0282344 0.0987354
1 0.535031 0.90411 0.0275625 0.100679
1 0.679148 0.785878 0.00979688 0.0398126
1 0.653687 0.809731 0.0119063 0.0442389
1 0.618328 0.806101 0.00925 0.0541218
1 0.742625 0.850164 0.0093125 0.016815
1 0.960555 0.966112 0.0252344 0.0677752
1 0.671273 0.788478 0.00917187 0.0412178
