1 0.0410625 0.705917 0.082125 0.544417
1 0.112344 0.732677 0.116281 0.534646
1 0.711844 0.558833 0.058875 0.217208
1 0.240172 0.817979 0.180344 0.337083
1 0.462109 0.690906 0.241188 0.527062
1 0.799836 0.818688 0.170609 0.333333
1 0.956078 0.737615 0.0878437 0.481979
1 0.374156 0.773042 0.168531 0.431458
1 0.236266 0.642375 0.169844 0.329583
1 0.572773 0.737823 0.115172 0.523479
1 0.200586 0.643188 0.0906094 0.32575
1 0.798336 0.625417 0.0879219 0.258458
1 0.514281 0.474031 0.0584375 0.111687
