1 0.34732 0.664532 0.0700469 0.323302
1 0.48943 0.622775 0.0537656 0.296557
1 0.621945 0.494215 0.0147656 0.0759251
1 0.816148 0.53356 0.0516406 0.187728
1 0.596594 0.497916 0.0157813 0.0759251
1 0.839937 0.52678 0.0265937 0.156885
1 0.92393 0.567752 0.0789219 0.271569
1 0.390937 0.625445 0.0464062 0.228595
1 0.436703 0.619391 0.082875 0.262155
1 0.64518 0.485878 0.0136406 0.0555504
1 0.582234 0.488759 0.016125 0.0737237
1 0.532414 0.496745 0.0198594 0.0771897
1 0.275094 0.62459 0.0869687 0.368384
