1 0.768719 0.603608 0.0470938 0.157547
1 0.588828 0.61592 0.0428125 0.121745
1 0.727414 0.601769 0.0613281 0.105189
1 0.574109 0.551722 0.0600313 0.11184
1 0.714758 0.57487 0.0313906 0.0608726
1 0.693 0.556038 0.029375 0.0962736
1 0.0153516 0.691639 0.0307031 0.296439
1 0.684117 0.585059 0.0234844 0.0627594
1 0.797047 0.646781 0.0369688 0.111014
1 0.637844 0.589363 0.0624687 0.131887
1 0.662586 0.570908 0.0245781 0.0549764
