1 0.61602 0.35 0.3118 0.388747
1 0.58697 0.61364 0.06146 0.139387
1 0.65203 0.588453 0.02718 0.0973867
1 0.70688 0.60944 0.0242 0.0906133
1 0.62132 0.575627 0.02428 0.118347
1 0.48684 0.576107 0.01616 0.07328
1 0.41564 0.548373 0.02884 0.0390933
1 0.3673 0.539773 0.00932 0.0149067
1 0.52463 0.579387 0.02178 0.0242133
1 0.55516 0.591333 0.01816 0.03728
