1 0.0664382 0.206219 0.0665058 0.120094
1 0.0117664 0.847492 0.0235328 0.143734
1 0.449344 0.816273 0.0156757 0.0232031
1 0.0668822 0.850391 0.056583 0.129344
1 0.0318629 0.212578 0.0637259 0.171969
1 0.0101448 0.534719 0.0202896 0.132156
