1 0.177984 0.689104 0.0119375 0.041
1 0.0469375 0.689302 0.0215625 0.0513958
1 0.019125 0.68775 0.0102188 0.05125
1 0.816133 0.688635 0.0165781 0.0213542
1 0.972016 0.686906 0.0116875 0.0301875
1 0.514484 0.670365 0.0043125 0.0168542
1 0.582867 0.683188 0.00317187 0.0222917
1 0.730727 0.669729 0.00595313 0.0177083
1 0.704641 0.667385 0.0139375 0.0195625
1 0.744508 0.69949 0.0119844 0.0313958
1 0.622664 0.690021 0.0167656 0.0519167
1 0.800156 0.681917 0.0115937 0.0298333
1 0.578141 0.685708 0.008125 0.029375
