1 0.426569 0.576789 0.0933255 0.204953
1 0.487319 0.578016 0.107377 0.205781
1 0.546183 0.503 0.0445902 0.0755313
1 0.732799 0.507453 0.05 0.0727187
1 0.0182904 0.484586 0.0332553 0.0368281
1 0.782295 0.510688 0.0457611 0.0644062
1 0.696393 0.480336 0.0288993 0.0361406
1 0.360293 0.636641 0.222319 0.398312
1 0.60507 0.483141 0.0235363 0.025375
