1 0.549258 0.490184 0.170453 0.393983
1 0.840992 0.552175 0.151891 0.305763
1 0.421141 0.0413136 0.0355313 0.0822881
1 0.752695 0.0895904 0.0457344 0.103023
1 0.55207 0.0427401 0.0341094 0.0683616
1 0.258937 0.0242938 0.0245312 0.0443503
1 0.916273 0.0773446 0.0483906 0.109492
1 0.757969 0.568432 0.130625 0.23709
1 0.804703 0.0641102 0.0237813 0.0451695
