1 0.703375 0.537227 0.453937 0.534828
1 0.652586 0.128328 0.161391 0.254219
1 0.155484 0.14675 0.0827813 0.185688
1 0.0305234 0.115906 0.0610469 0.231813
1 0.880031 0.175656 0.0606563 0.178687
1 0.418477 0.156422 0.160672 0.186344
1 0.960984 0.0849453 0.078 0.169891
1 0.0858437 0.180961 0.0558125 0.0991719
