{
  "title": "Spring 4",
  "theme": "green",
  "versionOfManual": "1.4",
  "modules" : [
    "head",
    "introduction",
    "wiring-beans",
    "wiring-beans-adv",
    "aspect-orientation",
    "spring-persistence",
    "spring-jdbc",
    "spring-jpa",
    "spring-data",
    "transaction-support",
    "spring-web-mvc",
    "spring-test",
    "spring-boot",
    "spring-boot-groovy",
    "tail"
  ],
  "disabled": true,
  "requiresUpdate":false,
  "deprecated":false,
  "toBeOutsourced": false,
  "eruCompatible": "?",

  "dependencies" : [
    "JAV820",
    "JPA",
    "UNT010",
    "MVN210",
    "HTM011",
    "XML010"
  ]
}
