{
  "host": "localhost",
  "port": 3030,
  "public": "../public/",
  "clientEndpoints": "CLIENT_ENDPOINTS",
  "uiEndpoint": "UI_ENDPOINT",
  "fbAccessToken": "MESSENGER_ACCESS_TOKEN",
  "officeTz": "Asia/Taipei",
  "paginate": {
    "default": 10,
    "max": 50
  },
  "syncPeriodMinute": 10,
  "addContentTimeoutMinute": 2,
  "authentication": {
    "auth0": {
      "create": true,
      "domain": "AUTH0_DOMAIN"
    },
    "authStrategies": ["auth0"],
    "entity": "users",
    "entityId": "user_id",
    "service": "users"
  },
  "airtable": {
    "auth": {
      "ticket": {
        "key": "AT_TICKET_KEY",
        "base": "AT_TICKET_ID"
      },
      "default": {
        "key": "AT_SETTING_KEY",
        "base": "AT_SETTING_ID"
      }
    },
    "tables": {
      "ticket": {
        "name": "Test",
        "auth": "ticket",
        "map": {
          "state": "進度",
          "buildingId": "公寓 Apartment",
          "roomId": "通報房間",
          "taskType": "通報緣由",
          "reporter": "通報人",
          "reporterEmail": "聯絡電郵",
          "content": "通報內容",
          "contentAttachment": "通報上傳照片或相關資料",
          "workingLog": "處理紀錄",
          "workingLogAttachment": "處理照片紀錄",
          "owner": "負責人",
          "reportedAt": "通報日期",
          "finishedAt": "結案時間",
          "atUpdatedAt": "最後更新時間"
        },
        "defaultValue": {
          "buildingId": "萬華 Wanhua"
        },
        "required": ["roomId", "taskType", "reporter"],
        "decoder": {
          "reportedAt": "dateOnly",
          "atUpdatedAt": "date",
          "finishedAt": "date"
        }
      },
      "booking": {
        "name": "室友註冊表",
        "view": "Grid view",
        "auth": "default",
        "map": {
          "buildingId": "公寓",
          "roomId": "房號",
          "floor": "樓層",
          "username": "姓名",
          "email": "信箱",
          "channelType": "通訊軟體",
          "channelId": "通訊軟體帳號",
          "channelMeta": "帳號資訊",
          "atUpdatedAt": "最後更新時間"
        },
        "required": ["buildingId", "roomId"],
        "decoder": {
          "atUpdatedAt": "date",
          "channelMeta": "json"
        },
        "defaultValue": {
          "username": null,
          "email": null,
          "channelType": null,
          "channelId": null,
          "channelMeta": null
        }
      },
      "canned-msg": {
        "name": "罐頭訊息",
        "auth": "default",
        "map": {
          "state": "狀態",
          "msg": "罐頭訊息",
          "offStartSec": "上班日休息開始時間",
          "offEndSec": "上班日休息結束時間",
          "atUpdatedAt": "最後更新時間"
        },
        "required": ["state", "msg"],
        "decoder": {
          "atUpdatedAt": "date"
        }
      },
      "bot-msg": {
        "name": "機器人訊息",
        "auth": "default",
        "map": {
          "key": "名稱",
          "category": "分類",
          "order": "順序",
          "language": "語系支援",
          "content": "內容",
          "isMemberOnly": "室友專用",
          "payload": "Payload",
          "offStartSec": "下班開始時間",
          "offEndSec": "下班結束時間",
          "atUpdatedAt": "最後更新時間"
        },
        "required": [
          "key",
          "category",
          "language"
        ],
        "decoder": {
          "atUpdatedAt": "date"
        }
      },
      "slack-mapping": {
        "name": "Slack 通知設定",
        "auth": "default",
        "map": {
          "taskType": "工單類型",
          "maxReplyHour": "回覆時限（小時）",
          "channel": "對應 Slack Channel",
          "atUpdatedAt": "最後更新時間"
        },
        "defaultValue": {
          "maxReplyHour": 4
        },
        "required": ["taskType", "channel"],
        "decoder": {
          "atUpdatedAt": "date"
        }
      },
      "slack-hook": {
        "name": "Slack 綁定設定",
        "auth": "default",
        "map": {
          "channel": "頻道名",
          "webhook": "Webhook",
          "atUpdatedAt": "最後更新時間"
        },
        "required": ["channel", "webhook"],
        "decoder": {
          "atUpdatedAt": "date"
        }
      },
      "ticket-state": {
        "name": "內外狀態對照",
        "auth": "default",
        "map": {
          "internalState": "內部狀態",
          "externalState": "外部狀態",
          "atUpdatedAt": "最後更新時間"
        },
        "required": ["internalState", "externalState"],
        "decoder": {
          "atUpdatedAt": "date"
        }
      },
      "holiday": {
        "name": "假日清單",
        "auth": "default",
        "map": {
          "targetDate": "日期",
          "isNotHoliday": "不是放假日",
          "atUpdatedAt": "最後更新時間"
        },
        "required": ["targetDate"],
        "defaultValue": {
          "isNotHoliday": false
        },
        "decoder": {
          "targetDate": "dateOnly",
          "atUpdatedAt": "date"
        }
      }
    }
  },
  "db": "DATABASE_URL",
  "logSql": false
}
