Merge branch 'opencv-include-dirs' of https://github.com/rrrapha/frei0r

15 jobs for master in 5 minutes and 3 seconds (queued for 1 second)
latest
Status Job ID Name Coverage
  Test
failed #156844371
centos-6

00:01:53

passed #156844372
centos-7

00:03:46

passed #156844370
debian-oldoldstable

00:02:40

passed #156844369
debian-oldstable

00:04:30

passed #156844368
debian-stable

00:03:46

passed #156844367
debian-testing

00:04:56

passed #156844380
fedora-26

00:05:00

passed #156844376
fedora-27

00:04:58

passed #156844374
fedora-28

00:04:22

passed #156844373
fedora-29

00:04:06

passed #156844362
ubuntu-daily

00:04:24

passed #156844363
ubuntu-latest

00:04:23

passed #156844366
ubuntu-lts-1

00:03:57

passed #156844365
ubuntu-lts-2

00:03:36

passed #156844364
ubuntu-lts-3

00:04:11

 
Name Stage Failure
failed
centos-6 Test
/builds/ddennedy/frei0r/src/filter/facebl0r/facebl0r.cpp:223: error: 'CV_AA' was not declared in this scope
/builds/ddennedy/frei0r/src/filter/facebl0r/facebl0r.cpp:223: error: 'cvEllipseBox' was not declared in this scope
/builds/ddennedy/frei0r/src/filter/facebl0r/facebl0r.cpp:232: error: 'cvReleaseImage' was not declared in this scope
/builds/ddennedy/frei0r/src/filter/facebl0r/facebl0r.cpp: At global scope:
/builds/ddennedy/frei0r/src/filter/facebl0r/facebl0r.cpp:236: error: expected constructor, destructor, or type conversion before '*' token
make[2]: *** [src/filter/facebl0r/CMakeFiles/facebl0r.dir/facebl0r.cpp.o] Error 1
make[1]: *** [src/filter/facebl0r/CMakeFiles/facebl0r.dir/all] Error 2
make: *** [all] Error 2
ERROR: Job failed: exit code 2