INDEX VERSION 1.131+C:\workspaces\Demo\.metadata\.plugins\org.eclipse.jdt.core
2742931748.index
3807845862.index
1271634057.index
1086560609.index
3374098895.index
541392830.index
2359694446.index
772083939.index
1253370108.index
785851927.index
748812418.index
3527686652.index
3048437614.index
190770973.index
542346319.index
3121172476.index
797776410.index
1854319078.index
824093056.index
1919687628.index
3028252794.index
2665271029.index
2556674410.index
146207104.index
2621136507.index
1735605723.index
4010101956.index
2658633549.index
551238437.index
3567848143.index
1916546005.index
513476173.index
2872573028.index
2126981749.index
1904803213.index
3151795754.index
3563978874.index
3898983786.index
2784701811.index
1994937678.index
3847751890.index
457401642.index
3577523350.index
69318181.index
1110022667.index
3062077417.index
2542404528.index
4270895801.index
1445756217.index
2675244250.index
3688349788.index
1547849355.index
1137586331.index
2978823008.index
3775771224.index
403390861.index
2875434323.index
3556017859.index
1552897856.index
1590186619.index
3500294095.index
3732113291.index
514689112.index
3495012393.index
2394036851.index
204597072.index
2008294658.index
518009325.index
764166608.index
3641191352.index
3131317237.index
682967301.index
2928416212.index
671646357.index
1110712633.index
714677194.index
1995984205.index
302347545.index
2855419957.index
2902642068.index
2984065131.index
1256131983.index
2713664318.index
426055450.index
367338442.index
2400933.index
2374811621.index
1345470732.index
3917967179.index
1645627478.index
2873391539.index
2612984307.index
2024043779.index
1797232099.index
1272246628.index
1871872430.index
4102496329.index
2539674871.index
3979070288.index
1101008088.index
2285424760.index
2410752360.index
2914796617.index
3037110605.index
158216127.index
1809631493.index
2516676828.index
899302040.index
918478661.index
3523797179.index
3347782875.index
3396245595.index
2100637845.index
4006223209.index
2295967931.index
4021004463.index
4003712059.index
4238485571.index
1502465956.index
174135943.index
1388195951.index
899943710.index
1679476288.index
3812991853.index
4057282816.index
3333315903.index
680489534.index
107542445.index
710148341.index
3907104342.index
599048730.index
2467194831.index
1441458516.index
2722265044.index
3805681247.index
1080003481.index
1576731030.index
416481339.index
2720357449.index
1909391502.index
2545929311.index
857974324.index
3219961921.index
3234819559.index
1424423218.index
3436568794.index
2327638744.index
1346860949.index
1613029889.index
2470816848.index
1743757348.index
2669737019.index
2503546752.index
4025731953.index
4099508759.index
2262101162.index
2891730552.index
1664709129.index
1378020546.index
3964918386.index
726392061.index
1002967649.index
2328269416.index
148345796.index
2377268663.index
2887380151.index
2432493166.index
248186049.index
1923104081.index
2325571450.index
2946727385.index
171211682.index
1694745331.index
1176999492.index
3303740307.index
1263004474.index
558432878.index
592738078.index
2475411825.index
3077708606.index
3523862395.index
20712537.index
1035963589.index
785982088.index
4273522643.index
845589781.index
824183594.index
2297179982.index
1610437282.index
2536928089.index
3771083378.index
2053543293.index
1907843611.index
2287748317.index
3274766217.index
3491901225.index
2200214677.index
2266635955.index
2819072720.index
697842534.index
2601212126.index
3087129319.index
4238487339.index
2242245668.index
415842316.index
164650437.index
3777348616.index
3223097361.index
2288685942.index
3444656809.index
1541755224.index
1719556692.index
4105274247.index
3914003891.index
1694639821.index
3879592213.index
597481323.index
1730382050.index
1668566618.index
3569135661.index
3166161859.index
3388006031.index
593280097.index
3727798163.index
630116512.index
1695021952.index
2930162362.index
3200580812.index
5995724.index
4138803274.index
3233827956.index
254013266.index
1471327203.index
2381664476.index
1200832759.index
1616382032.index
1032439154.index
2144620665.index
1843790161.index
999462756.index
3098297829.index
2475643218.index
475010939.index
3495698727.index
480680048.index
513157578.index
2865785620.index
2854627852.index
693929110.index
3771440165.index
2711662345.index
761372492.index
4189959383.index
2785853238.index
3242341350.index
1273561994.index
3320866521.index
973851559.index
335090409.index
2389354611.index
3334303273.index
303557457.index
3917897045.index
716026007.index
1116080196.index
3383807899.index
3965671956.index
1141428367.index
1620667193.index
3435804427.index
3385296594.index
3524742652.index
3169783336.index
1050056570.index
2704612968.index
3567785036.index
3475512467.index
2398130206.index
1698431369.index
1756088406.index
1334611064.index
2769619816.index
3034239198.index
2911114533.index
4215115066.index
3328134145.index
144518004.index
286370831.index
1306884168.index
2501425002.index
664637445.index
2826025317.index
3854484686.index
177818830.index
1645954482.index
4255108893.index
2454790445.index
3742185689.index
2589396013.index
3268937246.index
2776222742.index
269929904.index
1562546185.index
846769575.index
2153180641.index
2082387089.index
2723215140.index
1051545954.index
1468550836.index
573197411.index
2695438353.index
1418274822.index
4201097399.index
1403580257.index
1915861922.index
2008194867.index
1549702842.index
3561585344.index
1687794368.index
333889062.index
413788303.index
