Division,WeightClassKg,Place,Name,Team,BodyweightKg,Best3SquatKg,Best3BenchKg,Best3DeadliftKg,TotalKg,Equipment,Event,Sex
Boys,51.71,1,Eli DeHoyos,Brady,49.9,145.15,86.18,151.95,383.29,Single-ply,SBD,M
Boys,51.71,2,Johnny Gomez,Rocksprings,51.44,140.61,83.91,145.15,369.68,Single-ply,SBD,M
Boys,51.71,3,Mark Valdez,Brady,45.36,95.25,52.16,117.93,265.35,Single-ply,SBD,M
Boys,51.71,4,Cody McBee,Brady,45.81,86.18,43.09,90.72,219.99,Single-ply,SBD,M
Boys,55.79,1,Marshall Schmitz,Brady,55.61,151.95,83.91,161.03,396.89,Single-ply,SBD,M
Boys,55.79,2,Preston Fox,Lampasas,53.98,142.88,95.25,149.69,387.82,Single-ply,SBD,M
Boys,55.79,3,Kyle Arriola,Lampasas,55.7,136.08,88.45,147.42,371.95,Single-ply,SBD,M
Boys,55.79,4,Houston Tucker,Hamilton,55.52,142.88,72.57,142.88,358.34,Single-ply,SBD,M
Boys,55.79,5,Ashton Henderson,Brady,55.7,124.74,79.38,138.35,342.46,Single-ply,SBD,M
Boys,55.79,6,Luis Ortiz,Brownwood,54.52,117.93,63.5,127.01,308.44,Single-ply,SBD,M
Boys,55.79,7,Radek Spatz,Miles,53.52,124.74,58.97,113.4,297.1,Single-ply,SBD,M
Boys,55.79,8,Kyler Pitre,Brady,53.98,95.25,58.97,115.67,269.89,Single-ply,SBD,M
Boys,55.79,9,Cody Gambert,Ingram Moore,52.89,97.52,58.97,102.06,258.55,Single-ply,SBD,M
Boys,55.79,DQ,Xavier Nava,Brownwood,55.61,167.83,90.72,,,Single-ply,SBD,M
Boys,59.87,1,Tye'Rus Jones,Brownwood,58.88,163.29,102.06,172.37,437.72,Single-ply,SBD,M
Boys,59.87,2,Zach Kelley,Early,58.24,136.08,102.06,136.08,374.21,Single-ply,SBD,M
Boys,59.87,3,Brandon Sisson,Bangs,58.97,106.59,61.23,145.15,312.98,Single-ply,SBD,M
Boys,59.87,4,Eloy Trevino,Eldorado,56.34,99.79,61.23,117.93,278.96,Single-ply,SBD,M
Boys,67.13,1,Blake Pettit,Hamilton,67.13,183.7,92.99,192.78,469.47,Single-ply,SBD,M
Boys,67.13,2,Anthony Larrea,Brownwood,67.04,174.63,104.33,170.1,449.06,Single-ply,SBD,M
Boys,67.13,3,Seth Anderson,Bangs,65.32,172.37,97.52,172.37,442.25,Single-ply,SBD,M
Boys,67.13,4,Noel Outlaw,Brownwood,67.04,156.49,102.06,174.63,433.18,Single-ply,SBD,M
Boys,67.13,5,Quint Pincelli,Llano,65.41,149.69,99.79,179.17,428.64,Single-ply,SBD,M
Boys,67.13,6,Damian Willbourn,Ballinger,65.23,151.95,81.65,172.37,405.97,Single-ply,SBD,M
Boys,67.13,7,Drake Martinez,Junction,61.33,151.95,102.06,149.69,403.7,Single-ply,SBD,M
Boys,67.13,8,Logan Wheeler,Blanket,66.77,142.88,86.18,170.1,399.16,Single-ply,SBD,M
Boys,67.13,9,Benjamin Galindo,Brady,63.5,154.22,83.91,151.95,390.09,Single-ply,SBD,M
Boys,67.13,10,Jett Huffman,Marble Falls,65.68,151.95,79.38,156.49,387.82,Single-ply,SBD,M
Boys,67.13,11,Jonathan Morales,Early,67.13,151.95,90.72,142.88,385.55,Single-ply,SBD,M
Boys,67.13,12,Anthony Seider,Lometa,64.59,131.54,79.38,167.83,378.75,Single-ply,SBD,M
Boys,67.13,13,Brandon Robinson,Bangs,65.95,131.54,88.45,158.76,378.75,Single-ply,SBD,M
Boys,67.13,14,Caleb Galindo,Brady,63.96,142.88,81.65,151.95,376.48,Single-ply,SBD,M
Boys,67.13,15,Paco Ramirez,Rocksprings,64.23,124.74,77.11,138.35,340.19,Single-ply,SBD,M
Boys,67.13,16,Dylan Diaz,Coleman,65.77,120.2,86.18,127.01,333.39,Single-ply,SBD,M
Boys,67.13,17,Garrett Dixon,Llano,65.14,124.74,77.11,124.74,326.59,Single-ply,SBD,M
Boys,67.13,18,Fidel Castaneda,Bangs,61.33,127.01,63.5,122.47,312.98,Single-ply,SBD,M
Boys,67.13,DQ,Anthony Olivares,Eldorado,66.04,179.17,,,,Single-ply,SBD,M
Boys,74.84,1,Sean Williams,Lampasas,71.67,249.48,136.08,231.33,616.89,Single-ply,SBD,M
Boys,74.84,2,Diego Pérez,Rocksprings,74.57,204.12,131.54,185.97,521.63,Single-ply,SBD,M
Boys,74.84,3,Jack Jerome,Lampasas,68.67,195.04,120.2,190.51,505.76,Single-ply,SBD,M
Boys,74.84,4,Eloy Castillo,Brownwood,72.21,170.1,120.2,208.65,498.95,Single-ply,SBD,M
Boys,74.84,5,Nate Martin,Early,74.75,190.51,113.4,185.97,489.88,Single-ply,SBD,M
Boys,74.84,6,Michael Cornish,Lampasas,72.76,190.51,99.79,197.31,487.61,Single-ply,SBD,M
Boys,74.84,7,Elias Luna,Eldorado,73.48,158.76,88.45,170.1,417.3,Single-ply,SBD,M
Boys,74.84,8,Daniel Hernandez,Brady,73.94,151.95,79.38,174.63,405.97,Single-ply,SBD,M
Boys,74.84,9,Jason Andrews,Lampasas,68.76,136.08,99.79,158.76,394.63,Single-ply,SBD,M
Boys,74.84,10,Jesson Tarrant,Early,72.67,147.42,97.52,145.15,390.09,Single-ply,SBD,M
Boys,74.84,11,Ethan LeGrande,Hamilton,69.13,142.88,79.38,161.03,383.29,Single-ply,SBD,M
Boys,74.84,12,Jake Self,Llano,70.31,147.42,88.45,147.42,383.29,Single-ply,SBD,M
Boys,74.84,13,Dylon Cerda,Ingram Moore,68.04,120.2,79.38,142.88,342.46,Single-ply,SBD,M
Boys,74.84,14,Areben Bullard,Hamilton,68.58,124.74,74.84,142.88,342.46,Single-ply,SBD,M
Boys,74.84,15,Luke Boggess,Ballinger,71.12,124.74,77.11,138.35,340.19,Single-ply,SBD,M
Boys,74.84,16,Mark Johnson,Miles,73.75,111.13,79.38,138.35,328.85,Single-ply,SBD,M
Boys,74.84,DQ,Leroy Garcia,Miles,74.75,,,,,Single-ply,SBD,M
Boys,82.1,1,Luis Coronado,Llano,81.19,242.67,129.27,201.85,573.79,Single-ply,SBD,M
Boys,82.1,2,Jim Fowler,Early,80.01,213.19,117.93,204.12,535.24,Single-ply,SBD,M
Boys,82.1,3,Nolan Keller,Llano,79.83,204.12,122.47,201.85,528.44,Single-ply,SBD,M
Boys,82.1,4,Martin Najera,Hamilton,77.11,204.12,104.33,215.46,523.9,Single-ply,SBD,M
Boys,82.1,5,Daunte Cuffie,Lampasas,80.47,192.78,129.27,197.31,519.36,Single-ply,SBD,M
Boys,82.1,6,Bailey Jones #1,Early,79.29,190.51,124.74,183.7,498.95,Single-ply,SBD,M
Boys,82.1,7,Logan Duggar,Llano,79.47,195.04,95.25,188.24,478.54,Single-ply,SBD,M
Boys,82.1,8,James Young,Hamilton,76.57,170.1,102.06,174.63,446.79,Single-ply,SBD,M
Boys,82.1,9,Andrew Herpeche,Miles,80.38,149.69,106.59,183.7,439.98,Single-ply,SBD,M
Boys,82.1,10,Frankie Villanueva,Eldorado,78.83,165.56,88.45,183.7,437.72,Single-ply,SBD,M
Boys,82.1,11,Mason Baker,Llano,78.2,158.76,97.52,174.63,430.91,Single-ply,SBD,M
Boys,82.1,12,Ricardo Lopez,Ballinger,77.84,115.67,79.38,138.35,333.39,Single-ply,SBD,M
Boys,82.1,13,Adrian Canchola,Marble Falls,75.21,129.27,72.57,122.47,324.32,Single-ply,SBD,M
Boys,82.1,14,Charlie Smith,Bangs,77.84,108.86,70.31,142.88,322.05,Single-ply,SBD,M
Boys,82.1,15,Brock Bettis,Bangs,75.3,102.06,79.38,136.08,317.51,Single-ply,SBD,M
Boys,82.1,DQ,Stuart Cortez,Hamilton,82.01,176.9,111.13,,,Single-ply,SBD,M
Boys,82.1,DQ,Austin Rosales,Coleman,77.56,151.95,,,,Single-ply,SBD,M
Boys,89.81,1,Michael Nguyen,Lampasas,86.64,240.4,158.76,254.01,653.17,Single-ply,SBD,M
Boys,89.81,2,Joe Torres,Brady,86.18,229.06,136.08,201.85,566.99,Single-ply,SBD,M
Boys,89.81,3,Adolph Medina,Ballinger,87.91,204.12,115.67,217.72,537.51,Single-ply,SBD,M
Boys,89.81,4,Aubrey Bucholz,Brady,87.09,195.04,138.35,190.51,523.9,Single-ply,SBD,M
Boys,89.81,5,Colb Henry,Lometa,83.73,165.56,120.2,181.44,467.2,Single-ply,SBD,M
Boys,89.81,6,Hunter Lawrence,Bangs,82.28,188.24,83.91,188.24,460.4,Single-ply,SBD,M
Boys,89.81,7,Cale Wade,Early,85.91,165.56,122.47,172.37,460.4,Single-ply,SBD,M
Boys,89.81,8,Tanner Isom,Blanket,89.36,149.69,108.86,181.44,439.98,Single-ply,SBD,M
Boys,89.81,9,Gage Sikes,Coleman,88,167.83,86.18,167.83,421.84,Single-ply,SBD,M
Boys,89.81,10,Chris Llanas,Miles,84.37,165.56,88.45,165.56,419.57,Single-ply,SBD,M
Boys,89.81,11,Tyler Vaughn,Brady,82.55,138.35,102.06,174.63,415.04,Single-ply,SBD,M
Boys,89.81,12,Hayden King,Bangs,83.1,129.27,74.84,158.76,362.87,Single-ply,SBD,M
Boys,89.81,13,Josh Moreno,Brady,83.01,115.67,68.04,145.15,328.85,Single-ply,SBD,M
Boys,99.79,1,Miguel Elizondo,Early,96.8,267.62,163.29,229.06,659.98,Single-ply,SBD,M
Boys,99.79,2,Liam McGraw,Brownwood,96.16,204.12,136.08,215.46,555.65,Single-ply,SBD,M
Boys,99.79,3,Jacob King,Hamilton,95.16,208.65,102.06,206.38,517.1,Single-ply,SBD,M
Boys,99.79,4,Glenn Thomas,Marble Falls,90.45,206.38,111.13,185.97,503.49,Single-ply,SBD,M
Boys,99.79,5,Riley Richards,Early,99.25,192.78,124.74,183.7,501.22,Single-ply,SBD,M
Boys,99.79,6,Caden Carrizales,Brady,97.84,181.44,131.54,181.44,494.42,Single-ply,SBD,M
Boys,99.79,7,Jadyn Lehde,Early,91.72,185.97,106.59,176.9,469.47,Single-ply,SBD,M
Boys,99.79,8,Brad Robertson,Brownwood,97.89,174.63,106.59,151.95,433.18,Single-ply,SBD,M
Boys,99.79,9,Jose Vasquez,Marble Falls,93.35,136.08,72.57,145.15,353.8,Single-ply,SBD,M
Boys,99.79,10,Mathew Kloepper,Llano,95.07,124.74,83.91,142.88,351.53,Single-ply,SBD,M
Boys,99.79,11,Samuel Packer,Bangs,90.45,117.93,54.43,133.81,306.17,Single-ply,SBD,M
Boys,99.79,DQ,Coleton Williams,Miles,97.98,120.2,117.93,,,Single-ply,SBD,M
Boys,109.77,1,Ray Dixon,Llano,107.32,222.26,154.22,249.48,625.96,Single-ply,SBD,M
Boys,109.77,2,Rudy Esparza,Lampasas,106.32,226.8,140.61,238.14,605.55,Single-ply,SBD,M
Boys,109.77,3,Jeremy Rodgers,Lampasas,104.24,204.12,124.74,235.87,564.72,Single-ply,SBD,M
Boys,109.77,4,Brady Herbst,Junction,103.06,217.72,147.42,192.78,557.92,Single-ply,SBD,M
Boys,109.77,5,Astin Carr,Hamilton,103.78,204.12,124.74,183.7,512.56,Single-ply,SBD,M
Boys,109.77,6,Christian Molina,Brady,106.59,190.51,117.93,185.97,494.42,Single-ply,SBD,M
Boys,109.77,7,Nate Richards,Marble Falls,107.77,163.29,95.25,163.29,421.84,Single-ply,SBD,M
Boys,109.77,DQ,Phillip Garcia,Eldorado,101.6,127.01,77.11,,,Single-ply,SBD,M
Boys,124.74,1,Dakoda Trull,Llano,117.34,353.8,195.04,278.96,827.81,Single-ply,SBD,M
Boys,124.74,2,Theo Bryant,Brownwood,122.2,254.01,113.4,217.72,585.13,Single-ply,SBD,M
Boys,124.74,3,Albert Arispe,Eldorado,110.59,224.53,129.27,226.8,580.6,Single-ply,SBD,M
Boys,124.74,4,Luke Williams,Llano,114.21,217.72,131.54,206.38,555.65,Single-ply,SBD,M
Boys,124.74,5,Chase Cochran,Early,114.67,204.12,142.88,201.85,548.85,Single-ply,SBD,M
Boys,124.74,6,Ernesto Castaneda,Marble Falls,116.75,204.12,111.13,181.44,496.68,Single-ply,SBD,M
Boys,124.74,7,Chris Slaughter,Ingram Moore,115.94,158.76,102.06,156.49,417.3,Single-ply,SBD,M
Boys,124.74,8,Mason Moresco,Lometa,110.68,147.42,88.45,156.49,392.36,Single-ply,SBD,M
Boys,124.74,DQ,Jason Carillo,Rocksprings,122.02,,,,,Single-ply,SBD,M
Boys,124.74,DQ,Jayden Hostetter,Ballinger,115.03,174.63,,,,Single-ply,SBD,M
Boys,124.74,DQ,Divad Briones,Ballinger,113.13,,,,,Single-ply,SBD,M
Boys,124.74+,1,Brody Adams,Junction,137.53,226.8,142.88,204.12,573.79,Single-ply,SBD,M
Boys,124.74+,2,Tyler Johnson,Lampasas,140.34,238.14,108.86,195.04,542.04,Single-ply,SBD,M
Boys,124.74+,3,Danny Hernandez,Ingram Moore,135.71,183.7,127.01,208.65,519.36,Single-ply,SBD,M
Boys,124.74+,4,Jayln Jones,Brownwood,129.64,219.99,104.33,183.7,508.02,Single-ply,SBD,M
Boys,,NS,Simon Guzman,Brady,,,,,,Single-ply,SBD,M
Boys,,NS,Will Mays,Brady,,,,,,Single-ply,SBD,M
