Division,WeightClassKg,Place,Name,Team,BodyweightKg,Best3SquatKg,Best3BenchKg,Best3DeadliftKg,TotalKg,Equipment,Event,Sex
Boys,55.79,1,Philip Alvarado,Blanco,51.94,136.08,79.38,142.88,358.34,Single-ply,SBD,M
Boys,55.79,2,Jose Lopez,Godley,51.94,122.47,72.57,161.03,356.07,Single-ply,SBD,M
Boys,51.71,3,Jake Roberston,Clifton,49.8,138.35,74.84,127.01,340.19,Single-ply,SBD,M
Boys,51.71,4,Randy Salinas,Bangs,51.62,122.47,72.57,140.61,335.66,Single-ply,SBD,M
Boys,51.71,5,Jorge Pedroza,Little River Academy,48.44,117.93,72.57,129.27,319.78,Single-ply,SBD,M
Boys,51.71,6,Jhovanny Gutierrez,Hearne,51.07,113.4,58.97,131.54,303.91,Single-ply,SBD,M
Boys,51.71,7,Brian Pafford,Godley,50.53,120.2,70.31,111.13,301.64,Single-ply,SBD,M
Boys,51.71,8,Cody Villa,Crawford,50.71,99.79,77.11,124.74,301.64,Single-ply,SBD,M
Boys,51.71,9,Josh Chorenziak,Hamilton,50.8,102.06,83.91,111.13,297.1,Single-ply,SBD,M
Boys,51.71,DQ,Colten Niemeier,Crawford,41.1,102.06,52.16,108.86,,Single-ply,SBD,M
Boys,55.79,1,D'Montre Brown,Cameron Yoe,55.7,174.63,108.86,188.24,471.74,Single-ply,SBD,M
Boys,55.79,2,Colton Russell,Bosqueville,55.43,183.7,92.99,172.37,449.06,Single-ply,SBD,M
Boys,55.79,3,Isaiah Lombrana,Brady,55.79,172.37,102.06,158.76,433.18,Single-ply,SBD,M
Boys,55.79,4,Gabe Senegal,Little River Academy,54.52,156.49,97.52,176.9,430.91,Single-ply,SBD,M
Boys,55.79,5,Baldomero Sanchez,Riesel,55.61,147.42,81.65,163.29,392.36,Single-ply,SBD,M
Boys,59.87,6,Colby Esparza,Little River Academy,55.88,127.01,79.38,147.42,353.8,Single-ply,SBD,M
Boys,59.87,7,Saul Cervantes,San Saba,55.97,136.08,74.84,140.61,351.53,Single-ply,SBD,M
Boys,55.79,8,Nimo Vega,San Saba,55.43,127.01,74.84,147.42,349.27,Single-ply,SBD,M
Boys,59.87,9,Jonathan Taylor,Lingleville,56.02,129.27,65.77,149.69,344.73,Single-ply,SBD,M
Boys,59.87,1,Sean Gibson,Whitney,59.24,170.1,104.33,197.31,471.74,Single-ply,SBD,M
Boys,59.87,2,Luis Juarez,Bosqueville,58.97,176.9,104.33,188.24,469.47,Single-ply,SBD,M
Boys,67.13,3,Jesse Berry,Crawford,60.06,172.37,99.79,176.9,449.06,Single-ply,SBD,M
Boys,59.87,4,Dakota Murray,Brady,59.51,179.17,81.65,181.44,442.25,Single-ply,SBD,M
Boys,67.13,5,Walker Shelton,Tolar,60.06,176.9,88.45,176.9,442.25,Single-ply,SBD,M
Boys,67.13,6,Jose Morantes,Dublin,60.06,156.49,102.06,183.7,442.25,Single-ply,SBD,M
Boys,59.87,7,Corey Crowell,Bangs,59.69,158.76,99.79,158.76,417.3,Single-ply,SBD,M
Boys,59.87,8,Ricardo Pina,Comanche,59.15,149.69,90.72,170.1,410.5,Single-ply,SBD,M
Boys,59.87,9,Austin Gilbert,Whitney,59.42,133.81,79.38,161.03,374.21,Single-ply,SBD,M
Boys,59.87,10,Keith Langford,Riesel,58.97,136.08,72.57,158.76,367.41,Single-ply,SBD,M
Boys,67.13,1,Levi Bamber,Dublin,66.13,242.67,158.76,215.46,616.89,Single-ply,SBD,M
Boys,67.13,2,Jesus Jaimes,Riesel,64.86,235.87,145.15,215.46,596.47,Single-ply,SBD,M
Boys,67.13,3,Zeph Valdez,Brady,66.68,176.9,136.08,185.97,498.95,Single-ply,SBD,M
Boys,67.13,4,Chris Sosebee,Whitney,65.68,181.44,127.01,188.24,496.68,Single-ply,SBD,M
Boys,67.13,5,Alex Kyner,Thrall,66.22,183.7,113.4,183.7,480.81,Single-ply,SBD,M
Boys,67.13,6,Dylan Haralson,Axtell,66.22,197.31,83.91,181.44,462.66,Single-ply,SBD,M
Boys,67.13,7,Dakotta Thomas,Clifton,67.04,170.1,92.99,192.78,455.86,Single-ply,SBD,M
Boys,67.13,DQ,Zac Beyer,Bosqueville,66.77,181.44,,,,Single-ply,SBD,M
Boys,67.13,DQ,Michael Kohl,Rosebud-Lott,67.04,,,,,Single-ply,SBD,M
Boys,74.84,1,Allan Hale,San Saba,73.75,215.46,138.35,222.26,576.06,Single-ply,SBD,M
Boys,74.84,2,Darius Battles,Hempstead,71.21,204.12,142.88,215.46,562.45,Single-ply,SBD,M
Boys,74.84,3,Victor Moya,Jarrell,74.3,197.31,136.08,215.46,548.85,Single-ply,SBD,M
Boys,74.84,4,Tom Lawless,Rogers,74.12,215.46,115.67,215.46,546.58,Single-ply,SBD,M
Boys,74.84,5,Masen Lindner,Comfort,74.12,185.97,142.88,201.85,530.7,Single-ply,SBD,M
Boys,74.84,6,Omar Saavedra,Jarrell,74.12,192.78,127.01,190.51,510.29,Single-ply,SBD,M
Boys,74.84,7,Jake Gravell,Bangs,73.48,190.51,115.67,195.04,501.22,Single-ply,SBD,M
Boys,74.84,8,Andrew Quintanna,Bangs,73.39,195.04,99.79,204.12,498.95,Single-ply,SBD,M
Boys,74.84,DQ,Jimmy Struble,Florence,73.3,201.85,99.79,,,Single-ply,SBD,M
Boys,74.84,DQ,Alex Cervantes,San Saba,68.49,226.8,117.93,,,Single-ply,SBD,M
Boys,82.1,1,Damion Kozak,Bremond,78.02,242.67,158.76,226.8,628.23,Single-ply,SBD,M
Boys,82.1,2,Marcus Cardenez,Jarrell,81.74,244.94,147.42,222.26,614.62,Single-ply,SBD,M
Boys,82.1,3,Josh Beckwith,Bangs,80.92,238.14,142.88,215.46,596.47,Single-ply,SBD,M
Boys,82.1,4,Hunter Fritscher,Crawford,77.29,249.48,136.08,204.12,589.67,Single-ply,SBD,M
Boys,82.1,5,Jacob Hodges,Brady,80.83,226.8,136.08,210.92,573.79,Single-ply,SBD,M
Boys,82.1,6,Aaron Werlein,Luling,82.1,226.8,120.2,219.99,566.99,Single-ply,SBD,M
Boys,82.1,7,John Lawless,Rogers,78.83,226.8,117.93,217.72,562.45,Single-ply,SBD,M
Boys,82.1,8,Jacob Beckwith,Bangs,79.92,222.26,129.27,197.31,548.85,Single-ply,SBD,M
Boys,82.1,9,Saul Lopez,Comanche,78.65,206.38,120.2,206.38,532.97,Single-ply,SBD,M
Boys,82.1,10,Salvador Marquez,Comanche,80.65,201.85,111.13,201.85,514.83,Single-ply,SBD,M
Boys,82.1,DQ,Zack Bosquez,Comfort,80.83,181.44,120.2,195.04,,Single-ply,SBD,M
Boys,89.81,1,Chris Hubnik,Rogers,89.18,281.23,174.63,251.74,707.6,Single-ply,SBD,M
Boys,89.81,2,Brody Jones,Crawford,88.18,267.62,151.95,215.46,635.03,Single-ply,SBD,M
Boys,89.81,3,Christian Bosquez,Bangs,88.45,242.67,145.15,231.33,619.15,Single-ply,SBD,M
Boys,89.81,4,Zayne Gumler,Tolar,88.81,242.67,97.52,240.4,580.6,Single-ply,SBD,M
Boys,89.81,5,Chris Olsen,Crawford,83.82,204.12,124.74,217.72,546.58,Single-ply,SBD,M
Boys,89.81,6,Martinez Tyler,Axtell,85.09,226.8,111.13,206.38,544.31,Single-ply,SBD,M
Boys,89.81,7,Mason LeBlanc,Blanco,82.64,219.99,111.13,204.12,535.24,Single-ply,SBD,M
Boys,89.81,8,Kirkland Weaver,Brady,88.27,229.06,99.79,183.7,512.56,Single-ply,SBD,M
Boys,89.81,DQ,Shaun McGrew,Hearne,83.82,215.46,111.13,,,Single-ply,SBD,M
Boys,89.81,DQ,Chris Dominquez,Sidney,82.83,,,,,Single-ply,SBD,M
Boys,99.79,1,John Maddigan,Rosebud-Lott,96.16,267.62,154.22,254.01,675.85,Single-ply,SBD,M
Boys,99.79,2,Joel Elizondo,Comanche,95.44,263.08,149.69,233.6,646.37,Single-ply,SBD,M
Boys,99.79,3,Omar Cardoso,Waco Reicher Catholic,96.34,258.55,127.01,251.74,637.3,Single-ply,SBD,M
Boys,99.79,4,Gabe Guillen,Luling,98.61,235.87,163.29,226.8,625.96,Single-ply,SBD,M
Boys,99.79,5,Kevin Abercrombie,Little River Academy,98.16,256.28,131.54,215.46,603.28,Single-ply,SBD,M
Boys,99.79,6,Ej Waggy,Rogers,95.71,249.48,136.08,213.19,598.74,Single-ply,SBD,M
Boys,99.79,7,Austin Brewer,Clifton,93.8,224.53,129.27,238.14,591.94,Single-ply,SBD,M
Boys,99.79,8,Jerry Taft,Godley,99.06,235.87,136.08,215.46,587.4,Single-ply,SBD,M
Boys,99.79,9,Joseph Reddick,Riesel,96.16,233.6,145.15,185.97,564.72,Single-ply,SBD,M
Boys,99.79,DQ,Josh Freeman,Hubbard,94.08,249.48,145.15,,,Single-ply,SBD,M
Boys,99.79,DQ,La Villareal,Brady,92.62,217.72,145.15,,,Single-ply,SBD,M
Boys,109.77,1,Riley Hubert,McGregor,101.33,285.76,145.15,226.8,657.71,Single-ply,SBD,M
Boys,109.77,2,Trevon Williams,Rosebud-Lott,103.87,249.48,140.61,233.6,623.69,Single-ply,SBD,M
Boys,109.77,3,Orlando Ordonez,Luling,108.68,256.28,156.49,208.65,621.42,Single-ply,SBD,M
Boys,109.77,4,Omar Ordonez,Luling,108.05,249.48,158.76,210.92,619.15,Single-ply,SBD,M
Boys,109.77,5,Tyler Gibson,Luling,106.41,240.4,136.08,233.6,610.08,Single-ply,SBD,M
Boys,109.77,6,Michael McKinnerney,San Saba,108.23,222.26,136.08,242.67,601.01,Single-ply,SBD,M
Boys,109.77,7,Shane Sibila,Clifton,102.15,226.8,131.54,208.65,566.99,Single-ply,SBD,M
Boys,109.77,8,Nathan Amstead,San Saba,104.87,192.78,127.01,201.85,521.63,Single-ply,SBD,M
Boys,109.77,9,Chris Mullens,Clifton,105.87,176.9,122.47,206.38,505.76,Single-ply,SBD,M
Boys,109.77,DQ,Cyle Hickey,Crawford,106.32,215.46,120.2,,,Single-ply,SBD,M
Boys,124.74,1,Luis Ramírez,Waco Reicher Catholic,111.04,278.96,185.97,249.48,714.41,Single-ply,SBD,M
Boys,124.74,2,Ryan Zdroik,Rogers,119.66,272.16,172.37,258.55,703.07,Single-ply,SBD,M
Boys,124.74,3,Brandon Lane,Tolar,113.13,256.28,158.76,249.48,664.51,Single-ply,SBD,M
Boys,124.74,4,Josh Vela,Brady,113.85,317.51,131.54,215.46,664.51,Single-ply,SBD,M
Boys,124.74,5,Blake Washington,Godley,118.12,254.01,174.63,231.33,659.98,Single-ply,SBD,M
Boys,124.74,6,Trent Andrews,Bosqueville,123.83,281.23,136.08,242.67,659.98,Single-ply,SBD,M
Boys,124.74,7,Hayden Houpt,Whitney,110.5,244.94,158.76,226.8,630.49,Single-ply,SBD,M
Boys,124.74,8,Garrett Evans,Clifton,113.67,249.48,149.69,204.12,603.28,Single-ply,SBD,M
Boys,124.74,9,Alexis Olvera,McGregor,119.66,256.28,131.54,208.65,596.47,Single-ply,SBD,M
Boys,124.74+,1,Luis Robles,Florence,143.24,326.59,181.44,251.74,759.77,Single-ply,SBD,M
Boys,124.74+,2,Brian Cain,Thrall,150.05,301.64,172.37,226.8,700.8,Single-ply,SBD,M
Boys,124.74+,3,Diego Montoya,San Saba,135.99,267.62,165.56,249.48,682.66,Single-ply,SBD,M
Boys,124.74+,4,Kyle Speicher,Godley,132.09,260.82,163.29,226.8,650.91,Single-ply,SBD,M
Boys,124.74+,5,Augie Hinjosa,Whitney,126.73,272.16,142.88,226.8,641.83,Single-ply,SBD,M
Boys,124.74+,6,Grayson Eaton,Little River Academy,150.68,272.16,142.88,226.8,641.83,Single-ply,SBD,M
Boys,124.74+,7,Michael Williams,Dublin,129.55,242.67,161.03,226.8,630.49,Single-ply,SBD,M
Boys,124.74+,8,Tyler Swenson,Clifton,134.17,249.48,156.49,219.99,625.96,Single-ply,SBD,M
Boys,124.74+,9,Dylan Hamilton,Godley,136.71,251.74,151.95,199.58,603.28,Single-ply,SBD,M
Boys,124.74+,10,Dontae Green,Luling,153.77,215.46,117.93,215.46,548.85,Single-ply,SBD,M
