Division,WeightClassKg,Place,Name,Team,BodyweightKg,Best3SquatKg,Best3BenchKg,Best3DeadliftKg,TotalKg,Equipment,Event,Sex
Boys,51.71,1,Joey Adair,Sealy,48.63,145.15,79.38,156.49,381.02,Single-ply,SBD,M
Boys,51.71,2,Johnny Adair,Sealy,50.35,154.22,81.65,145.15,381.02,Single-ply,SBD,M
Boys,51.71,3,Jesse Jarmillo,Smithville,51.53,133.81,77.11,140.61,351.53,Single-ply,SBD,M
Boys,55.79,4,Grady Rhoden,Alvarado,51.89,117.93,54.43,136.08,308.44,Single-ply,SBD,M
Boys,55.79,5,Dominic Garcia,Burnet,51.8,122.47,63.5,120.2,306.17,Single-ply,SBD,M
Boys,51.71,6,Tanner Dodd,Robinson,51.07,108.86,79.38,113.4,301.64,Single-ply,SBD,M
Boys,51.71,7,Pablo Avalos,West,46.08,108.86,63.5,127.01,299.37,Single-ply,SBD,M
Boys,51.71,8,Austin Mueller,China Spring,50.98,106.59,56.7,131.54,294.84,Single-ply,SBD,M
Boys,51.71,DQ,Darius Mallard,Navasota,50.08,,,,,Single-ply,SBD,M
Boys,55.79,1,Michael McIntire,Taylor,55.61,183.7,92.99,176.9,453.59,Single-ply,SBD,M
Boys,55.79,2,Marcos Mendoza,Salado,55.52,156.49,92.99,154.22,403.7,Single-ply,SBD,M
Boys,55.79,3,Ignacio Alvarado,Alvarado,54.98,151.95,72.57,158.76,383.29,Single-ply,SBD,M
Boys,59.87,4,Vinnie Maldanado,Smithville,55.88,131.54,95.25,156.49,383.29,Single-ply,SBD,M
Boys,55.79,5,Ben Teeples,Llano,55.16,127.01,90.72,156.49,374.21,Single-ply,SBD,M
Boys,55.79,6,Tanner Blackwell,Gatesville,55.25,136.08,65.77,149.69,351.53,Single-ply,SBD,M
Boys,55.79,7,Guillermo Olvera,Alvarado,54.7,113.4,68.04,142.88,324.32,Single-ply,SBD,M
Boys,59.87,8,Nathan Smith #9,Glen Rose,55.97,111.13,72.57,138.35,322.05,Single-ply,SBD,M
Boys,59.87,9,Carlin Linnaberry,Glen Rose,55.88,117.93,72.57,124.74,315.25,Single-ply,SBD,M
Boys,59.87,DQ,Willie Ihlenfedt,Caldwell,55.97,154.22,,,,Single-ply,SBD,M
Boys,59.87,1,Brandon Corn,Liberty Hill,59.15,204.12,111.13,199.58,514.83,Single-ply,SBD,M
Boys,59.87,2,Victor Aguilar,Caldwell,56.97,204.12,129.27,176.9,510.29,Single-ply,SBD,M
Boys,59.87,3,Wesley Barnhill,Lorena,58.79,181.44,102.06,172.37,455.86,Single-ply,SBD,M
Boys,59.87,4,Brian Vizuet,Navasota,59.33,154.22,106.59,176.9,437.72,Single-ply,SBD,M
Boys,59.87,5,Brandon Negus,Taylor,59.51,151.95,83.91,170.1,405.97,Single-ply,SBD,M
Boys,59.87,6,Cody Wisdom,Llano,59.51,117.93,68.04,167.83,353.8,Single-ply,SBD,M
Boys,59.87,DQ,Juan Hernández,Mexia,59.6,151.95,79.38,,,Single-ply,SBD,M
Boys,59.87,DQ,Josh McCraw,Gatesville,57.42,206.38,,,,Single-ply,SBD,M
Boys,59.87,DQ,David Salazar,Taylor,59.87,154.22,,,,Single-ply,SBD,M
Boys,59.87,DQ,Codie Hall,Taylor,59.6,154.22,,,,Single-ply,SBD,M
Boys,67.13,1,Tyrell Irby,Waco La Vega,65.23,219.99,138.35,254.01,612.35,Single-ply,SBD,M
Boys,67.13,2,Alex Leos,Robinson,66.59,226.8,120.2,229.06,576.06,Single-ply,SBD,M
Boys,74.84,3,Royal Lucas,Taylor,67.22,176.9,95.25,217.72,489.88,Single-ply,SBD,M
Boys,67.13,4,Rene Rivas,Venus,64.32,174.63,99.79,201.85,476.27,Single-ply,SBD,M
Boys,67.13,5,Jong Hoon Lim,Gatesville,64.95,163.29,104.33,204.12,471.74,Single-ply,SBD,M
Boys,67.13,6,Zach Konieczny,Sealy,65.23,170.1,111.13,179.17,460.4,Single-ply,SBD,M
Boys,67.13,7,Stephen Mitchell,Robinson,66.41,176.9,92.99,185.97,455.86,Single-ply,SBD,M
Boys,67.13,8,Coy Hart,Venus,66.68,185.97,99.79,167.83,453.59,Single-ply,SBD,M
Boys,67.13,DQ,Brandon Marsh,Burleson Centennial,66.32,,,,,Single-ply,SBD,M
Boys,67.13,DQ,Nathan Kalil,China Spring,64.41,,,,,Single-ply,SBD,M
Boys,74.84,1,Jordan Taylor,Waco La Vega,71.49,217.72,136.08,251.74,605.55,Single-ply,SBD,M
Boys,74.84,2,Kendrick Armstead,Navasota,73.66,244.94,136.08,208.65,589.67,Single-ply,SBD,M
Boys,82.1,3,Damian Kozak,Groesbeck,74.93,233.6,142.88,213.19,589.67,Single-ply,SBD,M
Boys,74.84,4,Travis Cooke,China Spring,71.21,195.04,131.54,213.19,539.77,Single-ply,SBD,M
Boys,74.84,5,Colton Sehon,Robinson,73.03,201.85,122.47,206.38,530.7,Single-ply,SBD,M
Boys,74.84,6,DeRon Bullard,Giddings,74.75,181.44,111.13,201.85,494.42,Single-ply,SBD,M
Boys,82.1,7,Collin Cresson,Lorena,75.02,185.97,113.4,181.44,480.81,Single-ply,SBD,M
Boys,74.84,8,Jose Hernandez,China Spring,74.48,176.9,120.2,181.44,478.54,Single-ply,SBD,M
Boys,74.84,DQ,Bradley Krall,Lorena,73.39,,,,,Single-ply,SBD,M
Boys,74.84,DQ,Zach Robinson,Salado,69.76,,,,,Single-ply,SBD,M
Boys,82.1,1,Tyler McCoy,Giddings,78.83,254.01,156.49,231.33,641.83,Single-ply,SBD,M
Boys,82.1,2,Martin Balderas,Groesbeck,80.83,222.26,136.08,231.33,589.67,Single-ply,SBD,M
Boys,82.1,3,Michael Armstrong,China Spring,81.83,222.26,136.08,213.19,571.53,Single-ply,SBD,M
Boys,82.1,4,Hunter Curb,Liberty Hill,77.47,204.12,124.74,210.92,539.77,Single-ply,SBD,M
Boys,82.1,5,Chandler Snodgrass,Lorena,77.56,215.46,113.4,195.04,523.9,Single-ply,SBD,M
Boys,82.1,6,Thomas Ewing,Giddings,79.92,197.31,102.06,215.46,514.83,Single-ply,SBD,M
Boys,82.1,7,Desmond Calhoun,Navasota,82.1,181.44,90.72,240.4,512.56,Single-ply,SBD,M
Boys,82.1,8,Ferrin DeHerrera,China Spring,79.02,158.76,113.4,124.74,396.89,Single-ply,SBD,M
Boys,82.1,DQ,Kohl Gueringer,Robinson,81.37,,,,,Single-ply,SBD,M
Boys,82.1,DQ,Jack Baskin,Lorena,80.01,,,,,Single-ply,SBD,M
Boys,89.81,1,Deon Hutchinson,Giddings,87.45,238.14,142.88,238.14,619.15,Single-ply,SBD,M
Boys,89.81,2,Juan Quintana,Hillsboro,86.82,235.87,170.1,208.65,614.62,Single-ply,SBD,M
Boys,99.79,3,Michael Martin,China Spring,89.9,226.8,136.08,235.87,598.74,Single-ply,SBD,M
Boys,89.81,4,Dustin Westerfield,Waco La Vega,86.91,226.8,129.27,199.58,555.65,Single-ply,SBD,M
Boys,89.81,5,Wayne Onderdonck,Alvarado,85.37,195.04,127.01,226.8,548.85,Single-ply,SBD,M
Boys,89.81,6,Mikey Sellers,Salado,88.27,217.72,127.01,204.12,548.85,Single-ply,SBD,M
Boys,89.81,DQ,Diontre Oliver,Mexia,87.91,188.24,113.4,,,Single-ply,SBD,M
Boys,89.81,DQ,Jonathan Massey,Caldwell,88.09,238.14,,,,Single-ply,SBD,M
Boys,89.81,DQ,Joseph Glenn,Giddings,82.92,,,,,Single-ply,SBD,M
Boys,99.79,1,Rodney Brown,Navasota,95.53,258.55,165.56,272.16,696.26,Single-ply,SBD,M
Boys,99.79,2,Jimmy Johnson,Glen Rose,98.43,272.16,170.1,249.48,691.73,Single-ply,SBD,M
Boys,99.79,3,Edward Barrera,Taylor,97.34,294.84,142.88,219.99,657.71,Single-ply,SBD,M
Boys,99.79,4,Matt Meader,Gatesville,96.89,249.48,136.08,235.87,621.42,Single-ply,SBD,M
Boys,99.79,5,Aj Castillo,Alvarado,97.7,242.67,142.88,226.8,612.35,Single-ply,SBD,M
Boys,99.79,6,Nathan Mallard,Navasota,97.7,233.6,122.47,256.28,612.35,Single-ply,SBD,M
Boys,99.79,7,Damarious Bluntson,Brookshire Royal,95.8,219.99,111.13,226.8,557.92,Single-ply,SBD,M
Boys,99.79,8,Juan Nunez,Caldwell,96.98,226.8,131.54,199.58,557.92,Single-ply,SBD,M
Boys,99.79,9,Patrick Martin,China Spring,97.16,213.19,145.15,197.31,555.65,Single-ply,SBD,M
Boys,99.79,10,Josh Carroll,Waco La Vega,93.89,201.85,106.59,204.12,512.56,Single-ply,SBD,M
Boys,109.77,1,Autra Maxey,Navasota,109.04,276.69,136.08,251.74,664.51,Single-ply,SBD,M
Boys,109.77,2,Justin Oestreich,Llano,102.42,219.99,129.27,244.94,594.21,Single-ply,SBD,M
Boys,109.77,3,Colton Ridley,Gatesville,106.14,240.4,149.69,199.58,589.67,Single-ply,SBD,M
Boys,109.77,4,Jacob Lockhart,China Spring,108.59,226.8,138.35,195.04,560.19,Single-ply,SBD,M
Boys,109.77,DQ,Morgan Hohle,Giddings,109.77,272.16,,,,Single-ply,SBD,M
Boys,109.77,DQ,Jared Thames,Glen Rose,107.95,235.87,,,,Single-ply,SBD,M
Boys,109.77,DQ,Andres Lara,Mexia,106.23,,,,,Single-ply,SBD,M
Boys,109.77,DQ,Kyle Orlando,Navasota,106.05,229.06,,,,Single-ply,SBD,M
Boys,109.77,DQ,Billy Golding,Salado,105.87,231.33,136.08,,,Single-ply,SBD,M
Boys,109.77,DQ,Ki Walker,Waco La Vega,108.32,,,,,Single-ply,SBD,M
Boys,124.74,1,Jesse Burtschell,Sealy,122.74,294.84,249.48,272.16,816.47,Single-ply,SBD,M
Boys,124.74,2,Tyler Klander,West,123.1,278.96,163.29,247.21,689.46,Single-ply,SBD,M
Boys,124.74,3,Zac Perez,Glen Rose,118.93,278.96,158.76,226.8,664.51,Single-ply,SBD,M
Boys,124.74,4,Zach Kelly,Caldwell,117.12,238.14,158.76,229.06,625.96,Single-ply,SBD,M
Boys,124.74,5,Brian Pullen,China Spring,118.48,249.48,145.15,217.72,612.35,Single-ply,SBD,M
Boys,124.74,6,Tony Barraza,Groesbeck,121.47,260.82,129.27,219.99,610.08,Single-ply,SBD,M
Boys,124.74,7,Seth White,Alvarado,119.29,249.48,127.01,208.65,585.13,Single-ply,SBD,M
Boys,124.74,8,Andy McNew,Robinson,118.57,213.19,131.54,195.04,539.77,Single-ply,SBD,M
Boys,124.74,DQ,Joseph Holder,West,118.48,,,,,Single-ply,SBD,M
Boys,124.74,DQ,Dakota Larson,Venus,118.39,233.6,131.54,,,Single-ply,SBD,M
Boys,124.74+,1,Jacob Bohannon,Navasota,132.63,265.35,185.97,242.67,694,Single-ply,SBD,M
Boys,124.74+,2,Allen Hodge,Hillsboro,126.19,238.14,172.37,226.8,637.3,Single-ply,SBD,M
Boys,124.74+,3,Johnathan Ramirez,Giddings,146.69,249.48,167.83,219.99,637.3,Single-ply,SBD,M
Boys,124.74+,4,Shane Murphy,Robinson,150.59,238.14,163.29,206.38,607.81,Single-ply,SBD,M
Boys,124.74+,5,Jonny Rios,Taylor,132.54,226.8,138.35,229.06,594.21,Single-ply,SBD,M
Boys,124.74+,6,Timmy Varela,Bellville,133.08,238.14,140.61,208.65,587.4,Single-ply,SBD,M
Boys,124.74+,7,Dwight Holder,Waco La Vega,126.46,238.14,136.08,190.51,564.72,Single-ply,SBD,M
Boys,124.74+,DQ,Danny Bricker,Giddings,139.53,,,,,Single-ply,SBD,M
Boys,124.74+,DQ,Shiloh Shorten,Liberty Hill,132.99,,,,,Single-ply,SBD,M
Boys,124.74+,DQ,Jaime Gomez,Mexia,149.59,294.84,147.42,,,Single-ply,SBD,M
