Division,WeightClassKg,Place,Name,Team,BodyweightKg,Best3SquatKg,Best3BenchKg,Best3DeadliftKg,TotalKg,Equipment,Event,Sex
Boys,51.71,1,Uriel Rodriguez,Crawford,47.99,129.27,61.23,127.01,317.51,Single-ply,SBD,M
Boys,51.71,2,Seth Solis,Troy,48.35,124.74,70.31,122.47,317.51,Single-ply,SBD,M
Boys,51.71,3,Trevor Koestens,Troy,51.35,113.4,63.5,115.67,292.57,Single-ply,SBD,M
Boys,51.71,4,Jacob Stanford,Riesel,51.35,79.38,45.36,90.72,215.46,Single-ply,SBD,M
Boys,51.71,5,Stephen McNaught,Meridian,47.72,38.56,34.02,61.23,133.81,Single-ply,SBD,M
Boys,55.79,1,Cody Villa,Crawford,54.61,151.95,99.79,190.51,442.25,Single-ply,SBD,M
Boys,55.79,2,Emiliano Mar,Clifton,55.07,117.93,72.57,136.08,326.59,Single-ply,SBD,M
Boys,55.79,3,John Mendoza,Moody,55.7,129.27,61.23,113.4,303.91,Single-ply,SBD,M
Boys,55.79,4,Robby Brewer,Clifton,53.25,97.52,61.23,90.72,249.48,Single-ply,SBD,M
Boys,59.87,5,Ivan Cruz,Moody,55.88,83.91,61.23,86.18,231.33,Single-ply,SBD,M
Boys,67.13,1,Luis Juarez,Bosqueville,59.96,181.44,108.86,192.78,483.08,Single-ply,SBD,M
Boys,59.87,2,Jake Schmidt,Troy,58.97,142.88,97.52,151.95,392.36,Single-ply,SBD,M
Boys,59.87,3,Miguel Contreras,Robinson,56.97,149.69,68.04,163.29,381.02,Single-ply,SBD,M
Boys,59.87,4,Colton Gober,Troy,58.06,102.06,54.43,140.61,297.1,Single-ply,SBD,M
Boys,59.87,5,Brandon Putnam,Moody,59.87,90.72,74.84,111.13,276.69,Single-ply,SBD,M
Boys,59.87,6,Blake Crain,Robinson,59.78,95.25,47.63,120.2,263.08,Single-ply,SBD,M
Boys,59.87,7,Jarred Childers,Meridian,58.79,95.25,70.31,95.25,260.82,Single-ply,SBD,M
Boys,67.13,1,Phillip Carpenter,Waco La Vega,64.41,181.44,79.38,192.78,453.59,Single-ply,SBD,M
Boys,67.13,2,Manuel Rodriguez,Robinson,64.5,181.44,95.25,167.83,444.52,Single-ply,SBD,M
Boys,67.13,3,Eduardo Jaimes,Riesel,66.86,170.1,102.06,163.29,435.45,Single-ply,SBD,M
Boys,67.13,4,Harley Eldridge,Waco Connally,65.86,142.88,95.25,167.83,405.97,Single-ply,SBD,M
Boys,67.13,5,Lucas Steinkamp,Crawford,61.23,149.69,86.18,127.01,362.87,Single-ply,SBD,M
Boys,67.13,6,Sam Cooper,Crawford,61.82,117.93,74.84,136.08,328.85,Single-ply,SBD,M
Boys,67.13,7,Noah Bleything,Crawford,66.95,127.01,74.84,127.01,328.85,Single-ply,SBD,M
Boys,67.13,DQ,Dustin Richter,Bosqueville,62.41,92.99,,127.01,,Single-ply,SBD,M
Boys,67.13,DQ,James Davis,Waco Connally,60.87,165.56,,172.37,,Single-ply,SBD,M
Boys,74.84,1,Devyn Hebbe,Axtell,74.57,210.92,90.72,199.58,501.22,Single-ply,SBD,M
Boys,74.84,2,Gabe Cobos,Riesel,68.4,165.56,92.99,208.65,467.2,Single-ply,SBD,M
Boys,74.84,3,Matt McQueen,Robinson,73.94,192.78,83.91,190.51,467.2,Single-ply,SBD,M
Boys,74.84,4,Alex Smith,Bosqueville,73.12,165.56,83.91,158.76,408.23,Single-ply,SBD,M
Boys,74.84,5,Barclay Brunson,Crawford,71.67,154.22,92.99,154.22,401.43,Single-ply,SBD,M
Boys,74.84,6,Brandon Pelton,Waco La Vega,74.84,142.88,88.45,151.95,383.29,Single-ply,SBD,M
Boys,74.84,7,Ethan Tapia,Robinson,70.13,136.08,92.99,151.95,381.02,Single-ply,SBD,M
Boys,74.84,8,MacKenzie Dulaney,Meridian,72.85,145.15,79.38,142.88,367.41,Single-ply,SBD,M
Boys,74.84,9,Jeremy Grubbs,Robinson,67.49,131.54,81.65,151.95,365.14,Single-ply,SBD,M
Boys,74.84,10,Desmond Harris,Waco Connally,69.49,136.08,79.38,136.08,351.53,Single-ply,SBD,M
Boys,74.84,11,Lance Bracco,Crawford,67.77,115.67,74.84,120.2,310.71,Single-ply,SBD,M
Boys,74.84,12,Nic Welch,Troy,73.94,115.67,72.57,117.93,306.17,Single-ply,SBD,M
Boys,74.84,13,Christian Trigleth,Riesel,67.49,104.33,58.97,115.67,278.96,Single-ply,SBD,M
Boys,74.84,14,Logan Leser,Riesel,69.85,99.79,54.43,117.93,272.16,Single-ply,SBD,M
Boys,82.1,1,James Bradford,Troy,79.29,190.51,142.88,204.12,537.51,Single-ply,SBD,M
Boys,82.1,2,Edmond Marton,Axtell,80.01,204.12,113.4,204.12,521.63,Single-ply,SBD,M
Boys,82.1,3,Juan Villa,Robinson,78.38,192.78,129.27,192.78,514.83,Single-ply,SBD,M
Boys,82.1,4,Dustin Murphy,Clifton,79.65,183.7,122.47,204.12,510.29,Single-ply,SBD,M
Boys,82.1,5,Larry Reid,Robinson,78.38,145.15,108.86,151.95,405.97,Single-ply,SBD,M
Boys,82.1,6,Jaime Reynoso,Meridian,81.56,145.15,90.72,158.76,394.63,Single-ply,SBD,M
Boys,89.81,DQ,Taylor Bradley,Clifton,82.33,151.95,,161.03,,Single-ply,SBD,M
Boys,82.1,DQ,Eric Martinez,Waco La Vega,75.93,158.76,,188.24,,Single-ply,SBD,M
Boys,89.81,1,Brody Jones,Crawford,86.09,240.4,154.22,240.4,635.03,Single-ply,SBD,M
Boys,89.81,2,Dillon Van Zandt,Crawford,87.63,201.85,102.06,199.58,503.49,Single-ply,SBD,M
Boys,89.81,3,Jason Schmidt #1,Clifton,85.82,183.7,104.33,197.31,485.34,Single-ply,SBD,M
Boys,99.79,4,Justin Brown,Waco La Vega,90.04,163.29,122.47,158.76,444.52,Single-ply,SBD,M
Boys,89.81,5,Michael Autenrieth,Waco Connally,82.74,170.1,90.72,167.83,428.64,Single-ply,SBD,M
Boys,89.81,6,Michael Martinez,Robinson,86.73,158.76,92.99,142.88,394.63,Single-ply,SBD,M
Boys,89.81,7,Tim Mosley,Robinson,85.91,136.08,79.38,158.76,374.21,Single-ply,SBD,M
Boys,89.81,8,Josh Ramsey,Meridian,87.77,127.01,86.18,131.54,344.73,Single-ply,SBD,M
Boys,89.81,9,Erick Marton,Axtell,88.81,111.13,88.45,145.15,344.73,Single-ply,SBD,M
Boys,89.81,DQ,Jason Marroquin,Axtell,83.28,,102.06,197.31,,Single-ply,SBD,M
Boys,89.81,DQ,Manoa Rivera,Troy,87.63,201.85,,190.51,,Single-ply,SBD,M
Boys,99.79,1,Ricky Thompson,Robinson,90.26,206.38,117.93,238.14,562.45,Single-ply,SBD,M
Boys,99.79,2,Isaiah Gardea,Clifton,94.35,183.7,136.08,192.78,512.56,Single-ply,SBD,M
Boys,99.79,3,Riley Allen,Robinson,98.61,199.58,131.54,181.44,512.56,Single-ply,SBD,M
Boys,99.79,4,Matt McNew,Robinson,96.16,190.51,127.01,190.51,508.02,Single-ply,SBD,M
Boys,99.79,5,Corey Kemp,Waco La Vega,93.89,190.51,106.59,190.51,487.61,Single-ply,SBD,M
Boys,99.79,6,Matthew Richter,Riesel,93.08,140.61,86.18,190.51,417.3,Single-ply,SBD,M
Boys,99.79,7,Steven Frausto,Waco Connally,95.07,145.15,92.99,165.56,403.7,Single-ply,SBD,M
Boys,99.79,8,Jayden Beck,Troy,93.89,149.69,79.38,136.08,365.14,Single-ply,SBD,M
Boys,99.79,9,Marcus DeLeon,Waco Connally,91.44,136.08,83.91,127.01,347,Single-ply,SBD,M
Boys,99.79,10,Manuel Chavez,Valley Mills,97.52,124.74,63.5,149.69,337.93,Single-ply,SBD,M
Boys,99.79,11,Austin Todaro,Robinson,90.26,120.2,81.65,115.67,317.51,Single-ply,SBD,M
Boys,99.79,DQ,Jesus Garza,Meridian,98.43,,99.79,165.56,,Single-ply,SBD,M
Boys,109.77,1,Chris Robinson,Waco Connally,103.78,272.16,158.76,260.82,691.73,Single-ply,SBD,M
Boys,109.77,2,Ryan de la Garza,Waco Connally,108.59,272.16,145.15,204.12,621.42,Single-ply,SBD,M
Boys,109.77,3,Byron Bryant,Waco La Vega,109.32,226.8,124.74,226.8,578.33,Single-ply,SBD,M
Boys,109.77,4,Kalil Washington,Robinson,100.24,195.04,147.42,226.8,569.26,Single-ply,SBD,M
Boys,109.77,5,Michael Padgett,Troy,104.33,206.38,142.88,158.76,508.02,Single-ply,SBD,M
Boys,124.74,6,Jordan Rivera,Waco La Vega,109.86,172.37,127.01,199.58,498.95,Single-ply,SBD,M
Boys,109.77,7,Vincent Tovar,Waco La Vega,109.77,208.65,127.01,156.49,492.15,Single-ply,SBD,M
Boys,109.77,8,Jarrett Gregory,Troy,106.23,197.31,102.06,181.44,480.81,Single-ply,SBD,M
Boys,109.77,9,Jacob Mata,Clifton,108.86,136.08,108.86,158.76,403.7,Single-ply,SBD,M
Boys,109.77,10,William Robert,Riesel,105.6,140.61,97.52,154.22,392.36,Single-ply,SBD,M
Boys,109.77,11,Dylan Morgan,Riesel,104.24,149.69,102.06,122.47,374.21,Single-ply,SBD,M
Boys,124.74,1,Trent Andrews,Bosqueville,120.11,278.96,145.15,272.16,696.26,Single-ply,SBD,M
Boys,124.74,2,Gustavo Bonilla,Robinson,118.02,231.33,154.22,226.8,612.35,Single-ply,SBD,M
Boys,124.74+,1,Marques Robinson,Waco Connally,138.71,249.48,147.42,231.33,628.23,Single-ply,SBD,M
Boys,124.74+,2,Jordan Allen,Clifton,156.04,249.48,145.15,181.44,576.06,Single-ply,SBD,M
Boys,124.74+,3,Narciso Molina,Waco Connally,129.09,231.33,113.4,167.83,512.56,Single-ply,SBD,M
Boys,124.74+,4,Codi Birch-Harris,Waco Connally,134.35,181.44,92.99,172.37,446.79,Single-ply,SBD,M
Boys,124.74+,5,Traylon Barry,Waco La Vega,134.08,156.49,115.67,158.76,430.91,Single-ply,SBD,M
Boys,124.74+,6,Ryan Alexander,Riesel,130.82,140.61,79.38,136.08,356.07,Single-ply,SBD,M
