Division,WeightClassKg,Place,Name,Team,BodyweightKg,Best3SquatKg,Best3BenchKg,Best3DeadliftKg,TotalKg,Equipment,Event,Sex
Boys,51.71,1,David Palacios,Anahuac,45.81,97.52,63.5,136.08,297.1,Single-ply,SBD,M
Boys,51.71,2,Andre Lockett,Anahuac,44.91,81.65,49.9,106.59,238.14,Single-ply,SBD,M
Boys,51.71,3,Bryan Hill,Coldspring-Oakhurst,44.45,61.23,45.36,83.91,190.51,Single-ply,SBD,M
Boys,55.79,1,Clint Shippey,Cleveland Tarkington,55.79,129.27,70.31,145.15,344.73,Single-ply,SBD,M
Boys,55.79,2,Logan Rhame,Anahuac,52.62,111.13,72.57,117.93,301.64,Single-ply,SBD,M
Boys,59.87,1,Jaken Herman,Cleveland Tarkington,58.06,147.42,65.77,115.67,328.85,Single-ply,SBD,M
Boys,59.87,2,Justin Brown,Cleveland Tarkington,57.15,113.4,56.7,133.81,303.91,Single-ply,SBD,M
Boys,67.13,1,Devonte Outerbridge,Anahuac,63.5,197.31,104.33,179.17,480.81,Single-ply,SBD,M
Boys,67.13,2,John Kimble,Anahuac,60.78,190.51,102.06,165.56,458.13,Single-ply,SBD,M
Boys,67.13,3,Dalton Blum,Cleveland Tarkington,67.13,115.67,108.86,165.56,390.09,Single-ply,SBD,M
Boys,67.13,4,Porter May,Anahuac,66.68,122.47,74.84,140.61,337.93,Single-ply,SBD,M
Boys,74.84,1,Cameron Russell,Cleveland Tarkington,73.94,222.26,129.27,240.4,591.94,Single-ply,SBD,M
Boys,74.84,2,Taylor Kelley,Coldspring-Oakhurst,73.03,176.9,106.59,190.51,474,Single-ply,SBD,M
Boys,74.84,3,Daniel Perrigin,Cleveland Tarkington,71.21,163.29,113.4,172.37,449.06,Single-ply,SBD,M
Boys,74.84,4,John Kirchner,Cleveland Tarkington,73.48,142.88,138.35,161.03,442.25,Single-ply,SBD,M
Boys,74.84,5,James Hvamstad,Anahuac,73.94,158.76,104.33,167.83,430.91,Single-ply,SBD,M
Boys,74.84,6,Jacob Meadows,Coldspring-Oakhurst,71.67,158.76,99.79,151.95,410.5,Single-ply,SBD,M
Boys,82.1,1,Trevin Sechler,Sour Lake Hardin-Jefferson,81.65,217.72,120.2,222.26,560.19,Single-ply,SBD,M
Boys,82.1,2,Jordan Smith,Cleveland Tarkington,81.19,190.51,92.99,219.99,503.49,Single-ply,SBD,M
Boys,82.1,3,Tim Mitchell,Sour Lake Hardin-Jefferson,81.65,181.44,99.79,176.9,458.13,Single-ply,SBD,M
Boys,82.1,4,Chris Conn,Coldspring-Oakhurst,76.2,136.08,102.06,174.63,412.77,Single-ply,SBD,M
Boys,82.1,5,Jonathan Giles,Cleveland Tarkington,78.02,158.76,81.65,154.22,394.63,Single-ply,SBD,M
Boys,89.81,1,Nathan Meyers,Anahuac,88.45,170.1,117.93,176.9,464.93,Single-ply,SBD,M
Boys,89.81,2,Layne Walker,Sour Lake Hardin-Jefferson,88.9,174.63,79.38,181.44,435.45,Single-ply,SBD,M
Boys,89.81,3,Colton Chapman,Cleveland Tarkington,88.45,181.44,95.25,147.42,424.11,Single-ply,SBD,M
Boys,89.81,4,Brandon Franks,Sour Lake Hardin-Jefferson,88.45,138.35,86.18,163.29,387.82,Single-ply,SBD,M
Boys,89.81,5,Greg Ames,Sour Lake Hardin-Jefferson,89.36,113.4,77.11,158.76,349.27,Single-ply,SBD,M
Boys,89.81,6,Colton LaFrance,Cleveland Tarkington,88,136.08,79.38,131.54,347,Single-ply,SBD,M
Boys,99.79,1,Joe Traylor,Coldspring-Oakhurst,98.43,226.8,131.54,222.26,580.6,Single-ply,SBD,M
Boys,99.79,2,Joe Stover,Coldspring-Oakhurst,95.71,201.85,117.93,201.85,521.63,Single-ply,SBD,M
Boys,99.79,3,Cody Carr,Sour Lake Hardin-Jefferson,96.62,113.4,83.91,165.56,362.87,Single-ply,SBD,M
Boys,99.79,4,Shelby Roland,Sour Lake Hardin-Jefferson,93.44,97.52,72.57,124.74,294.84,Single-ply,SBD,M
Boys,109.77,1,Cj Duenas,Coldspring-Oakhurst,107.05,226.8,117.93,226.8,571.53,Single-ply,SBD,M
Boys,109.77,2,Blake Speights,Anahuac,105.23,199.58,145.15,201.85,546.58,Single-ply,SBD,M
Boys,109.77,3,Greg Dunham,Coldspring-Oakhurst,100.7,156.49,102.06,183.7,442.25,Single-ply,SBD,M
Boys,109.77,4,Matt Moses,Sour Lake Hardin-Jefferson,108.86,120.2,83.91,140.61,344.73,Single-ply,SBD,M
Boys,124.74,1,Joseph Defore,Anahuac,110.22,226.8,113.4,226.8,566.99,Single-ply,SBD,M
Boys,124.74,2,Nolan Walker,Coldspring-Oakhurst,122.02,195.04,122.47,197.31,514.83,Single-ply,SBD,M
Boys,124.74,3,Blake Duhon,Anahuac,110.22,210.92,127.01,172.37,510.29,Single-ply,SBD,M
Boys,124.74,4,Jake Oler,Anahuac,118.84,190.51,113.4,181.44,485.34,Single-ply,SBD,M
Boys,124.74+,1,Dontrell Smith,Anahuac,137.44,208.65,122.47,204.12,535.24,Single-ply,SBD,M
Boys,124.74+,2,Dalton Conrad,Coldspring-Oakhurst,125.19,190.51,127.01,197.31,514.83,Single-ply,SBD,M
Boys,124.74+,3,Leroy Powell,Anahuac,130.18,195.04,124.74,192.78,512.56,Single-ply,SBD,M
Boys,124.74+,4,Michael Laughlin,Coldspring-Oakhurst,136.08,127.01,111.13,142.88,381.02,Single-ply,SBD,M
