Division,WeightClassKg,Place,Name,Team,BodyweightKg,Best3SquatKg,Best3BenchKg,Best3DeadliftKg,TotalKg,Equipment,Event,Sex
Boys,51.71,1,Taitten Morales,Burleson,49.99,108.86,54.43,111.13,274.42,Single-ply,SBD,M
Boys,51.71,2,Mathew Howard,Midlothian,51.71,83.91,52.16,113.4,249.48,Single-ply,SBD,M
Boys,59.87,DQ,Cash Brooks,Joshua,59.87,,,,,Single-ply,SBD,M
Boys,67.13,1,Davis Dunn,Burleson Centennial,66.13,176.9,88.45,185.97,451.32,Single-ply,SBD,M
Boys,67.13,2,Diego Gonzales,Midlothian,62.51,145.15,79.38,147.42,371.95,Single-ply,SBD,M
Boys,67.13,3,Chandler Brown,Burleson,62.14,131.54,88.45,147.42,367.41,Single-ply,SBD,M
Boys,67.13,4,Ethan Haynes,Burleson,61.05,131.54,70.31,156.49,358.34,Single-ply,SBD,M
Boys,67.13,5,Lane Brooks,Joshua,65.86,138.35,79.38,133.81,351.53,Single-ply,SBD,M
Boys,67.13,DQ,Bruce Bivens,Joshua,67.13,,,,,Single-ply,SBD,M
Boys,74.84,1,Chris Gomez,Midlothian,67.86,165.56,90.72,138.35,394.63,Single-ply,SBD,M
Boys,74.84,2,Casey Jackson,Burleson,70.67,147.42,74.84,149.69,371.95,Single-ply,SBD,M
Boys,74.84,3,Jerry Vasquez,Burleson Centennial,73.66,117.93,79.38,158.76,356.07,Single-ply,SBD,M
Boys,82.1,1,Jaylen Tort,Burleson,81.65,170.1,117.93,172.37,460.4,Single-ply,SBD,M
Boys,82.1,2,Zane Hairston,Joshua,77.75,151.95,86.18,174.63,412.77,Single-ply,SBD,M
Boys,82.1,DQ,Aaron Martin,North Crowley,80.2,,,,,Single-ply,SBD,M
Boys,89.81,1,Michael Farnsworth,Midlothian,88.9,215.46,122.47,190.51,528.44,Single-ply,SBD,M
Boys,89.81,2,Blake Edgington,Joshua,87.82,176.9,102.06,217.72,496.68,Single-ply,SBD,M
Boys,89.81,3,Andrew Walker,Burleson Centennial,88,190.51,106.59,181.44,478.54,Single-ply,SBD,M
Boys,89.81,4,Dante Marshall,North Crowley,89.54,174.63,117.93,176.9,469.47,Single-ply,SBD,M
Boys,89.81,5,Eric Ortega,Burleson Centennial,89.36,163.29,97.52,183.7,444.52,Single-ply,SBD,M
Boys,89.81,6,Brennan Coulter,Burleson,88.99,149.69,102.06,190.51,442.25,Single-ply,SBD,M
Boys,89.81,7,Sean McKinley,Joshua,82.55,156.49,111.13,170.1,437.72,Single-ply,SBD,M
Boys,89.81,8,Daniel Minchey,Cleburne,88.81,151.95,120.2,163.29,435.45,Single-ply,SBD,M
Boys,89.81,9,Mathu Blanton,Cleburne,86.27,140.61,99.79,158.76,399.16,Single-ply,SBD,M
Boys,89.81,10,Jacob Merrick,Midlothian,82.28,142.88,83.91,154.22,381.02,Single-ply,SBD,M
Boys,89.81,11,Ty Quigley,Midlothian,85.73,142.88,79.38,133.81,356.07,Single-ply,SBD,M
Boys,99.79,1,Hayden Lewis,Burleson,94.08,199.58,129.27,210.92,539.77,Single-ply,SBD,M
Boys,99.79,2,Terrence Patterson,Burleson,93.17,158.76,106.59,199.58,464.93,Single-ply,SBD,M
Boys,99.79,3,Michael Kornak,Burleson Centennial,97.7,167.83,72.57,176.9,417.3,Single-ply,SBD,M
Boys,99.79,4,Blake Jones,North Crowley,98.61,142.88,99.79,165.56,408.23,Single-ply,SBD,M
Boys,99.79,5,Corey Ellis,North Crowley,99.7,163.29,68.04,136.08,367.41,Single-ply,SBD,M
Boys,99.79,6,Tristin Borowski,Burleson,97.43,124.74,63.5,122.47,310.71,Single-ply,SBD,M
Boys,99.79,DQ,Lezra Dews,North Crowley,93.17,142.88,,,,Single-ply,SBD,M
Boys,109.77,1,Jaterrius Pleasant,Burleson,105.32,197.31,122.47,215.46,535.24,Single-ply,SBD,M
Boys,109.77,2,Richard Cuellar,Cleburne,105.32,215.46,120.2,183.7,519.36,Single-ply,SBD,M
Boys,109.77,3,Kale LeMaster,Joshua,102.87,145.15,102.06,183.7,430.91,Single-ply,SBD,M
Boys,109.77,4,Adolio Alaniz,Cleburne,102.15,147.42,95.25,158.76,401.43,Single-ply,SBD,M
Boys,109.77,5,Talwinder Singh,North Crowley,104.42,124.74,92.99,174.63,392.36,Single-ply,SBD,M
Boys,124.74,1,Travis Kleypas,Burleson,115.67,204.12,142.88,215.46,562.45,Single-ply,SBD,M
Boys,124.74,2,Clayton Mitchell,North Crowley,114.49,108.86,90.72,158.76,358.34,Single-ply,SBD,M
Boys,124.74,3,Tyler Washington,North Crowley,120.66,138.35,70.31,147.42,356.07,Single-ply,SBD,M
Boys,124.74+,1,Rae Winter,Burleson,152.04,231.33,140.61,240.4,612.35,Single-ply,SBD,M
Boys,124.74+,2,Tommy Ray,Midlothian,128.09,133.81,72.57,142.88,349.27,Single-ply,SBD,M
Boys,,NS,Colin Nikirk,North Crowley,,,,,,Single-ply,SBD,M
