Name,Age,Sex,Equipment,Division,BodyweightKg,WeightClassKg,Squat1Kg,Squat2Kg,Squat3Kg,Best3SquatKg,Bench1Kg,Bench2Kg,Bench3Kg,Best3BenchKg,Deadlift1Kg,Deadlift2Kg,Deadlift3Kg,Best3DeadliftKg,TotalKg,Event,Place,Tested
Valerija Aliochina,21,F,Raw,F_J_R_ABPU,53.4,56,60,65,72.5,72.5,40,47.5,-52.5,47.5,85,-95,-95,85,205,SBD,1,Yes
Jessica Lane,25,F,Wraps,F_O_CR_ABPU,52,52,60,72.5,82.5,82.5,40,45,-50,45,100,110,115,115,242.5,SBD,1,Yes
Jade Medhurst,16,F,Wraps,F_T2_CR_ABPU,67.5,67.5,75,80,-85,80,35,37.5,-40,37.5,105,110,115,115,232.5,SBD,1,Yes
Amy Hughes,31,F,Wraps,F_O_CR_ABPU,74.4,75,80,90,-100,90,37.5,40,42.5,42.5,110,120,130,130,262.5,SBD,3,Yes
Abbie Morris,19,F,Wraps,F_T3_CR_ABPU,65.7,67.5,110,120,-130,120,52.5,60,-62.5,60,110,120,-130,120,300,SBD,1,Yes
Hannah Holmes,28,F,Raw,F_O_R_ABPU,58.7,60,80,87.5,92.5,92.5,42.5,47.5,52.5,52.5,112.5,117.5,120,120,265,SBD,1,Yes
Caroline Blake,29,F,Raw,F_O_R_ABPU,74.3,75,-80,85,-95,85,47.5,55,-60,55,120,130,137.5,137.5,277.5,SBD,1,Yes
Hannah Anderson,33,F,Wraps,F_O_CR_ABPU,58.3,60,100,110,-115,110,62.5,65,-67.5,65,120,130,137.5,137.5,312.5,SBD,1,Yes
Vicky Ellis,37,F,Raw,F_O_R_ABPU,58.8,60,,,,,55,60,-62.5,60,127.5,135,142.5,142.5,202.5,BD,1,Yes
Fay Northcott,25,F,Wraps,F_O_CR_ABPU,73,75,125,132.5,137.5,137.5,57.5,60,62.5,62.5,140,152.5,160,160,360,SBD,2,Yes
Zsuzsanna Tóth,30,F,Wraps,F_O_CR_ABPU,66.2,67.5,137.5,145,-155,145,62.5,-67.5,-67.5,62.5,152.5,162.5,-167.5,162.5,370,SBD,1,Yes
Robyne Smith,27,F,Wraps,F_O_CR_ABPU,74.1,75,100,110,,110,80,85,90,90,160,170,177.5,177.5,377.5,SBD,1,Yes
Dominique Fisher #1,45,F,Wraps,F_O_CR_BPU,73.2,75,185,195,-202.5,195,80,85,-90,85,170,180,-190,180,460,SBD,1,No
Dominique Fisher #1,45,F,Wraps,F_M2_CR_BPU,73.2,75,185,195,-202.5,195,80,85,-90,85,170,180,-190,180,460,SBD,1,No
Daniel Routledge,22,M,Raw,M_J_R_ABPU,73.9,75,-140,150,160,160,85,-90,-90,85,170,180,-190,180,425,SBD,1,Yes
Harry Sheader,20,M,Wraps,M_J_CR_ABPU,63.7,67.5,-165,-165,-165,,95,102.5,110,110,180,195,205,205,,SBD,DQ,Yes
Matt Morgan #2,31,M,Wraps,M_O_CR_ABPU,73.5,75,-160,-160,160,160,-110,-110,-110,,180,200,-220,200,,SBD,DQ,Yes
John Warburton,30,M,Raw,M_O_R_ABPU,82.2,82.5,100,,,100,120,130,140,140,180,,,180,420,SBD,3,Yes
Mohamed Elsherkisi,18,M,Raw,M_T3_R_BPU,79.2,82.5,145,155,162.5,162.5,110,122.5,127.5,127.5,190,205,210,210,500,SBD,1,No
Jamie Routledge,20,M,Raw,M_J_R_ABPU,80.5,82.5,150,170,-180,170,90,-100,105,105,200,210,-220,210,485,SBD,1,Yes
Dan Oltkam,29,M,Raw,M_O_R_BPU,74.7,75,,,,,125,-132.5,135,135,200,215,-220,215,350,BD,1,No
Greg Marcou,41,M,Wraps,M_M1_CR_BPU,81.3,82.5,200,215,220,220,140,145,150,150,220,235,245,245,615,SBD,1,No
Simon Vickers,35,M,Wraps,M_O_CR_ABPU,79.5,82.5,205,220,230,230,127.5,135,140,140,220,260,272.5,272.5,642.5,SBD,1,Yes
Chris Phelps,30,M,Multi-ply,M_O_M_BPU,75,75,240,-260,-260,240,140,-150,-150,140,240,-250,-250,240,620,SBD,1,No
Phil Evans,27,M,Raw,M_O_R_ABPU,81.4,82.5,200,207.5,-212.5,207.5,100,110,,110,240,250,-255,250,567.5,SBD,2,Yes
Josh Ingram,24,M,Raw,M_O_R_ABPU,82.3,82.5,200,215,220,220,140,147.5,-155,147.5,250,-262.5,-262.5,250,617.5,SBD,1,Yes
Sam Jones,19,M,Wraps,M_T3_CR_BPU,81.3,82.5,190,205,-220,205,127.5,132.5,-137.5,132.5,250,262.5,270,270,607.5,SBD,1,No
Ashley Armstrong #1,22,M,Wraps,M_J_CR_BPU,80.3,82.5,200,220,232.5,232.5,142.5,150,155,155,250,262.5,272.5,272.5,660,SBD,1,No
Mike Hoare,25,M,Raw,M_O_R_BPU,75.4,82.5,210,220,-230,220,135,145,-152.5,145,250,270,285,285,650,SBD,1,No
Morgan Williams,16,M,Raw,M_T2_R_BPU,55.2,56,,,,,60,70,-80,70,,,,,70,B,1,No
Jordan Newman,28,M,Raw,M_O_R_BPU,82.5,82.5,,,,,145,-160,-172.5,145,,,,,145,B,1,No
Charlotte Moore,19,F,Wraps,F_T3_CR_ABPU,77.7,82.5,-75,82.5,92.5,92.5,37.5,-45,-45,37.5,92.5,102.5,110,110,240,SBD,1,Yes
Kerry Jones,30,F,Raw,F_O_CR_BPU,80.7,82.5,80,95,105,105,45,-60,-60,45,100,115,125,125,275,SBD,1,No
Alex Wright,26,F,Raw,F_O_R_BPU,86.4,90,80,92.5,102.5,102.5,47.5,-55,-62.5,47.5,110,117.5,-127.5,117.5,267.5,SBD,1,No
Carol Hughes,41,F,Wraps,F_M1_CR_ABPU,120.9,90+,125,140,-155,140,62.5,67.5,72.5,72.5,120,-125,-130,120,332.5,SBD,1,Yes
Kerrie Price,24,F,Wraps,F_O_CR_ABPU,83.1,90,90,100,-110,100,45,50,52.5,52.5,115,125,132.5,132.5,285,SBD,2,Yes
Ann Votsikas,53,F,Raw,F_M3_R_ABPU,82.4,82.5,-77.5,77.5,82.5,82.5,55,60,-65,60,135,142.5,-150,142.5,285,SBD,1,Yes
Learna Lee,32,F,Wraps,F_O_CR_ABPU,83.2,90,145,150,-155,150,75,82.5,90,90,155,165,-170,165,405,SBD,1,Yes
Erin Cartwright,27,F,Wraps,F_O_CR_ABPU,120.5,90+,152.5,-160,160,160,70,80,85,85,170,177.5,-185,177.5,422.5,SBD,1,Yes
Tom Bartholomew,23,M,Wraps,M_J_CR_ABPU,97.3,100,190,200,210,210,125,135,-145,135,205,215,225,225,570,SBD,1,Yes
Ed Harrison,,M,Raw,M_T3_R_BPU,86.8,90,165,180,-190,180,-135,135,150,150,200,220,240,240,570,SBD,1,No
Michael Lucas,23,M,Wraps,M_J_CR_BPU,123.8,125,185,200,,200,150,160,-170,160,-250,-260,260,260,620,SBD,1,No
Luke Harrison,23,M,Wraps,M_J_CR_BPU,99.2,100,-275,-275,275,275,187.5,-200,-200,187.5,287.5,300,-312.5,300,762.5,SBD,1,No
Marcus Kay,21,M,Wraps,M_J_CR_BPU,109.8,110,260,280,290,290,160,-180,-180,160,280,305,-315,305,755,SBD,1,No
Nathanael Pettit,22,M,Raw,M_J_R_BPU,90,90,200,210,220,220,155,165,-172.5,165,282.5,-292.5,,282.5,667.5,SBD,1,No
Alan Lewis,43,M,Wraps,M_M1_CR_BPU,105.5,110,165,180,190,190,-110,115,125,125,210,230,245,245,560,SBD,1,No
David John Williamson,29,M,Wraps,M_O_CR_BPU,106.8,110,210,220,-230,220,150,157.5,162.5,162.5,245,252.5,260,260,642.5,SBD,1,No
Jamie Spedding,26,M,Raw,M_O_R_ABPU,108.8,110,210,225,,225,130,140,147.5,147.5,240,260,270,270,642.5,SBD,1,Yes
Adam Jackson #2,27,M,Raw,M_O_R_BPU,119.5,125,220,230,240,240,170,180,190,190,250,260,270,270,700,SBD,1,No
Tim Davies,48,M,Single-ply,M_M2_S_BPU,118.3,125,,,,,-215,-215,215,215,270,-280,-280,270,485,BD,1,No
Andy Griffiths,32,M,Wraps,M_O_CR_BPU,127.2,140,265,285,-307.5,285,140,160,,160,260,280,-300,280,725,SBD,1,No
Mike Mealor,47,M,Wraps,M_M2_CR_BPU,173,140+,-280,295,-310,295,180,190,200,200,280,300,-310,300,795,SBD,1,No
Mariusz Pilinski,37,M,Wraps,M_O_CR_BPU,146,140+,290,305,315,315,220,227.5,230,230,295,305,310,310,855,SBD,1,No
Tom Smith,24,M,Wraps,M_O_CR_BPU,121.7,125,260,280,-290,280,155,165,170,170,300,320,325,325,775,SBD,1,No
Neil Hughes,29,M,Wraps,M_O_CR_BPU,108.3,110,-250,-250,-250,,,,,,,,,,,SBD,DQ,No
David Morris,47,M,Raw,M_M2_R_BPU,165.4,140+,,,,,180,200,210,210,,,,,210,B,1,No
Gavin Hughes,37,M,Raw,M_O_R_BPU,123.1,125,,,,,230,245,-257.5,245,,,,,245,B,1,No
Chris Etherington,35,M,Raw,M_O_R_ABPU,89.2,90,140,150,160,160,110,120,-135,120,160,180,210,210,490,SBD,1,Yes
Pat Kelly,53,M,Wraps,M_M3_CR_BPU,86.3,90,145,-160,160,160,110,120,130,130,-190,190,205,205,495,SBD,1,No
Darren Collett,35,M,Raw,M_O_R_ABPU,96.5,100,160,180,190,190,120,125,-130,125,200,220,-230,220,535,SBD,1,Yes
Grant Roberts,27,M,Wraps,M_O_CR_BPU,97.2,100,170,180,-190,180,145,,,145,220,235,-245,235,560,SBD,2,No
Richard Martin,40,M,Wraps,M_M1_CR_BPU,89.6,90,180,200,220,220,120,130,140,140,220,240,260,260,620,SBD,1,No
Huw Moss Hughs,24,M,Wraps,M_O_CR_BPU,86.4,90,200,210,-220,210,140,-150,-155,140,220,240,260,260,610,SBD,3,No
John Devlin,47,M,Raw,M_M2_R_ABPU,99.4,100,200,220,225,225,135,145,147.5,147.5,240,250,257.5,257.5,630,SBD,1,Yes
Thaheer Mannan,30,M,Wraps,M_O_CR_BPU,89.5,90,245,272.5,-285,272.5,125,132.5,,132.5,-245,245,272.5,272.5,677.5,SBD,2,No
Paul Murphy,49,M,Single-ply,M_M2_S_BPU,89.9,90,260,282.5,290,290,145,155,162.5,162.5,260,-272.5,,260,712.5,SBD,1,No
Tawanda Bwerudza,24,M,Wraps,M_O_CR_ABPU,88.4,90,220,240,250,250,125,135,142.5,142.5,270,302.5,310,310,702.5,SBD,1,Yes
Kristaps Tomčiks,30,M,Wraps,M_O_CR_BPU,98.1,100,305,320,-335,320,205,-215,217.5,217.5,270,-282.5,,270,807.5,SBD,1,No
Wylie Sung,30,M,Wraps,M_O_CR_BPU,89.5,90,260,275,287.5,287.5,155,162.5,170,170,290,305,315,315,772.5,SBD,1,No
