Division,WeightClassKg,Place,Name,Team,BodyweightKg,Best3SquatKg,Best3BenchKg,Best3DeadliftKg,TotalKg,Equipment,Event,Sex
Boys,55.79,1,William Cross,Huntington,51.89,142.88,70.31,151.95,365.14,Single-ply,SBD,M
Boys,55.79,2,Kias Cooper,Center,51.8,151.95,68.04,142.88,362.87,Single-ply,SBD,M
Boys,55.79,1,Bj Wafer,Huntington,54.88,120.2,88.45,145.15,353.8,Single-ply,SBD,M
Boys,55.79,2,Benny Zuniga,Timpson,53.98,117.93,72.57,151.95,342.46,Single-ply,SBD,M
Boys,55.79,3,Fred Torres,Timpson,55.79,108.86,49.9,151.95,310.71,Single-ply,SBD,M
Boys,55.79,4,Clayton Barlow,Garrison,54.07,117.93,54.43,122.47,294.84,Single-ply,SBD,M
Boys,55.79,5,Michael Hughes,Garrison,54.61,108.86,38.56,92.99,240.4,Single-ply,SBD,M
Boys,55.79,6,Joshua Murry,Diboll,53.52,88.45,45.36,102.06,235.87,Single-ply,SBD,M
Boys,67.13,1,Bruce Barlow,San Augustine,59.96,161.03,88.45,158.76,408.23,Single-ply,SBD,M
Boys,59.87,2,Justin Adkinson,Garrison,59.87,156.49,81.65,149.69,387.82,Single-ply,SBD,M
Boys,59.87,3,Armando Robles,Joaquin,57.42,147.42,79.38,158.76,385.55,Single-ply,SBD,M
Boys,59.87,4,Edgar Sanchez,Center,59.78,108.86,77.11,133.81,319.78,Single-ply,SBD,M
Boys,59.87,5,Brayan Ruiz,Center,58.97,99.79,52.16,124.74,276.69,Single-ply,SBD,M
Boys,59.87,6,Brax Turnner,Huntington,58.97,113.4,74.84,,188.24,Single-ply,SB,M
Boys,67.13,1,DeAngelo Hightower,Lufkin,66.22,147.42,79.38,181.44,408.23,Single-ply,SBD,M
Boys,67.13,2,Howard Watts,San Augustine,61.69,151.95,97.52,156.49,405.97,Single-ply,SBD,M
Boys,67.13,3,Austin Edwards,Garrison,67.13,142.88,83.91,163.29,390.09,Single-ply,SBD,M
Boys,67.13,4,Broderick Dickerson,Huntington,65.32,136.08,70.31,174.63,381.02,Single-ply,SBD,M
Boys,67.13,5,Konner Innerarity,Huntington,66.86,158.76,74.84,138.35,371.95,Single-ply,SBD,M
Boys,74.84,1,Beau Burleson,Woodville,73.3,208.65,111.13,188.24,508.02,Single-ply,SBD,M
Boys,74.84,2,Garrett Stanley,Center,74.84,181.44,95.25,210.92,487.61,Single-ply,SBD,M
Boys,74.84,3,Carlos Lewis,Diboll,73.94,176.9,90.72,190.51,458.13,Single-ply,SBD,M
Boys,74.84,4,Andrew Dean,Joaquin,73.94,179.17,95.25,174.63,449.06,Single-ply,SBD,M
Boys,74.84,5,Tanner Evett,Huntington,71.21,163.29,102.06,167.83,433.18,Single-ply,SBD,M
Boys,74.84,6,DeAndre Hooper,Lufkin,70.31,149.69,77.11,167.83,394.63,Single-ply,SBD,M
Boys,74.84,7,Jacob Charanza,Lufkin,74.39,142.88,81.65,158.76,383.29,Single-ply,SBD,M
Boys,74.84,8,Kevin Johnson,Lufkin,73.48,145.15,81.65,151.95,378.75,Single-ply,SBD,M
Boys,74.84,9,Justin Wilson,Joaquin,74.3,133.81,86.18,149.69,369.68,Single-ply,SBD,M
Boys,74.84,10,Lane Williams,Huntington,73.12,138.35,77.11,149.69,365.14,Single-ply,SBD,M
Boys,74.84,11,Tylor Green,Timpson,74.84,149.69,,,149.69,Single-ply,S,M
Boys,74.84,12,Lorenzo Young,Timpson,68.49,142.88,,,142.88,Single-ply,S,M
Boys,82.1,1,Kj Garrett,Center,81.47,229.06,124.74,229.06,582.87,Single-ply,SBD,M
Boys,82.1,2,Drew Diverdi,Center,77.11,183.7,117.93,206.38,508.02,Single-ply,SBD,M
Boys,82.1,3,Corey Mitchell,Woodville,81.19,172.37,106.59,213.19,492.15,Single-ply,SBD,M
Boys,82.1,4,Johnny Shaw,Center,78.47,181.44,81.65,215.46,478.54,Single-ply,SBD,M
Boys,82.1,5,Josh Packard,Huntington,79.38,185.97,97.52,185.97,469.47,Single-ply,SBD,M
Boys,82.1,6,Alex Renfro,San Augustine,79.56,163.29,108.86,192.78,464.93,Single-ply,SBD,M
Boys,82.1,7,Bubba Cook,Diboll,78.02,165.56,106.59,179.17,451.32,Single-ply,SBD,M
Boys,82.1,8,Austin Russum,Lufkin,81.65,158.76,90.72,188.24,437.72,Single-ply,SBD,M
Boys,82.1,9,Tristan Green,Timpson,76.66,163.29,97.52,145.15,405.97,Single-ply,SBD,M
Boys,82.1,10,Joseph Parker,Timpson,76.66,154.22,90.72,151.95,396.89,Single-ply,SBD,M
Boys,82.1,11,Clayton Bullock,Diboll,79.38,158.76,81.65,154.22,394.63,Single-ply,SBD,M
Boys,82.1,12,Chris Messer,Woodville,78.93,158.76,81.65,147.42,387.82,Single-ply,SBD,M
Boys,82.1,13,Willie Skinner,Lufkin,78.47,124.74,74.84,158.76,358.34,Single-ply,SBD,M
Boys,99.79,1,Jacob Cartwright,Huntington,90.04,247.21,127.01,226.8,601.01,Single-ply,SBD,M
Boys,99.79,2,Kiounis Williams,Center,89.99,229.06,108.86,235.87,573.79,Single-ply,SBD,M
Boys,89.81,3,Nathan Sears,Center,87.63,219.99,138.35,213.19,571.53,Single-ply,SBD,M
Boys,89.81,4,Zach Mason,Joaquin,86.18,213.19,111.13,197.31,521.63,Single-ply,SBD,M
Boys,89.81,5,Colten Mcswain,Timpson,89.54,188.24,131.54,201.85,521.63,Single-ply,SBD,M
Boys,99.79,6,Garrett Derouen,Woodville,89.99,192.78,127.01,197.31,517.1,Single-ply,SBD,M
Boys,99.79,7,Holden Cummings,Joaquin,89.9,174.63,97.52,190.51,462.66,Single-ply,SBD,M
Boys,89.81,8,MacKenzie Dockens,Center,85.28,181.44,90.72,181.44,453.59,Single-ply,SBD,M
Boys,89.81,9,Greg Miller,Hemphill,83.46,147.42,92.99,165.56,405.97,Single-ply,SBD,M
Boys,99.79,1,Derrick Thomas,Center,97.89,195.04,108.86,231.33,535.24,Single-ply,SBD,M
Boys,99.79,2,Alex Moreno,San Augustine,98.52,192.78,142.88,179.17,514.83,Single-ply,SBD,M
Boys,99.79,3,Tra Rogers,Joaquin,91.17,197.31,102.06,183.7,483.08,Single-ply,SBD,M
Boys,99.79,4,Nathan Boyter,Joaquin,96.8,142.88,97.52,129.27,369.68,Single-ply,SBD,M
Boys,99.79,5,Dalton Wheless,Joaquin,97.52,142.88,74.84,138.35,356.07,Single-ply,SBD,M
Boys,99.79,6,Michael Presley,Hemphill,98.88,183.7,117.93,,301.64,Single-ply,SB,M
Boys,109.77,1,Zach Wildes,Joaquin,108.86,210.92,113.4,192.78,517.1,Single-ply,SBD,M
Boys,109.77,2,DaVincent Hoyt,Center,100.15,190.51,117.93,199.58,508.02,Single-ply,SBD,M
Boys,109.77,3,Trey Harris,Hemphill,106.87,176.9,108.86,201.85,487.61,Single-ply,SBD,M
Boys,109.77,4,Carl Matthews,Lufkin,104.33,161.03,111.13,174.63,446.79,Single-ply,SBD,M
Boys,109.77,5,Luis Ramos #4,Diboll,102.06,142.88,95.25,195.04,433.18,Single-ply,SBD,M
Boys,109.77,6,Felix Johnson,Woodville,101.24,174.63,124.74,102.06,401.43,Single-ply,SBD,M
Boys,124.74,1,Dj Parks,San Augustine,123.83,272.16,158.76,222.26,653.17,Single-ply,SBD,M
Boys,124.74,2,Austin Underbrink,Joaquin,123.38,260.82,167.83,206.38,635.03,Single-ply,SBD,M
Boys,124.74,3,Javaris Rankin,Center,112.85,235.87,140.61,217.72,594.21,Single-ply,SBD,M
Boys,124.74,4,Rhett Golden,Joaquin,117.93,238.14,136.08,204.12,578.33,Single-ply,SBD,M
Boys,124.74,5,Spencer Ince,Hemphill,121.56,204.12,122.47,226.8,553.38,Single-ply,SBD,M
Boys,124.74,6,Jacob Slaughter,Huntington,117.48,219.99,113.4,217.72,551.11,Single-ply,SBD,M
Boys,124.74,7,Fernando DeJesus,Diboll,115.76,210.92,108.86,176.9,496.68,Single-ply,SBD,M
Boys,124.74,8,Ruston Bush,Timpson,113.31,188.24,102.06,170.1,460.4,Single-ply,SBD,M
Boys,124.74,9,Kelly Hill,Lufkin,111.58,133.81,102.06,183.7,419.57,Single-ply,SBD,M
Boys,124.74,10,Colton Aycock,Lufkin,122.47,147.42,102.06,167.83,417.3,Single-ply,SBD,M
Boys,124.74,11,Dimric Caraway,Timpson,119.29,188.24,92.99,,281.23,Single-ply,SB,M
Boys,124.74+,1,Jake Davis,San Augustine,131.09,217.72,136.08,199.58,553.38,Single-ply,SBD,M
Boys,124.74+,2,Dayton Rodriguez,Huntington,142.07,181.44,106.59,170.1,458.13,Single-ply,SBD,M
Boys,124.74+,3,Eliberto Morales,Lufkin,131.54,129.27,79.38,154.22,362.87,Single-ply,SBD,M
Boys,,NS,Justin Releford,Woodville,,,,,,Single-ply,SBD,M
