Name,Place,Division,Sex,Equipment,WeightClassKg,BodyweightKg,Age,Best3BenchKg,TotalKg,Event
Matt Kinsell,1,Open,M,Multi-ply,75,71.3,36,177.5,177.5,B
Tiny Meeker,DQ,Open,M,Multi-ply,140+,149.96,40,-425,,B
Eric Asatryan,DQ,Open,M,Multi-ply,100,94.08,20,-170,,B
Maricelle Mendelson,DQ,Open,F,Multi-ply,90+,110.59,38,-140,,B
Mike Dunlap,1,Open,M,Raw,100,98.52,26,147.5,147.5,B
Cody Fanner,2,Open,M,Raw,100,94.17,23,130,130,B
Ron Moormeister,1,Masters,M,Raw,140,128.09,65,190,190,B
