Division,WeightClassKg,Place,Name,Team,BodyweightKg,Best3SquatKg,Best3BenchKg,Best3DeadliftKg,TotalKg,Equipment,Event,Sex
Boys,51.71,1,David Garcia,Pharr Valley View,51.62,145.15,79.38,167.83,392.36,Single-ply,SBD,M
Boys,55.79,2,Israel Macharro,Pharr Valley View,51.8,142.88,95.25,131.54,369.68,Single-ply,SBD,M
Boys,51.71,3,Victor Pedraza,PSJA Southwest,51.26,142.88,72.57,138.35,353.8,Single-ply,SBD,M
Boys,51.71,4,Albert de la Rosa,San Benito,50.89,115.67,68.04,136.08,319.78,Single-ply,SBD,M
Boys,51.71,5,Kevin Sierra,PSJA Southwest,49.44,120.2,68.04,129.27,317.51,Single-ply,SBD,M
Boys,51.71,6,Rolando Gonzalez,PSJA Southwest,49.44,129.27,65.77,122.47,317.51,Single-ply,SBD,M
Boys,51.71,7,Tuti Garcia,Los Fresnos,47.81,108.86,61.23,131.54,301.64,Single-ply,SBD,M
Boys,51.71,8,Carlos Jaimez,PSJA,50.35,113.4,61.23,124.74,299.37,Single-ply,SBD,M
Boys,51.71,9,Jose Cantu,Rio Grande City,51.26,113.4,52.16,131.54,297.1,Single-ply,SBD,M
Boys,51.71,10,Brandon Nunez,Mission,49.62,90.72,65.77,108.86,265.35,Single-ply,SBD,M
Boys,55.79,1,Luis Vasquez,Los Fresnos,54.79,147.42,90.72,174.63,412.77,Single-ply,SBD,M
Boys,55.79,2,Raul Mata,San Benito,54.88,131.54,88.45,154.22,374.21,Single-ply,SBD,M
Boys,55.79,3,Jose Barba,Rio Grande City,55.52,149.69,77.11,142.88,369.68,Single-ply,SBD,M
Boys,55.79,4,Randy Medellin,San Benito,55.61,129.27,72.57,151.95,353.8,Single-ply,SBD,M
Boys,55.79,5,Jesse Cortez,Pharr Valley View,52.62,127.01,68.04,149.69,344.73,Single-ply,SBD,M
Boys,55.79,6,Omar Mora,PSJA Memorial,53.98,104.33,61.23,129.27,294.84,Single-ply,SBD,M
Boys,59.87,1,Aaron Robles,San Benito,59.69,172.37,111.13,204.12,487.61,Single-ply,SBD,M
Boys,59.87,2,Joshua Garcia,Weslaco,59.42,174.63,95.25,176.9,446.79,Single-ply,SBD,M
Boys,59.87,3,Jesus Garcia,Mission,59.51,167.83,90.72,170.1,428.64,Single-ply,SBD,M
Boys,59.87,4,Jorge Cantu,PSJA Southwest,58.97,149.69,92.99,158.76,401.43,Single-ply,SBD,M
Boys,59.87,5,Eric Gaona,PSJA Memorial,58.97,163.29,68.04,140.61,371.95,Single-ply,SBD,M
Boys,67.13,6,Marco Ruiz,Mission Veterans Memorial,60.06,106.59,74.84,124.74,306.17,Single-ply,SBD,M
Boys,59.87,DQ,Manuel Briones,Pharr Valley View,57.97,95.25,,,,Single-ply,SBD,M
Boys,67.13,1,Lorenzo Huerta,PSJA Southwest,64.86,190.51,115.67,163.29,469.47,Single-ply,SBD,M
Boys,74.84,2,Kenny Atkinson,Los Fresnos,67.31,154.22,113.4,176.9,444.52,Single-ply,SBD,M
Boys,74.84,3,Christian Gonzalez,Weslaco,67.31,167.83,108.86,163.29,439.98,Single-ply,SBD,M
Boys,67.13,4,Omar Lonzano,PSJA Memorial,66.22,147.42,92.99,136.08,376.48,Single-ply,SBD,M
Boys,67.13,5,Joey Moralez,PSJA Memorial,65.32,136.08,88.45,142.88,367.41,Single-ply,SBD,M
Boys,67.13,6,Ricardo Torres,Rio Grande City,67.04,113.4,70.31,170.1,353.8,Single-ply,SBD,M
Boys,67.13,7,Jesse Navarro,PSJA,66.22,111.13,97.52,142.88,351.53,Single-ply,SBD,M
Boys,67.13,8,Joseph Segovia,Mission,66.5,129.27,83.91,108.86,322.05,Single-ply,SBD,M
Boys,67.13,9,James Lopez,Rio Grande City,67.04,92.99,72.57,124.74,290.3,Single-ply,SBD,M
Boys,67.13,DQ,Juan Guerrero,Weslaco,65.5,,,,,Single-ply,SBD,M
Boys,74.84,1,David Martinez,PSJA Memorial,74.39,240.4,142.88,235.87,619.15,Single-ply,SBD,M
Boys,74.84,2,Alex Lanza,Los Fresnos,72.94,213.19,120.2,235.87,569.26,Single-ply,SBD,M
Boys,74.84,3,Joe Torres,Los Fresnos,74.21,213.19,124.74,217.72,555.65,Single-ply,SBD,M
Boys,74.84,4,Nathen Mireles,San Benito,73.84,192.78,127.01,190.51,510.29,Single-ply,SBD,M
Boys,74.84,5,Carlos Castillo,Los Fresnos,67.59,183.7,115.67,204.12,503.49,Single-ply,SBD,M
Boys,74.84,6,Adan Cantu,Rio Grande City Grulla,74.21,215.46,106.59,174.63,496.68,Single-ply,SBD,M
Boys,74.84,7,Austin Segura,Rio Grande City,73.57,195.04,83.91,172.37,451.32,Single-ply,SBD,M
Boys,74.84,8,Adonis Juarez,Mission,69.4,165.56,97.52,172.37,435.45,Single-ply,SBD,M
Boys,74.84,9,Ivan Rodriguez,Pharr Valley View,74.75,151.95,97.52,172.37,421.84,Single-ply,SBD,M
Boys,74.84,10,Tony Villarreal,PSJA North,73.66,170.1,83.91,147.42,401.43,Single-ply,SBD,M
Boys,74.84,11,Isaac Vela,PSJA,71.21,149.69,95.25,147.42,392.36,Single-ply,SBD,M
Boys,74.84,12,Chris Ramon,PSJA Memorial,73.48,154.22,86.18,145.15,385.55,Single-ply,SBD,M
Boys,74.84,13,Andrew Leija,PSJA North,72.3,108.86,81.65,124.74,315.25,Single-ply,SBD,M
Boys,74.84,DQ,Gilberto Guajardo,Pharr Valley View,72.76,142.88,,,,Single-ply,SBD,M
Boys,74.84,DQ,Jessie Villarreal,PSJA Southwest,72.12,,,,,Single-ply,SBD,M
Boys,74.84,DQ,Felix Tirada,Weslaco,73.12,158.76,,,,Single-ply,SBD,M
Boys,82.1,1,Esteban Flores,Pharr Valley View,76.2,226.8,142.88,254.01,623.69,Single-ply,SBD,M
Boys,82.1,2,Andrew Benavidez,PSJA North,81.19,192.78,115.67,222.26,530.7,Single-ply,SBD,M
Boys,89.81,3,Max Gonzalez,Weslaco,82.28,201.85,120.2,183.7,505.76,Single-ply,SBD,M
Boys,82.1,4,Cj Barberena,PSJA North,78.93,213.19,108.86,181.44,503.49,Single-ply,SBD,M
Boys,82.1,5,Mannyh Garcia,PSJA Southwest,80.74,188.24,117.93,174.63,480.81,Single-ply,SBD,M
Boys,82.1,6,Gilberto Trevino,Weslaco,80.38,192.78,104.33,181.44,478.54,Single-ply,SBD,M
Boys,82.1,7,George Sanchez,PSJA Southwest,78.47,176.9,97.52,176.9,451.32,Single-ply,SBD,M
Boys,82.1,8,Christian Segovia,Mission,79.83,161.03,97.52,170.1,428.64,Single-ply,SBD,M
Boys,82.1,9,Victor Solis,Mission,76.66,151.95,86.18,151.95,390.09,Single-ply,SBD,M
Boys,89.81,10,Charles Ybarra,Mission,82.28,129.27,83.91,154.22,367.41,Single-ply,SBD,M
Boys,82.1,11,Noah Barba,Rio Grande City,81.19,136.08,65.77,117.93,319.78,Single-ply,SBD,M
Boys,82.1,DQ,Eddie Salinas,Rio Grande City Grulla,76.29,113.4,,,,Single-ply,SBD,M
Boys,89.81,1,Joey Pintones,Pharr Valley View,89.72,267.62,136.08,265.35,669.05,Single-ply,SBD,M
Boys,89.81,2,Alex Melendez,Pharr Valley View,87.45,217.72,136.08,219.99,573.79,Single-ply,SBD,M
Boys,89.81,3,Colt Sanchez,PSJA Memorial,86.18,208.65,120.2,222.26,551.11,Single-ply,SBD,M
Boys,89.81,4,Christian Brown,Pharr Valley View,85.46,208.65,111.13,181.44,501.22,Single-ply,SBD,M
Boys,89.81,5,Michael Torres,Weslaco,87.09,174.63,108.86,185.97,469.47,Single-ply,SBD,M
Boys,89.81,6,Ricky Rodriguez,San Benito,87.82,158.76,108.86,185.97,453.59,Single-ply,SBD,M
Boys,89.81,7,Mike Rodriguez,Mission,87.91,172.37,83.91,151.95,408.23,Single-ply,SBD,M
Boys,89.81,8,Bobby Reyes,Rio Grande City,88.18,142.88,90.72,142.88,376.48,Single-ply,SBD,M
Boys,89.81,DQ,Jonathan Soto,PSJA Southwest,88.45,226.8,,,,Single-ply,SBD,M
Boys,99.79,1,Ej Ruiz,PSJA North,95.3,240.4,172.37,244.94,657.71,Single-ply,SBD,M
Boys,99.79,2,Faustino Saldana,PSJA Southwest,93.89,242.67,117.93,195.04,555.65,Single-ply,SBD,M
Boys,99.79,3,Jesse Coronado,Weslaco,92.53,204.12,124.74,176.9,505.76,Single-ply,SBD,M
Boys,99.79,4,Jesús Torres,Weslaco,91.72,188.24,117.93,197.31,503.49,Single-ply,SBD,M
Boys,99.79,5,Eddie Favata,PSJA North,99.16,192.78,127.01,167.83,487.61,Single-ply,SBD,M
Boys,99.79,6,Ralph Mendoza,Mission,93.35,174.63,106.59,176.9,458.13,Single-ply,SBD,M
Boys,109.77,7,Adrian Flores,Mission Veterans Memorial,99.88,167.83,111.13,176.9,455.86,Single-ply,SBD,M
Boys,99.79,8,Mathew Cortez,Mission Veterans Memorial,93.62,181.44,90.72,181.44,453.59,Single-ply,SBD,M
Boys,99.79,9,Rick Rodriguez,Mission Veterans Memorial,91.81,172.37,102.06,174.63,449.06,Single-ply,SBD,M
Boys,99.79,10,Eddie Garza,Rio Grande City,90.99,165.56,102.06,158.76,426.38,Single-ply,SBD,M
Boys,99.79,11,Fred Franco,Mission Veterans Memorial,96.16,151.95,95.25,161.03,408.23,Single-ply,SBD,M
Boys,99.79,12,James Arredondo,PSJA Memorial,98.43,161.03,92.99,138.35,392.36,Single-ply,SBD,M
Boys,99.79,13,Juan Ramirez,PSJA,99.34,149.69,90.72,136.08,376.48,Single-ply,SBD,M
Boys,99.79,14,Andy Enriquez,PSJA,96.62,136.08,81.65,133.81,351.53,Single-ply,SBD,M
Boys,109.77,1,Julio Rivas,San Benito,103.51,240.4,149.69,251.74,641.83,Single-ply,SBD,M
Boys,109.77,2,Patrick Longoria,Weslaco,107.14,244.94,165.56,229.06,639.57,Single-ply,SBD,M
Boys,109.77,3,Kevin Trevino,PSJA North,108.14,247.21,154.22,219.99,621.42,Single-ply,SBD,M
Boys,109.77,4,Alex Valencia,Los Fresnos,107.41,217.72,165.56,215.46,598.74,Single-ply,SBD,M
Boys,109.77,5,Augustus Hernandez,PSJA North,108.95,226.8,131.54,235.87,594.21,Single-ply,SBD,M
Boys,109.77,6,Jose Juarez,Weslaco,106.41,215.46,138.35,210.92,564.72,Single-ply,SBD,M
Boys,109.77,7,Noe Alonzo,PSJA Memorial,108.41,213.19,140.61,204.12,557.92,Single-ply,SBD,M
Boys,109.77,8,Issac Barrera,Mission,102.97,195.04,102.06,190.51,487.61,Single-ply,SBD,M
Boys,109.77,9,Matias Bazan,Rio Grande City Grulla,107.68,165.56,131.54,161.03,458.13,Single-ply,SBD,M
Boys,109.77,10,Orlando Nieto,PSJA Memorial,107.5,181.44,104.33,161.03,446.79,Single-ply,SBD,M
Boys,109.77,11,Luis Martinez,San Benito,104.69,147.42,122.47,161.03,430.91,Single-ply,SBD,M
Boys,109.77,12,Cristian Lopez,PSJA North,107.59,170.1,108.86,145.15,424.11,Single-ply,SBD,M
Boys,124.74,1,Pete Lozano,San Benito,121.93,299.37,185.97,274.42,759.77,Single-ply,SBD,M
Boys,124.74,2,Jesus Esparza,Pharr Valley View,115.67,267.62,167.83,263.08,698.53,Single-ply,SBD,M
Boys,124.74,3,Gabriel Garzoria,Los Fresnos,118.93,192.78,181.44,226.8,601.01,Single-ply,SBD,M
Boys,124.74,4,Issac Escobedo,PSJA Memorial,122.92,217.72,151.95,201.85,571.53,Single-ply,SBD,M
Boys,124.74,5,Aaron Barrera,Rio Grande City Grulla,113.85,208.65,147.42,195.04,551.11,Single-ply,SBD,M
Boys,124.74,6,Gilbert Galvan,PSJA Southwest,121.15,229.06,122.47,172.37,523.9,Single-ply,SBD,M
Boys,124.74,7,Julian Rosales,Rio Grande City,122.11,188.24,102.06,165.56,455.86,Single-ply,SBD,M
Boys,124.74,8,Gabrian Vela,PSJA North,112.49,163.29,113.4,174.63,451.32,Single-ply,SBD,M
Boys,124.74,9,Robert Medina,Rio Grande City,115.67,165.56,92.99,165.56,424.11,Single-ply,SBD,M
Boys,124.74,DQ,Andres Martinez,PSJA,115.67,149.69,122.47,,,Single-ply,SBD,M
Boys,124.74,DQ,Raul de la Cruz,Mission,118.93,238.14,113.4,,,Single-ply,SBD,M
Boys,124.74+,1,Josue Garzoria,Los Fresnos,143.06,249.48,192.78,254.01,696.26,Single-ply,SBD,M
Boys,124.74+,2,Jose Limon,Los Fresnos,140.7,226.8,129.27,240.4,596.47,Single-ply,SBD,M
Boys,124.74+,3,Randy Fernandez,PSJA North,127.96,235.87,149.69,204.12,589.67,Single-ply,SBD,M
