Name,WeightClassKg,Best3SquatKg,Best3BenchKg,Best3DeadliftKg,TotalKg,Division,Sex,Event,Equipment,Place
Marc Barbier,52,107.5,92.5,167.5,367.5,Juniors 20-23,M,SBD,Single-ply,1
Herve Harvey,56,170,107.5,195,472.5,Juniors 20-23,M,SBD,Single-ply,1
Trey Cunningham,60,205,122.5,210,537.5,Juniors 20-23,M,SBD,Single-ply,1
Micah Kiletico,60,192.5,122.5,217.5,532.5,Juniors 20-23,M,SBD,Single-ply,2
Luke Hanifen,60,157.5,132.5,172.5,462.5,Juniors 20-23,M,SBD,Single-ply,3
Spencer Myers,60,145,95,172.5,412.5,Juniors 20-23,M,SBD,Single-ply,4
Michael Rodriguez,67.5,197.5,105,,,Juniors 20-23,M,SBD,Single-ply,DQ
Todd Straub,75,227.5,160,250,637.5,Juniors 20-23,M,SBD,Single-ply,1
Eric Walton,75,215,145,257.5,617.5,Juniors 20-23,M,SBD,Single-ply,2
Ryan Snelling,75,207.5,145,262.5,615,Juniors 20-23,M,SBD,Single-ply,3
Clay Grubbs,75,225,130,237.5,592.5,Juniors 20-23,M,SBD,Single-ply,4
Clint Edwards,75,227.5,142.5,212.5,582.5,Juniors 20-23,M,SBD,Single-ply,5
Tony Williams,75,230,132.5,220,582.5,Juniors 20-23,M,SBD,Single-ply,6
David Zaworski,82.5,242.5,175,240,657.5,Juniors 20-23,M,SBD,Single-ply,1
Dan Fletcher,82.5,215,152.5,272.5,640,Juniors 20-23,M,SBD,Single-ply,2
Nicholas Piazza,82.5,225,155,250,630,Juniors 20-23,M,SBD,Single-ply,3
Scott McManus,82.5,212.5,137.5,252.5,602.5,Juniors 20-23,M,SBD,Single-ply,4
Kevin Gwin,82.5,197.5,160,222.5,580,Juniors 20-23,M,SBD,Single-ply,5
Shawn Geernaert,90,265,192.5,292.5,750,Juniors 20-23,M,SBD,Single-ply,1
Lauren Cohen,90,272.5,185,270,727.5,Juniors 20-23,M,SBD,Single-ply,2
Seth Abrams,90,210,207.5,220,637.5,Juniors 20-23,M,SBD,Single-ply,3
J. Townsend,100,260,180,267.5,707.5,Juniors 20-23,M,SBD,Single-ply,1
Shane Newark,110,300,222.5,265,787.5,Juniors 20-23,M,SBD,Single-ply,1
Adam Schaubie,110,290,192.5,297.5,780,Juniors 20-23,M,SBD,Single-ply,2
Wendel Edwards,110,260,172.5,305,737.5,Juniors 20-23,M,SBD,Single-ply,3
Henry Thomason,125,355,187.5,305,847.5,Juniors 20-23,M,SBD,Single-ply,1
Matt Wenning,125,325,210,295,830,Juniors 20-23,M,SBD,Single-ply,2
Thomas Ruszala,125,327.5,210,272.5,810,Juniors 20-23,M,SBD,Single-ply,3
Jerry Pritchett,125,250,190,295,735,Juniors 20-23,M,SBD,Single-ply,4
Randall Harris,125+,370,250,332.5,952.5,Juniors 20-23,M,SBD,Single-ply,1
Jason Christus,125+,325,227.5,290,842.5,Juniors 20-23,M,SBD,Single-ply,2
Emilio Saldierna,125+,337.5,200,255,792.5,Juniors 20-23,M,SBD,Single-ply,3
Jeremy Meyer,52,117.5,72.5,147.5,337.5,Teen 14-15,M,SBD,Single-ply,1
Bryan Prescott,52,102.5,57.5,122.5,282.5,Teen 14-15,M,SBD,Single-ply,2
Dan Nitzken,52,87.5,55,112.5,255,Teen 14-15,M,SBD,Single-ply,3
Brandon Hatfield,56,142.5,70,147.5,360,Teen 14-15,M,SBD,Single-ply,1
Ryan Hart,60,122.5,87.5,167.5,377.5,Teen 14-15,M,SBD,Single-ply,1
David Norris,60,130,65,100,295,Teen 14-15,M,SBD,Single-ply,2
Caleb Williams,67.5,250,137.5,237.5,625,Teen 14-15,M,SBD,Single-ply,1
Jason Thomas,67.5,142.5,82.5,157.5,382.5,Teen 14-15,M,SBD,Single-ply,2
Jake Ragusa,75,187.5,105,217.5,510,Teen 14-15,M,SBD,Single-ply,1
Jeremy Auerbach,75,130,115,165,410,Teen 14-15,M,SBD,Single-ply,2
Joseph Tronzo,82.5,172.5,107.5,190,470,Teen 14-15,M,SBD,Single-ply,1
Justin Young,82.5,160,95,215,470,Teen 14-15,M,SBD,Single-ply,2
Alex Reid,100,157.5,105,197.5,460,Teen 14-15,M,SBD,Single-ply,1
Mike Heche,125+,227.5,127.5,215,570,Teen 14-15,M,SBD,Single-ply,1
Mike Hafenbrack,52,155,82.5,180,417.5,Teen 16-17,M,SBD,Single-ply,1
Vincent Nicdoliwca,56,182.5,112.5,220,515,Teen 16-17,M,SBD,Single-ply,1
Dane Karras,56,137.5,87.5,162.5,387.5,Teen 16-17,M,SBD,Single-ply,2
Nick Trzaskus,56,137.5,80,160,377.5,Teen 16-17,M,SBD,Single-ply,3
Ryan M. Smith,60,162.5,97.5,195,455,Teen 16-17,M,SBD,Single-ply,1
Charles Blessinger,60,152.5,95,167.5,415,Teen 16-17,M,SBD,Single-ply,2
Rory Bogan,60,147.5,87.5,167.5,402.5,Teen 16-17,M,SBD,Single-ply,3
Loren Mangino,67.5,175,127.5,227.5,530,Teen 16-17,M,SBD,Single-ply,1
Daniel LePert,67.5,175,107.5,187.5,470,Teen 16-17,M,SBD,Single-ply,2
Anthony Lucas,67.5,150,115,187.5,452.5,Teen 16-17,M,SBD,Single-ply,3
Andy Schyartsman,67.5,167.5,102.5,170,440,Teen 16-17,M,SBD,Single-ply,4
Jon Norwood,67.5,167.5,112.5,157.5,437.5,Teen 16-17,M,SBD,Single-ply,5
Adam Nagela,67.5,167.5,87.5,170,425,Teen 16-17,M,SBD,Single-ply,6
Nathan Pinkerman,67.5,,,,,Teen 16-17,M,SBD,Single-ply,DQ
Colby Larson,75,200,127.5,187.5,515,Teen 16-17,M,SBD,Single-ply,1
Blake Dedas,75,177.5,112.5,200,490,Teen 16-17,M,SBD,Single-ply,2
Paul Bunce,75,187.5,92.5,195,475,Teen 16-17,M,SBD,Single-ply,3
Robbie Roybal,75,165,112.5,192.5,470,Teen 16-17,M,SBD,Single-ply,4
Shane Oakley,75,177.5,95,197.5,470,Teen 16-17,M,SBD,Single-ply,5
Ryan Keathiey,82.5,227.5,150,230,607.5,Teen 16-17,M,SBD,Single-ply,1
Cory Saltzman,82.5,207.5,117.5,242.5,567.5,Teen 16-17,M,SBD,Single-ply,2
Dan Papesh,82.5,170,95,200,465,Teen 16-17,M,SBD,Single-ply,3
Ryan Meninga,90,215,120,227.5,562.5,Teen 16-17,M,SBD,Single-ply,1
Simon Mitchell,90,197.5,107.5,217.5,522.5,Teen 16-17,M,SBD,Single-ply,2
Jeff Eberent,90,195,117.5,202.5,515,Teen 16-17,M,SBD,Single-ply,3
Brandon Clark,90,170,130,195,495,Teen 16-17,M,SBD,Single-ply,4
M. McFarlane,100,217.5,137.5,250,605,Teen 16-17,M,SBD,Single-ply,1
Briam Lemay,100,227.5,135,222.5,585,Teen 16-17,M,SBD,Single-ply,2
Charles Rallis,100,195,132.5,245,572.5,Teen 16-17,M,SBD,Single-ply,3
Nicholas Rasmussen,110,250,130,277.5,657.5,Teen 16-17,M,SBD,Single-ply,1
Chris Sands,125,272.5,182.5,262.5,717.5,Teen 16-17,M,SBD,Single-ply,1
Justin Graham,125,205,105,222.5,532.5,Teen 16-17,M,SBD,Single-ply,2
Chris Bischoff,125+,260,157.5,205,622.5,Teen 16-17,M,SBD,Single-ply,1
Jeremy Scruggs,56,172.5,107.5,212.5,492.5,Teen 18-19,M,SBD,Single-ply,1
David Kibler,67.5,237.5,125,230,592.5,Teen 18-19,M,SBD,Single-ply,1
David Hammers,67.5,212.5,137.5,220,570,Teen 18-19,M,SBD,Single-ply,2
William Lubeck,75,195,137.5,192.5,525,Teen 18-19,M,SBD,Single-ply,1
Benjamin Brooks,75,190,110,210,510,Teen 18-19,M,SBD,Single-ply,2
Ryan Nagela,75,180,107.5,205,492.5,Teen 18-19,M,SBD,Single-ply,3
Nicholas Gutierrez,75,,,,,Teen 18-19,M,SBD,Single-ply,DQ
Christopher Nasser,82.5,215,127.5,252.5,595,Teen 18-19,M,SBD,Single-ply,1
Greg Dennison,82.5,170,105,240,515,Teen 18-19,M,SBD,Single-ply,2
Jeremy Hartman,90,245,170,272.5,687.5,Teen 18-19,M,SBD,Single-ply,1
Casey Wafford,90,245,137.5,242.5,625,Teen 18-19,M,SBD,Single-ply,2
Wayne Literel,90,227.5,145,217.5,590,Teen 18-19,M,SBD,Single-ply,3
S. Kouimanis,100,277.5,182.5,255,715,Teen 18-19,M,SBD,Single-ply,1
Adam Dyce,100,235,147.5,240,622.5,Teen 18-19,M,SBD,Single-ply,2
Joseph Harris,100,190,147.5,242.5,580,Teen 18-19,M,SBD,Single-ply,3
Drew Traub,110,262.5,157.5,302.5,722.5,Teen 18-19,M,SBD,Single-ply,1
Rob Camfield,110,240,167.5,227.5,635,Teen 18-19,M,SBD,Single-ply,2
Mario Westbrook,125,235,147.5,230,612.5,Teen 18-19,M,SBD,Single-ply,1
Darren Gay,125,220,137.5,242.5,600,Teen 18-19,M,SBD,Single-ply,2
Ryan Risner,125+,252.5,202.5,247.5,702.5,Teen 18-19,M,SBD,Single-ply,1
