Division,WeightClassKg,Place,Name,Team,BodyweightKg,Best3SquatKg,Best3BenchKg,Best3DeadliftKg,TotalKg,Equipment,Event,Sex
Boys,51.71,1,Jayden Prince,Waskom,51.66,83.91,65.77,131.54,281.23,Single-ply,SBD,M
Boys,51.71,2,Nick Fincher,Waskom,51.71,92.99,49.9,122.47,265.35,Single-ply,SBD,M
Boys,51.71,3,Shmar Garrett,Carthage,48.13,74.84,61.23,83.91,219.99,Single-ply,SBD,M
Boys,55.79,1,Simon Schuler,Hallsville,54.02,120.2,79.38,122.47,322.05,Single-ply,SBD,M
Boys,55.79,2,Jordan Prignet,Atlanta,55.61,108.86,52.16,131.54,292.57,Single-ply,SBD,M
Boys,59.87,1,Roshabrius Garrett,Carthage,59.51,131.54,90.72,138.35,360.61,Single-ply,SBD,M
Boys,59.87,2,Dalton Johnson,Atlanta,59.06,127.01,74.84,145.15,347,Single-ply,SBD,M
Boys,59.87,3,Rodrigo Rojas,Hallsville,58.11,117.93,79.38,147.42,344.73,Single-ply,SBD,M
Boys,59.87,4,Nathan Johnson,Atlanta,59.33,108.86,81.65,124.74,315.25,Single-ply,SBD,M
Boys,59.87,5,Caleb Purifoy,Hallsville,58.33,108.86,74.84,113.4,297.1,Single-ply,SBD,M
Boys,59.87,6,Tyler Bumpers,Waskom,59.78,99.79,61.23,127.01,288.03,Single-ply,SBD,M
Boys,59.87,7,Thomas Steward,Atlanta,58.79,104.33,68.04,108.86,281.23,Single-ply,SBD,M
Boys,59.87,8,Brett Piazza,Atlanta,58.33,90.72,61.23,115.67,267.62,Single-ply,SBD,M
Boys,67.13,1,Austin Brown,Atlanta,65.41,127.01,79.38,165.56,371.95,Single-ply,SBD,M
Boys,67.13,2,Bryan Holland,Waskom,63.41,113.4,72.57,140.61,326.59,Single-ply,SBD,M
Boys,67.13,3,Thomas Scott,Atlanta,67.09,97.52,74.84,133.81,306.17,Single-ply,SBD,M
Boys,67.13,4,Camon Phillips,Waskom,64.27,83.91,61.23,131.54,276.69,Single-ply,SBD,M
Boys,74.84,1,Chris Stafford,Waskom,71.58,174.63,113.4,188.24,476.27,Single-ply,SBD,M
Boys,74.84,2,Clayton Mosley,Atlanta,73.66,165.56,117.93,188.24,471.74,Single-ply,SBD,M
Boys,74.84,3,Jacob Nash,Atlanta,74.62,163.29,95.25,165.56,424.11,Single-ply,SBD,M
Boys,74.84,4,Caleb Drake,Hallsville,70.35,142.88,97.52,149.69,390.09,Single-ply,SBD,M
Boys,74.84,5,Chad West,Carthage,71.35,158.76,79.38,149.69,387.82,Single-ply,SBD,M
Boys,74.84,6,AJ Harris,Gladewater,74.8,142.88,70.31,151.95,365.14,Single-ply,SBD,M
Boys,74.84,7,Chris Nelson,Waskom,74.75,133.81,79.38,138.35,351.53,Single-ply,SBD,M
Boys,74.84,8,Quavion Sheffield,Gladewater,70.4,124.74,74.84,138.35,337.93,Single-ply,SBD,M
Boys,82.1,1,Nate Irving,Waskom,82.1,188.24,102.06,188.24,478.54,Single-ply,SBD,M
Boys,82.1,2,Josh Cole,Waskom,79.02,188.24,95.25,181.44,464.93,Single-ply,SBD,M
Boys,82.1,3,Greg Hurst,Carthage,79.56,167.83,97.52,190.51,455.86,Single-ply,SBD,M
Boys,82.1,4,Domonique Felder,Hallsville,76.29,149.69,79.38,172.37,401.43,Single-ply,SBD,M
Boys,82.1,DQ,Jacob Scoggins,Gladewater,79.47,115.67,,,,Single-ply,SBD,M
Boys,89.81,1,Nick Cooper,Atlanta,85.82,215.46,133.81,238.14,587.4,Single-ply,SBD,M
Boys,89.81,2,Zee Barfoot,Atlanta,83.73,195.04,133.81,195.04,523.9,Single-ply,SBD,M
Boys,89.81,3,Rashaud Johnson,Gladewater,89.81,188.24,106.59,185.97,480.81,Single-ply,SBD,M
Boys,89.81,4,Reggie Blaylock,Atlanta,87.36,176.9,113.4,172.37,462.66,Single-ply,SBD,M
Boys,89.81,5,Martin Figueroa,Hallsville,88.09,163.29,104.33,176.9,444.52,Single-ply,SBD,M
Boys,89.81,6,Tim Rivera,Gladewater,88.09,161.03,88.45,170.1,419.57,Single-ply,SBD,M
Boys,89.81,7,Jordan Alvarez,Atlanta,86.18,149.69,108.86,154.22,412.77,Single-ply,SBD,M
Boys,89.81,8,Jacob Rodriguez,Gladewater,86.32,156.49,88.45,156.49,401.43,Single-ply,SBD,M
Boys,99.79,1,Mykel Gates,Carthage,97.61,224.53,113.4,226.8,564.72,Single-ply,SBD,M
Boys,99.79,2,Tristian Seahorn,Gladewater,93.03,183.7,124.74,170.1,478.54,Single-ply,SBD,M
Boys,99.79,3,Luis Acosta,Hallsville,98.11,163.29,102.06,185.97,451.32,Single-ply,SBD,M
Boys,99.79,4,Kingrey Sullens,Hallsville,91.67,167.83,108.86,163.29,439.98,Single-ply,SBD,M
Boys,99.79,5,Francisco Martinez,Atlanta,96.89,158.76,90.72,181.44,430.91,Single-ply,SBD,M
Boys,99.79,6,Brett Parks,Hallsville,91.26,163.29,92.99,170.1,426.38,Single-ply,SBD,M
Boys,99.79,7,Lane Ferguson,Gladewater,97.79,161.03,88.45,170.1,419.57,Single-ply,SBD,M
Boys,99.79,8,Cade Fant,Atlanta,90.9,149.69,83.91,167.83,401.43,Single-ply,SBD,M
Boys,99.79,9,Jack Henderson,Atlanta,98.16,156.49,90.72,149.69,396.89,Single-ply,SBD,M
Boys,99.79,10,Jared Cowgill,Atlanta,93.98,142.88,95.25,151.95,390.09,Single-ply,SBD,M
Boys,99.79,11,Garon Dupree,Atlanta,92.35,115.67,77.11,124.74,317.51,Single-ply,SBD,M
Boys,99.79,DQ,Austin Gray,Carthage,98.11,170.1,,,,Single-ply,SBD,M
Boys,109.77,1,Tristan Allen,Atlanta,100.79,172.37,117.93,226.8,517.1,Single-ply,SBD,M
Boys,109.77,2,Dreka Ransom,Gladewater,108.95,170.1,106.59,181.44,458.13,Single-ply,SBD,M
Boys,109.77,3,Josh Wiley,Atlanta,101.65,163.29,102.06,167.83,433.18,Single-ply,SBD,M
Boys,109.77,4,Hunter Gauger,Carthage,100.97,149.69,99.79,181.44,430.91,Single-ply,SBD,M
Boys,109.77,5,Darrian Ingram,Carthage,102.38,149.69,102.06,158.76,410.5,Single-ply,SBD,M
Boys,109.77,6,Jacob Humphrey,Atlanta,105.73,115.67,54.43,124.74,294.84,Single-ply,SBD,M
Boys,109.77,DQ,Tanner Koenig,Hallsville,102.06,149.69,77.11,,,Single-ply,SBD,M
Boys,124.74,1,Cecil Johnson,Hallsville,113.35,229.06,117.93,215.46,562.45,Single-ply,SBD,M
Boys,124.74,2,Antonio Ortiz,Hallsville,119.39,195.04,127.01,181.44,503.49,Single-ply,SBD,M
Boys,124.74,3,Randy Jones,Hallsville,111.63,158.76,102.06,190.51,451.32,Single-ply,SBD,M
Boys,124.74,4,Dylan Russell,Hallsville,112.45,149.69,111.13,174.63,435.45,Single-ply,SBD,M
Boys,124.74,5,Adrian Cervantes,Gladewater,120.47,147.42,79.38,151.95,378.75,Single-ply,SBD,M
Boys,124.74,6,Phillip Azar,Atlanta,117.21,140.61,83.91,149.69,374.21,Single-ply,SBD,M
Boys,124.74+,1,Xzavien Russell,Waskom,179.31,226.8,131.54,204.12,562.45,Single-ply,SBD,M
Boys,124.74+,2,Jack Smith,Waskom,152.04,204.12,127.01,204.12,535.24,Single-ply,SBD,M
Boys,124.74+,3,Dustin Williams,Atlanta,128.91,172.37,133.81,181.44,487.61,Single-ply,SBD,M
Boys,124.74+,4,Blake Trainor,Hallsville,147.05,165.56,95.25,213.19,474,Single-ply,SBD,M
Boys,124.74+,5,Casey Jones,Carthage,136.26,163.29,108.86,181.44,453.59,Single-ply,SBD,M
Boys,124.74+,6,Rylan Tipton,Hallsville,127.05,154.22,90.72,172.37,417.3,Single-ply,SBD,M
