Place,WeightClassKg,Name,State,BodyweightKg,Sex,Event,Equipment,Division,Best3SquatKg,Best3BenchKg,Best3DeadliftKg,TotalKg
1,90+,Stephanie Gibson,OH,92.08,F,SBD,Single-ply,wsm2,175,117.5,155,447.5
1,52,Heather Core,OH,49.9,F,SBD,Single-ply,whs,82.5,37.5,107.5,227.5
1,56,Hillary Jackson,OH,53.71,F,SBD,Single-ply,whs,85,27.5,87.5,200
1,82.5,Michael Baker,OH,81.78,M,SBD,Single-ply,teen,250,145,255,650
1,140,Chad Small,OH,131.54,M,SBD,Single-ply,teen,230,122.5,182.5,535
1,110,Cory Gregory,OH,104.19,M,SBD,Single-ply,pure,240,195,250,685
1,100,Richard Sapcut,KY,98.52,M,SBD,Single-ply,p+f,230,155,215,600
1,82.5,Michael Baker,OH,81.78,M,SBD,Single-ply,open,250,145,255,650
1,67.5,Mike Deskins,TX,67,M,SBD,Single-ply,open,177.5,110,217.5,505
1,75,Russ Dodson,OH,71.12,M,SBD,Single-ply,m4,117.5,72.5,155,345
1,67.5,Mike Deskins,TX,67,M,SBD,Single-ply,m2,177.5,110,217.5,505
1,56,Bob Lamb,KY,54.07,M,SBD,Single-ply,m2,165,97.5,170,432.5
1,140,Malikzulu Lumumba,OH,127.1,M,SBD,Single-ply,m2,272.5,182.5,275,730
1,125,Eugene Martin,OH,117.03,M,SBD,Single-ply,m2,222.5,147.5,240,610
1,100,Jim Bennett,SC,94.89,M,SBD,Single-ply,m2,227.5,85,205,517.5
1,140,Palmo Aracri,OH,133.45,M,SBD,Single-ply,m1,327.5,252.5,232.5,812.5
1,140+,Martin Ross,OH,143.97,M,SBD,Single-ply,m1,317.5,235,272.5,825
1,100,Richard Sapcut,KY,98.52,M,SBD,Single-ply,m1,230,155,215,600
1,82.5,Michael Baker,OH,81.78,M,SBD,Single-ply,jr,250,145,255,650
2,82.5,Joe Coulson,OH,76.57,M,SBD,Single-ply,hs,182.5,100,207.5,490
3,82.5,Mike Seeling,OH,78.93,M,SBD,Single-ply,hs,182.5,100,207.5,490
2,75,Mason Harbour,OH,69.54,M,SBD,Single-ply,hs,165,107.5,177.5,450
1,75,Ryan Stewart,OH,73.44,M,SBD,Single-ply,hs,160,102.5,197.5,460
3,75,Brian Haymon,OH,71.35,M,SBD,Single-ply,hs,160,110,170,440
1,67.5,Cody Weeks,OH,66.72,M,SBD,Single-ply,hs,150,97.5,167.5,415
4,75,Craig Boling,OH,71.76,M,SBD,Single-ply,hs,127.5,77.5,160,365
1,90,Gunner Whitaker,OH,82.69,M,SBD,Single-ply,hs,170,115,227.5,512.5
1,125,Jarod Holycross,OH,114.62,M,SBD,Single-ply,hs,220,127.5,227.5,575
1,100,Nick Snapp,OH,90.49,M,SBD,Single-ply,hs,160,107.5,187.5,455
2,125,Brad Muffett,OH,113.85,M,SBD,Single-ply,hs,135,102.5,185,422.5
1,82.5,Richard Budrow,WV,81.1,M,B,Single-ply,hs,,145,,145
1,125,Jay Marzano,OH,116.57,M,B,Single-ply,m1,,230,,230
1,56,Bob Lamb,KY,54.07,M,B,Single-ply,m2,,97.5,,97.5
1,90,Jeff Chrissis,OH,89.36,M,B,Single-ply,m2,,182.5,,182.5
DQ,140+,Bill Lobins,PA,163.02,M,B,Single-ply,m2,,-282.5,,
1,82.5,Larry Donahue,OH,80.74,M,B,Single-ply,m3,,110,,110
1,110,Steven Diel,OH,108.14,M,B,Single-ply,open,,275,,275
1,100,JT Hall,KY,99.11,M,B,Single-ply,open,,220,,220
1,100,Clint Poore,KY,97.98,M,B,Single-ply,smp,,215,,215
1,82.5,Richard Budrow,WV,81.1,M,B,Raw,m1,,145,,145
1,125,Eugene Martin,OH,117.03,M,B,Raw,m2,,147.5,,147.5
1,82.5,Richard Budrow,WV,81.1,M,B,Raw,m5,,145,,145
1,100,JT Hall,KY,99.11,M,B,Raw,open,,220,,220
1,125,Eugene Martin,OH,117.03,M,D,Raw,m2,,,240,240
1,140+,Andrew King,KY,148.51,M,SBD,Raw,hs,227.5,140,182.5,550
1,75,Brad McClure,KY,73.84,M,BD,Raw,int,,147.5,197.5,345
1,140,Desmond Phillips,OH,134.35,M,BD,Raw,m1,,205,365,570
1,82.5,Tom Ballengee,WV,77.11,M,BD,Raw,m2,,92.5,160,252.5
1,140+,Kent Burgess,WV,140.16,M,BD,Raw,m2,,210,238.5,448.5
1,82.5,Larry Donahue,OH,80.74,M,BD,Raw,m3,,110,150,260
1,100,Jeff Rybak,OH,98.2,M,BD,Raw,m5,,147.5,215,362.5
1,110,Edward Lytle,IN,106.55,M,BD,Raw,m5,,95,142.5,237.5
1,125,Jerry Meyers,IN,116.53,M,BD,Raw,nov,,112.5,210,322.5
1,90,Bryan Kimble,OH,85.28,M,BD,Raw,p+f,,127.5,192.5,320
1,125,Jerry Meyers,IN,116.53,M,BD,Raw,sm2,,112.5,210,322.5
1,90,Bryan Kimble,OH,85.28,M,BD,Raw,smp,,127.5,192.5,320
1,125,Eugene Martin,OH,117.03,M,S,Raw,sqm2,222.5,,,222.5
1,140+,Andrew King,KY,148.51,M,SBD,Raw,teen,227.5,140,182.5,550
1,75,Dan Breckenridge,OH,70.85,M,B,Raw,jr,,130,,130
1,67.5,Robert Fox,MI,67.09,M,B,Raw,m1,,145,,145
1,140,Joseph Behari Jr,OH,128.19,M,B,Raw,m1,,220,,220
1,125,Regal Summers,OH,116.94,M,B,Raw,m1,,157.5,,157.5
1,140+,Kent Burgess,WV,140.16,M,B,Raw,m2,,210,,210
1,90,Roland Leone,MI,87.59,M,B,Raw,m3,,142.5,,142.5
1,67.5,Robert Fox,MI,67.09,M,B,Raw,m5,,145,,145
1,90,Greg Martin,OH,88.22,M,B,Raw,mp,,137.5,,137.5
1,110,Richard Chambers,IN,106,M,B,Raw,nov,,187.5,,187.5
1,67.5,Robert Fox,MI,67.09,M,B,Raw,open,,145,,145
1,100,JT Hall,KY,99.11,M,B,Raw,pure,,220,,220
1,140,Joseph Behari Jr,OH,128.19,M,B,Raw,pure,,220,,220
1,52,Lisa Lowery,OH,49.49,F,B,Raw,wm1,,57.5,,57.5
1,82.5,Cody Sapcut,KY,82.37,M,SBD,Wraps,hs,175,102.5,182.5,460
2,82.5,Nathan Brumback,KY,81.33,M,SBD,Wraps,hs,150,100,205,455
3,82.5,Jessie Slone,OH,81.78,M,SBD,Wraps,hs,155,95,182.5,432.5
1,75,Marc Van Dermulen,OH,68.04,M,SBD,Wraps,hs,130,60,157.5,347.5
2,75,Jesse Kite,OH,67.9,M,SBD,Wraps,hs,130,60,152.5,342.5
1,67.5,Trevor Helmlinger,OH,67.45,M,SBD,Wraps,hs,112.5,72.5,135,320
1,100,Josh Miller,KY,99.06,M,SBD,Wraps,hs,185,165,215,565
1,140,Joey Rogers,OH,137.08,M,SBD,Wraps,hs,255,172.5,192.5,620
1,82.5,David Bennett #4,SC,77.88,M,SBD,Wraps,int,160,125,202.5,487.5
1,125,Josh Conley,PA,123.97,M,SBD,Wraps,int,282.5,165,282.5,730
1,90,Jordan Whitehead,KY,89.81,M,SBD,Wraps,jr,217.5,145,267.5,630
1,82.5,Jason Daniel,OH,80.01,M,SBD,Wraps,jr,102.5,110,182.5,395
1,110,KA Vandermolen,OH,103.87,M,SBD,Wraps,m2,170,142.5,200,512.5
1,100,Dan Green,CA,99.79,M,SBD,Wraps,open,272.5,180,295,747.5
1,125,Tab Brown,WV,114.31,M,SBD,Wraps,sm2,207.5,160,220,587.5
1,100,Josh Miller,KY,99.06,M,SBD,Wraps,teen,185,165,215,565
1,60,Kora Whitaker,KY,58.51,F,SBD,Wraps,whs,52.5,47.5,102.5,202.5
1,90+,Amelica Carter,OH,110.22,F,SBD,Wraps,whs,90,62.5,125,277.5
1,67.5,Karly Lump,OH,65.05,F,SBD,Wraps,whs,62.5,32.5,82.5,177.5
1,60,Dani Lump,OH,59.87,F,SBD,Wraps,whs,62.5,37.5,57.5,157.5
1,67.5,Chara Barker,OH,61.14,F,SBD,Wraps,wjr,112.5,60,155,327.5
1,90+,Jerriann Doll,OH,99.47,F,SBD,Wraps,wpure,115,92.5,162.5,370
1,82.5,Jason Smith,KY,79.33,M,BD,Single-ply,hs,,132.5,192.5,325
1,75,Matt Montgomery,KY,72.89,M,BD,Single-ply,hs,,107.5,182.5,290
2,75,Zach Stewart,OH,69.67,M,BD,Single-ply,hs,,55,132.5,187.5
3,75,Joe Worrell,OH,70.49,M,BD,Single-ply,hs,,47.5,115,162.5
1,100,Josh Miller,KY,99.06,M,BD,Single-ply,hs,,165,215,380
1,140+,Andrew King,KY,148.51,M,BD,Single-ply,hs,,140,182.5,322.5
1,90,Jeff Chrissis,OH,89.36,M,BD,Single-ply,m2,,182.5,175,357.5
1,75,Russ Dodson,OH,71.12,M,BD,Single-ply,m4,,72.5,155,227.5
1,75,Nicholas Leone,MI,74.39,M,BD,Single-ply,sm1,,142.5,222.5,365
1,75,Mark Swanner,KY,74.62,M,BD,Single-ply,teen,,97.5,137.5,235
1,100,Jimmy Kolb,OH,99.56,M,BD,Single-ply,teen,,272.5,262.5,535
1,60,Kora Whitaker,KY,58.51,F,BD,Single-ply,whs,,47.5,102.5,150
1,75,Erica Ervin,OH,74.16,F,BD,Single-ply,whs,,42.5,87.5,130
1,90+,Stephanie Gibson,OH,92.08,F,BD,Single-ply,wsm2,,117.5,155,272.5
