Division,WeightClassKg,Place,Name,Team,BodyweightKg,Best3SquatKg,Best3BenchKg,Best3DeadliftKg,TotalKg,Equipment,Event,Sex
Boys,51.71,1,Colton Niemeir,Crawford,40.82,97.52,47.63,102.06,247.21,Single-ply,SBD,M
Boys,51.71,2,Tyler Dews,Gatesville,42.09,54.43,24.95,70.31,149.69,Single-ply,SBD,M
Boys,55.79,1,D'Montre Brown,Cameron Yoe,54.7,167.83,97.52,188.24,453.59,Single-ply,SBD,M
Boys,55.79,2,Baldomero Sanchez,Riesel,55.52,136.08,81.65,158.76,376.48,Single-ply,SBD,M
Boys,59.87,3,Josh Price,Moody,55.97,90.72,52.16,106.59,249.48,Single-ply,SBD,M
Boys,55.79,4,Cannon Tate,Riesel,53.8,90.72,40.82,95.25,226.8,Single-ply,SBD,M
Boys,59.87,1,Keith Langford,Riesel,58.15,147.42,74.84,158.76,381.02,Single-ply,SBD,M
Boys,59.87,2,Dalton Long,Dawson,57.61,127.01,74.84,138.35,340.19,Single-ply,SBD,M
Boys,59.87,3,DeVonte Graves,Chilton,58.88,113.4,70.31,149.69,333.39,Single-ply,SBD,M
Boys,59.87,4,Chip Espin,Axtell,59.33,115.67,77.11,131.54,324.32,Single-ply,SBD,M
Boys,59.87,5,Seth Waters,Gatesville,57.33,102.06,56.7,111.13,269.89,Single-ply,SBD,M
Boys,67.13,1,Jesus Jaimes,Riesel,65.41,217.72,131.54,217.72,566.99,Single-ply,SBD,M
Boys,67.13,2,Michael Kohl,Rosebud-Lott,65.86,190.51,120.2,192.78,503.49,Single-ply,SBD,M
Boys,67.13,3,Dylan Haralson,Axtell,65.05,188.24,86.18,165.56,439.98,Single-ply,SBD,M
Boys,67.13,4,Steven Foster,Riesel,60.96,172.37,95.25,163.29,430.91,Single-ply,SBD,M
Boys,67.13,5,Gabe Cobos,Riesel,65.41,136.08,90.72,181.44,408.23,Single-ply,SBD,M
Boys,67.13,6,Travis Stone,Rogers,62.23,156.49,74.84,163.29,394.63,Single-ply,SBD,M
Boys,74.84,7,Brady Baker,Riesel,67.31,156.49,77.11,154.22,387.82,Single-ply,SBD,M
Boys,67.13,8,Dillon McBide,Axtell,66.95,122.47,92.99,142.88,358.34,Single-ply,SBD,M
Boys,67.13,9,Justin Farmer,Moody,62.69,117.93,74.84,145.15,337.93,Single-ply,SBD,M
Boys,67.13,10,Dakota Hollingsworth,Moody,65.95,111.13,68.04,151.95,331.12,Single-ply,SBD,M
Boys,67.13,11,Hunter Barben,Riesel,63.23,113.4,63.5,127.01,303.91,Single-ply,SBD,M
Boys,67.13,12,Lane Love,Moody,65.77,108.86,65.77,120.2,294.84,Single-ply,SBD,M
Boys,67.13,DQ,Jong Hoon Lim,Gatesville,66.32,172.37,122.47,,,Single-ply,SBD,M
Boys,74.84,1,Tom Lawless,Rogers,73.03,204.12,92.99,190.51,487.61,Single-ply,SBD,M
Boys,74.84,2,Tristan Dudley,Rogers,72.12,181.44,108.86,174.63,464.93,Single-ply,SBD,M
Boys,74.84,3,Brandon Even,Moody,68.76,154.22,95.25,179.17,428.64,Single-ply,SBD,M
Boys,74.84,4,Alan Scott,Gatesville,69.04,163.29,90.72,174.63,428.64,Single-ply,SBD,M
Boys,74.84,5,Rody Wiley,Axtell,73.84,176.9,104.33,147.42,428.64,Single-ply,SBD,M
Boys,74.84,6,Edmond Marton,Axtell,69.85,156.49,83.91,172.37,412.77,Single-ply,SBD,M
Boys,74.84,7,Brendan Myers,Cameron Yoe,68.04,104.33,63.5,102.06,269.89,Single-ply,SBD,M
Boys,74.84,DQ,Cole Thigpen,Chilton,74.57,124.74,,,,Single-ply,SBD,M
Boys,82.1,1,Chris Olsen,Crawford,81.37,204.12,124.74,217.72,546.58,Single-ply,SBD,M
Boys,82.1,2,John Lawless,Rogers,78.02,208.65,106.59,190.51,505.76,Single-ply,SBD,M
Boys,82.1,3,Marco Vasquez,Riesel,80.65,181.44,127.01,190.51,498.95,Single-ply,SBD,M
Boys,82.1,4,Bryson Jones,Rogers,78.93,167.83,102.06,165.56,435.45,Single-ply,SBD,M
Boys,82.1,5,Matt Brown #7,Crawford,76.75,149.69,106.59,158.76,415.04,Single-ply,SBD,M
Boys,82.1,6,Kasey Kiphen,Gatesville,77.38,158.76,86.18,167.83,412.77,Single-ply,SBD,M
Boys,82.1,7,Justin Mosely,Gatesville,78.38,154.22,95.25,163.29,412.77,Single-ply,SBD,M
Boys,82.1,8,Braden Murphy,Crawford,79.47,158.76,88.45,151.95,399.16,Single-ply,SBD,M
Boys,82.1,9,Nick Moler,Gatesville,78.38,149.69,61.23,181.44,392.36,Single-ply,SBD,M
Boys,82.1,10,Tanner Coone,Axtell,76.75,140.61,90.72,151.95,383.29,Single-ply,SBD,M
Boys,82.1,11,Nate Moenning,Crawford,80.2,145.15,83.91,138.35,367.41,Single-ply,SBD,M
Boys,82.1,12,Conner Moss,Dawson,78.83,124.74,74.84,142.88,342.46,Single-ply,SBD,M
Boys,82.1,DQ,Matt Karl,Chilton,78.83,,,,,Single-ply,SBD,M
Boys,82.1,DQ,Cillon Van Zandt,Crawford,75.39,138.35,,138.35,,Single-ply,SBD,M
Boys,89.81,1,Chris Hubnik,Rogers,87.72,272.16,156.49,251.74,680.39,Single-ply,SBD,M
Boys,89.81,2,Brody Jones,Crawford,87.54,247.21,145.15,213.19,605.55,Single-ply,SBD,M
Boys,89.81,3,Tyler Martinez,Axtell,85.09,201.85,102.06,197.31,501.22,Single-ply,SBD,M
Boys,89.81,4,Preston Parsons,Moody,88.63,170.1,111.13,158.76,439.98,Single-ply,SBD,M
Boys,89.81,5,Jacob Trevino,Moody,86.82,172.37,92.99,167.83,433.18,Single-ply,SBD,M
Boys,89.81,6,Richard Mills,Riesel,89.09,156.49,90.72,149.69,396.89,Single-ply,SBD,M
Boys,89.81,7,Dakota Sullivan,Dawson,88,136.08,83.91,167.83,387.82,Single-ply,SBD,M
Boys,89.81,8,Ignacio Guttevez,Chilton,87.54,124.74,88.45,147.42,360.61,Single-ply,SBD,M
Boys,89.81,9,William Roberts,Riesel,89.63,131.54,74.84,131.54,337.93,Single-ply,SBD,M
Boys,89.81,10,Tyler Bond,Crawford,85.55,95.25,65.77,111.13,272.16,Single-ply,SBD,M
Boys,99.79,DQ,Joe Gonzales,Cameron Yoe,89.9,156.49,,,,Single-ply,SBD,M
Boys,99.79,1,Ej Waggy,Rogers,99.43,226.8,136.08,204.12,566.99,Single-ply,SBD,M
Boys,99.79,2,Joseph Reddick,Riesel,93.62,213.19,124.74,204.12,542.04,Single-ply,SBD,M
Boys,99.79,3,Joseph Huffman,Rogers,99.34,190.51,111.13,181.44,483.08,Single-ply,SBD,M
Boys,99.79,4,Jeremy Grant,Dawson,94.89,199.58,97.52,183.7,480.81,Single-ply,SBD,M
Boys,99.79,5,Jacob Skains,Axtell,92.53,176.9,106.59,190.51,474,Single-ply,SBD,M
Boys,109.77,6,Justin Rhyne,Gatesville,99.88,172.37,136.08,163.29,471.74,Single-ply,SBD,M
Boys,99.79,7,Jacob Kevil,Crawford,91.35,170.1,102.06,170.1,442.25,Single-ply,SBD,M
Boys,99.79,8,Kameron Smith,Chilton,93.8,167.83,111.13,154.22,433.18,Single-ply,SBD,M
Boys,99.79,9,Carlos Angulo,Gatesville,92.44,145.15,74.84,140.61,360.61,Single-ply,SBD,M
Boys,99.79,10,Dylan Morgan,Riesel,94.62,113.4,58.97,117.93,290.3,Single-ply,SBD,M
Boys,99.79,11,Jose Chavez,Riesel,90.54,90.72,61.23,120.2,272.16,Single-ply,SBD,M
Boys,99.79,DQ,John Maddigan,Rosebud-Lott,95.8,258.55,154.22,,,Single-ply,SBD,M
Boys,99.79,DQ,Austin Talafuse,Rosebud-Lott,95.44,163.29,,,,Single-ply,SBD,M
Boys,99.79,DQ,Brandon Vargas,Cameron Yoe,99.25,158.76,,,,Single-ply,SBD,M
Boys,99.79,DQ,Ben Chavez,Chilton,93.62,,,,,Single-ply,SBD,M
Boys,109.77,1,Cyle Hickey,Crawford,107.14,210.92,120.2,231.33,562.45,Single-ply,SBD,M
Boys,109.77,2,Cameron Mueck,Cameron Yoe,106.14,181.44,99.79,165.56,446.79,Single-ply,SBD,M
Boys,109.77,3,Jyan Valverde,Cameron Yoe,106.78,181.44,90.72,172.37,444.52,Single-ply,SBD,M
Boys,109.77,4,Tyler Thompson,Rogers,101.51,174.63,83.91,151.95,410.5,Single-ply,SBD,M
Boys,109.77,DQ,Trevon Williams,Rosebud-Lott,102.15,226.8,,,,Single-ply,SBD,M
Boys,124.74,1,Ryan Zdroik,Rogers,119.11,251.74,163.29,242.67,657.71,Single-ply,SBD,M
Boys,124.74,2,Donnie Smpson,Chilton,113.4,226.8,131.54,204.12,562.45,Single-ply,SBD,M
Boys,124.74,3,Kyle Golden,Dawson,114.21,199.58,131.54,195.04,526.17,Single-ply,SBD,M
Boys,124.74,4,Brandon White,Axtell,124.1,213.19,113.4,199.58,526.17,Single-ply,SBD,M
Boys,124.74+,1,Michael Williams,Dawson,137.98,215.46,102.06,181.44,498.95,Single-ply,SBD,M
