Division,WeightClassKg,Place,Name,Team,BodyweightKg,Best3SquatKg,Best3BenchKg,Best3DeadliftKg,TotalKg,Equipment,Event,Sex
Boys,51.71,1,Jonathon Luna,Tulia,49.21,131.54,88.45,142.88,362.87,Single-ply,SBD,M
Boys,55.79,2,Carlos Raya,Plainview,51.89,124.74,92.99,129.27,347,Single-ply,SBD,M
Boys,51.71,3,Robert Sanchez,Andrews,51.21,99.79,70.31,122.47,292.57,Single-ply,SBD,M
Boys,51.71,4,Erik Gomez,Post,51.71,104.33,52.16,117.93,274.42,Single-ply,SBD,M
Boys,51.71,5,Efren Miranda,Levelland,50.71,97.52,52.16,122.47,272.16,Single-ply,SBD,M
Boys,51.71,6,Luis Macias,Abernathy,50.53,81.65,49.9,113.4,244.94,Single-ply,SBD,M
Boys,55.79,7,Davin Luna,Plainview,51.85,81.65,43.09,102.06,226.8,Single-ply,SBD,M
Boys,59.87,1,Shirmar Jennings,Plainview,56.02,199.58,111.13,199.58,510.29,Single-ply,SBD,M
Boys,55.79,2,Van Phan,Lamesa,55.52,136.08,86.18,156.49,378.75,Single-ply,SBD,M
Boys,55.79,3,Justin Tovar,Abernathy,53.12,133.81,83.91,133.81,351.53,Single-ply,SBD,M
Boys,59.87,4,Luis Castro,Plainview,55.93,111.13,65.77,120.2,297.1,Single-ply,SBD,M
Boys,55.79,5,Jayson Stephenson,Abernathy,54.57,106.59,68.04,108.86,283.5,Single-ply,SBD,M
Boys,59.87,1,Christian Perez,Post,58.29,163.29,74.84,142.88,381.02,Single-ply,SBD,M
Boys,59.87,2,Cambry Gilbert,Post,57.56,142.88,74.84,151.95,369.68,Single-ply,SBD,M
Boys,67.13,3,Isaah Jones,Post,60.06,111.13,70.31,115.67,297.1,Single-ply,SBD,M
Boys,59.87,4,James Vasquez,Wolfforth Frenship,58.11,104.33,70.31,102.06,276.69,Single-ply,SBD,M
Boys,67.13,5,Alex Villanueva,Levelland,59.96,81.65,56.7,79.38,217.72,Single-ply,SBD,M
Boys,59.87,DQ,Derrick Siebman,Childress,59.19,,,,,Single-ply,SBD,M
Boys,67.13,1,Pablo Hinojosa,Lamesa,65,188.24,97.52,190.51,476.27,Single-ply,SBD,M
Boys,67.13,2,Jacob Garza,Olton,65.09,147.42,97.52,154.22,399.16,Single-ply,SBD,M
Boys,67.13,3,Alejo Rodriguez,Post,65.32,142.88,88.45,147.42,378.75,Single-ply,SBD,M
Boys,74.84,4,Carlos Hinojosa,Lamesa,67.22,129.27,74.84,165.56,369.68,Single-ply,SBD,M
Boys,67.13,5,Xavier Baker,Sudan,65.82,131.54,77.11,154.22,362.87,Single-ply,SBD,M
Boys,67.13,6,Rickie Johnson,Tulia,62.64,136.08,83.91,140.61,360.61,Single-ply,SBD,M
Boys,67.13,7,Nik Clarkson,Abernathy,61.55,131.54,74.84,151.95,358.34,Single-ply,SBD,M
Boys,67.13,8,Nick Aguayo,Lamesa,66.09,127.01,70.31,149.69,347,Single-ply,SBD,M
Boys,67.13,9,Lucas Macias,Abernathy,63.73,113.4,83.91,129.27,326.59,Single-ply,SBD,M
Boys,67.13,10,Brian Amador,Lamesa,61.33,120.2,77.11,124.74,322.05,Single-ply,SBD,M
Boys,67.13,11,Nathan Basaldua,Tulia,63.28,102.06,74.84,129.27,306.17,Single-ply,SBD,M
Boys,67.13,12,Jesus Manzanares,Muleshoe,63.41,81.65,79.38,140.61,301.64,Single-ply,SBD,M
Boys,67.13,13,Jonathon Esquivel,Denver City,65.77,81.65,72.57,117.93,272.16,Single-ply,SBD,M
Boys,67.13,14,Raul Vasquez,Andrews,61.05,108.86,63.5,92.99,265.35,Single-ply,SBD,M
Boys,67.13,15,Marcus Iglesias,Levelland,63.28,79.38,43.09,124.74,247.21,Single-ply,SBD,M
Boys,67.13,DQ,Alex Valdez,Andrews,66.63,,,,,Single-ply,SBD,M
Boys,67.13,DQ,DJ Brown,Post,62.23,,,,,Single-ply,SBD,M
Boys,74.84,1,Brandon Guerrero,Childress,72.03,206.38,108.86,231.33,546.58,Single-ply,SBD,M
Boys,74.84,2,Isaac Stern,Post,71.21,163.29,104.33,204.12,471.74,Single-ply,SBD,M
Boys,74.84,3,Dillon Stevens,Wolfforth Frenship,74.75,181.44,99.79,185.97,467.2,Single-ply,SBD,M
Boys,74.84,4,Jd Lopez,Childress,72.08,170.1,111.13,176.9,458.13,Single-ply,SBD,M
Boys,74.84,5,Corey Richardson,Levelland,71.4,174.63,108.86,172.37,455.86,Single-ply,SBD,M
Boys,74.84,6,Edward Jalomo,Olton,71.99,170.1,99.79,176.9,446.79,Single-ply,SBD,M
Boys,74.84,7,Eric Vega,Plainview,70.53,170.1,90.72,181.44,442.25,Single-ply,SBD,M
Boys,82.1,8,Cole Gatzki,Plains,74.98,163.29,104.33,172.37,439.98,Single-ply,SBD,M
Boys,74.84,9,Alan Alaniz,Post,73.8,145.15,106.59,172.37,424.11,Single-ply,SBD,M
Boys,74.84,10,Michael Guerrero,Lockney,73.39,140.61,108.86,170.1,419.57,Single-ply,SBD,M
Boys,74.84,11,Paden Babb,Post,67.59,161.03,83.91,156.49,401.43,Single-ply,SBD,M
Boys,74.84,12,Paul Perez,Levelland,73.44,142.88,104.33,154.22,401.43,Single-ply,SBD,M
Boys,74.84,13,Braden Bessire,Muleshoe,69.08,163.29,79.38,149.69,392.36,Single-ply,SBD,M
Boys,74.84,14,Zeb Graves,Post,72.39,142.88,102.06,145.15,390.09,Single-ply,SBD,M
Boys,74.84,15,Blayne Redwine,Abernathy,72.57,142.88,90.72,154.22,387.82,Single-ply,SBD,M
Boys,74.84,16,Trenton Jones,Levelland,74.84,136.08,92.99,124.74,353.8,Single-ply,SBD,M
Boys,74.84,17,Eduardo Hernandez,Denver City,72.17,102.06,88.45,140.61,331.12,Single-ply,SBD,M
Boys,74.84,18,Vince Urbina,Andrews,74.34,138.35,65.77,120.2,324.32,Single-ply,SBD,M
Boys,74.84,19,Alex Greenwood,Andrews,67.63,111.13,72.57,131.54,315.25,Single-ply,SBD,M
Boys,74.84,20,Iniel Bustos,Denver City,74.62,115.67,79.38,115.67,310.71,Single-ply,SBD,M
Boys,74.84,21,Tristan Fannin,Post,71.94,97.52,56.7,124.74,278.96,Single-ply,SBD,M
Boys,74.84,22,Fernando Vasquez,Denver City,72.12,90.72,,,90.72,Single-ply,S,M
Boys,74.84,DQ,Ethan Trotter,Andrews,68.99,,,,,Single-ply,S,M
Boys,82.1,1,Nathaniel Gill,Post,82.01,201.85,120.2,188.24,510.29,Single-ply,SBD,M
Boys,82.1,2,Caden Dean,Post,80.47,174.63,124.74,181.44,480.81,Single-ply,SBD,M
Boys,82.1,3,Staley Arredondo,Lamesa,80.2,188.24,88.45,185.97,462.66,Single-ply,SBD,M
Boys,82.1,4,John David Crenshaw,Andrews,80.15,167.83,111.13,181.44,460.4,Single-ply,SBD,M
Boys,82.1,5,Bryan Smith,Post,80.38,151.95,111.13,176.9,439.98,Single-ply,SBD,M
Boys,82.1,6,Alex Guerrero,Childress,79.11,165.56,99.79,172.37,437.72,Single-ply,SBD,M
Boys,82.1,7,Rafael González,Post,81.78,161.03,97.52,161.03,419.57,Single-ply,SBD,M
Boys,82.1,8,Edwin Delgado,Sudan,79.65,136.08,97.52,181.44,415.04,Single-ply,SBD,M
Boys,82.1,9,Michael Deanda,Lamesa,81.47,154.22,97.52,161.03,412.77,Single-ply,SBD,M
Boys,82.1,10,Marco Erives,Post,77.34,158.76,92.99,151.95,403.7,Single-ply,SBD,M
Boys,82.1,11,Cesar Dominguez,Denver City,75.34,124.74,99.79,147.42,371.95,Single-ply,SBD,M
Boys,82.1,12,James Hill,Tulia,80.38,131.54,74.84,145.15,351.53,Single-ply,SBD,M
Boys,82.1,13,Avery Torres,Denver City,82.1,102.06,95.25,117.93,315.25,Single-ply,SBD,M
Boys,82.1,14,Juan Ramirez,Wolfforth Frenship,76.66,102.06,77.11,131.54,310.71,Single-ply,SBD,M
Boys,82.1,15,Jon Cortez,Wolfforth Frenship,80.15,92.99,77.11,106.59,276.69,Single-ply,SBD,M
Boys,82.1,16,Matthew Thompson,Sudan,76.16,92.99,56.7,104.33,254.01,Single-ply,SBD,M
Boys,89.81,1,Rudy Vasquez,Plainview,87.54,201.85,104.33,201.85,508.02,Single-ply,SBD,M
Boys,89.81,2,Nick Anna,Plains,85.28,185.97,108.86,190.51,485.34,Single-ply,SBD,M
Boys,89.81,3,Isaiah Gonzales,Plainview,83.01,190.51,97.52,174.63,462.66,Single-ply,SBD,M
Boys,89.81,4,Travis Greathouse,Post,84.1,165.56,120.2,161.03,446.79,Single-ply,SBD,M
Boys,89.81,5,Damion Montes,Sudan,82.55,158.76,95.25,174.63,428.64,Single-ply,SBD,M
Boys,89.81,6,Wyatt Joyce,Sudan,89.27,138.35,99.79,163.29,401.43,Single-ply,SBD,M
Boys,89.81,7,Omar Dones,Dimmitt,82.64,156.49,90.72,147.42,394.63,Single-ply,SBD,M
Boys,89.81,8,Tanner Hastings,Levelland,88.41,136.08,104.33,147.42,387.82,Single-ply,SBD,M
Boys,89.81,9,Esteban Lopez,Andrews,89.4,124.74,90.72,138.35,353.8,Single-ply,SBD,M
Boys,89.81,DQ,Duston Vargas,Andrews,86.27,,,,,Single-ply,SBD,M
Boys,99.79,1,Azel Alvidrez,Andrews,96.71,199.58,142.88,219.99,562.45,Single-ply,SBD,M
Boys,99.79,2,Aiden Lopez,Plainview,97.2,199.58,117.93,229.06,546.58,Single-ply,SBD,M
Boys,99.79,3,Brendan Voss,Plainview,94.08,185.97,117.93,210.92,514.83,Single-ply,SBD,M
Boys,99.79,4,Ryan Johnson,Muleshoe,96.16,195.04,127.01,190.51,512.56,Single-ply,SBD,M
Boys,99.79,5,Eddie Sanchez,Lamesa,97.11,195.04,115.67,188.24,498.95,Single-ply,SBD,M
Boys,99.79,6,Ruben Silva,Dimmitt,98.16,181.44,120.2,165.56,467.2,Single-ply,SBD,M
Boys,99.79,7,D'Angelo Thomas,Plainview,94.48,156.49,99.79,167.83,424.11,Single-ply,SBD,M
Boys,99.79,8,Gilbert Cantu,Andrews,96.62,140.61,117.93,136.08,394.63,Single-ply,SBD,M
Boys,99.79,9,Luis Valenzuela,Andrews,96.89,149.69,90.72,147.42,387.82,Single-ply,SBD,M
Boys,99.79,10,Collin Fulton,Lockney,96.21,117.93,102.06,163.29,383.29,Single-ply,SBD,M
Boys,99.79,11,Joey Aceves,Andrews,92.26,142.88,86.18,142.88,371.95,Single-ply,SBD,M
Boys,109.77,1,Gavin Flores,Dimmitt,108,199.58,124.74,185.97,510.29,Single-ply,SBD,M
Boys,109.77,2,Matthew Cardenas,Wolfforth Frenship,103.06,201.85,124.74,181.44,508.02,Single-ply,SBD,M
Boys,109.77,3,Hagen Kelly,Plainview,109.59,170.1,115.67,167.83,453.59,Single-ply,SBD,M
Boys,109.77,4,Tristan Hernandez,Dimmitt,104.1,165.56,111.13,167.83,444.52,Single-ply,SBD,M
Boys,109.77,5,Alex Pena,Dimmitt,101.15,174.63,99.79,167.83,442.25,Single-ply,SBD,M
Boys,109.77,6,Isaiah Hernandez,Abernathy,108.32,147.42,90.72,176.9,415.04,Single-ply,SBD,M
Boys,109.77,7,Juan Lopez,Denver City,106.73,102.06,70.31,136.08,308.44,Single-ply,SBD,M
Boys,109.77,DQ,David Rodriguez,Muleshoe,108.91,,,,,Single-ply,SBD,M
Boys,124.74,1,Celso Guerrero,Childress,120.75,226.8,163.29,229.06,619.15,Single-ply,SBD,M
Boys,124.74,2,Devin Jordan,Wolfforth Frenship,115.85,217.72,113.4,170.1,501.22,Single-ply,SBD,M
Boys,124.74,3,Chris Simmons,Levelland,116.03,185.97,136.08,149.69,471.74,Single-ply,SBD,M
Boys,124.74,4,Arturo Burrola,Denver City,112.4,181.44,97.52,136.08,415.04,Single-ply,SBD,M
Boys,124.74,5,Jordan Russell,Muleshoe,118.84,145.15,92.99,163.29,401.43,Single-ply,SBD,M
Boys,124.74,6,Zachary Hensley,Wolfforth Frenship,118.3,156.49,70.31,147.42,374.21,Single-ply,SBD,M
Boys,124.74,7,Ruben Ascensio,Lockney,114.31,97.52,97.52,163.29,358.34,Single-ply,SBD,M
Boys,124.74,8,O'Shae Grant,Wolfforth Frenship,119.75,154.22,,,154.22,Single-ply,S,M
Boys,124.74+,1,Matt Olivarez,Sudan,169.19,249.48,151.95,238.14,639.57,Single-ply,SBD,M
Boys,124.74+,2,Jimbo Bentley,Childress,126.64,213.19,161.03,240.4,614.62,Single-ply,SBD,M
Boys,124.74+,3,Taylor York,Wolfforth Frenship,134.49,240.4,142.88,229.06,612.35,Single-ply,SBD,M
Boys,124.74+,4,Todd Garner,Wolfforth Frenship,148.55,244.94,147.42,217.72,610.08,Single-ply,SBD,M
Boys,124.74+,5,Cole Coomer,Andrews,146.15,217.72,136.08,215.46,569.26,Single-ply,SBD,M
Boys,124.74+,6,Zion Torres,Abernathy,152.13,210.92,106.59,181.44,498.95,Single-ply,SBD,M
Boys,124.74+,7,Cody Amador,Lockney,164.43,113.4,117.93,149.69,381.02,Single-ply,SBD,M
Boys,124.74+,8,Alexander Dimba,Wolfforth Frenship,194.09,136.08,79.38,124.74,340.19,Single-ply,SBD,M
