Name,Sex,Equipment,Division,BodyweightKg,WeightClassKg,Age,Squat1Kg,Squat2Kg,Squat3Kg,Best3SquatKg,Bench1Kg,Bench2Kg,Bench3Kg,Best3BenchKg,Deadlift1Kg,Deadlift2Kg,Deadlift3Kg,Best3DeadliftKg,TotalKg,Event,Place
Gayle Arrowood,F,Raw,40-49,66.8,67.5,48,57.5,65,-70,65,35,40,42.5,42.5,80,85,90,90,197.5,SBD,1
Karen Flakes,F,Raw,40-49,68.7,75,49,60,70,75,75,40,47.5,-50,47.5,102.5,112.5,115,115,237.5,SBD,1
Janelle Mault,F,Raw,40-49,72,75,40,42.5,-50,50,50,40,45,-47.5,45,102.5,115,130,130,225,SBD,2
Joni Ragsdale,F,Raw,50-59,63.1,67.5,50,55,62.5,67.5,67.5,40,-47.5,-47.5,40,80,90,95,95,202.5,SBD,1
Karen Parnow,F,Raw,50-59,78.2,82.5,50,62.5,70,75,75,50,55,57.5,57.5,92.5,100,105,105,237.5,SBD,1
Gayle Arrowood,F,Raw,Open,66.8,67.5,48,57.5,65,-70,65,35,40,42.5,42.5,80,85,90,90,197.5,SBD,1
Karen Parnow,F,Raw,Open,78.2,82.5,50,62.5,70,75,75,50,55,57.5,57.5,92.5,100,105,105,237.5,SBD,1
Garrett Bjerke,M,Single-ply,16-17,62.5,67.5,17,112.5,122.5,132.5,132.5,62.5,67.5,-70,67.5,125,137.5,145,145,345,SBD,1
Kyle Ransom,M,Single-ply,18-19,93.8,100,19,125,135,-140,135,87.5,100,105,105,170,185,190,190,430,SBD,1
Brent Tanaka,M,Single-ply,Juniors,73.7,75,22,-192.5,192.5,207.5,207.5,140,150,-152.5,150,217.5,237.5,-242.5,237.5,595,SBD,1
John Killin,M,Single-ply,50-59,82.8,90,59,125,142.5,155,155,105,110,-112.5,110,175,190,200,200,465,SBD,1
Lothar Vallot,M,Single-ply,50-59,89.3,90,57,102.5,112.5,120,120,95,100,-105,100,115,130,-142.5,130,350,SBD,3
Jeremy Neher,M,Single-ply,50-59,87.5,90,55,115,127.5,-145,127.5,-72.5,72.5,-77.5,72.5,137.5,-150,150,150,350,SBD,2
Bill Weinstock,M,Single-ply,60-69,75.4,82.5,62,75,,,75,75,,,75,75,,,75,225,SBD,1
David Jurgens,M,Single-ply,Open,82.3,82.5,27,250,,,250,142.5,152.5,160,160,275,,,275,685,SBD,1
Allen Funtanilla,M,Single-ply,Open,89.9,90,39,205,215,-227.5,215,162.5,-170,170,170,207.5,-217.5,,207.5,592.5,SBD,1
Shawn Buckley,M,Single-ply,Open,96.3,100,26,247.5,265,272.5,272.5,185,202.5,207.5,207.5,272.5,295,-302.5,295,775,SBD,1
Barrett Marum,M,Single-ply,Open,108.3,110,30,272.5,287.5,-295,287.5,205,217.5,-227.5,217.5,260,267.5,-277.5,267.5,772.5,SBD,1
Adam Johnson,M,Single-ply,Open,123.8,125,29,-287.5,287.5,300,300,-192.5,200,207.5,207.5,280,295,305,305,812.5,SBD,1
Esteban Peinado,M,Raw,14-15,67.3,67.5,15,75,85,-92.5,85,47.5,52.5,57.5,57.5,85,110,120,120,262.5,SBD,1
Jared Galapia,M,Raw,14-15,71.9,75,14,115,122.5,-132.5,122.5,67.5,77.5,85,85,105,125,140,140,347.5,SBD,1
Terence Davy,M,Raw,18-19,102.2,110,18,192.5,200,207.5,207.5,137.5,-142.5,-142.5,137.5,215,230,245,245,590,SBD,1
Trey Long,M,Raw,Juniors,59.7,60,22,92.5,102.5,-115,102.5,95,-105,105,105,137.5,152.5,167.5,167.5,375,SBD,1
David Zyski,M,Raw,Juniors,138.8,125+,23,185,227.5,250,250,142.5,160,170,170,225,250,277.5,277.5,697.5,SBD,1
Michael Brown,M,Raw,40-49,90,90,48,140,150,-155,150,110,117.5,-122.5,117.5,175,187.5,,187.5,455,SBD,1
Dave Nelson,M,Raw,40-49,86.4,90,41,87.5,-97.5,-97.5,87.5,-62.5,62.5,65,65,102.5,117.5,127.5,127.5,280,SBD,2
Jim Chaaban,M,Raw,40-49,108.3,110,40,195,205,210,210,165,172.5,-177.5,172.5,212.5,222.5,227.5,227.5,610,SBD,1
Robert Speno,M,Raw,40-49,130.7,125+,40,280,292.5,300,300,197.5,207.5,-212.5,207.5,275,285,-292.5,285,792.5,SBD,1
Kevin Meskew,M,Raw,50-59,59.9,60,53,100,110,117.5,117.5,65,75,77.5,77.5,145,157.5,162.5,162.5,357.5,SBD,1
Homi Shivaie,M,Raw,50-59,58.9,60,59,95,-115,120,120,50,65,75,75,130,145,160,160,355,SBD,2
Jerry Moylan,M,Raw,50-59,66,67.5,55,115,130,140,140,77.5,92.5,-95,92.5,160,,,160,392.5,SBD,1
Wayne Jandoc,M,Raw,50-59,107.1,110,51,210,227.5,230,230,157.5,162.5,167.5,167.5,232.5,245,252.5,252.5,650,SBD,1
Kevin Jordan,M,Raw,50-59,105.3,110,51,145,160,170,170,100,115,127.5,127.5,165,185,200,200,497.5,SBD,2
Robert Mattison,M,Raw,70-90,71.2,75,71,80,95,-105,95,97.5,105,-107.5,105,165,175,180,180,380,SBD,1
Corey Politino,M,Raw,Open,67.2,67.5,32,125,145,-155,145,112.5,120,-125,120,162.5,182.5,-190,182.5,447.5,SBD,1
Jerry Moylan,M,Raw,Open,66,67.5,55,115,130,140,140,77.5,92.5,-95,92.5,160,,,160,392.5,SBD,2
Francis Astilla,M,Raw,Open,73.9,75,34,125,135,142.5,142.5,107.5,-115,117.5,117.5,185,195,-200,195,455,SBD,1
Kaden Nguyen,M,Raw,Open,81.6,82.5,28,175,-187.5,-187.5,175,110,115,-120,115,190,210,225,225,515,SBD,1
Craig Rasmussen,M,Raw,Open,98.2,100,38,175,-192.5,-192.5,175,-130,130,-137.5,130,215,-230,,215,520,SBD,1
Mike Wunsch,M,Raw,Open,91.7,100,32,142.5,160,-170,160,92.5,-97.5,-97.5,92.5,100,,,100,352.5,SBD,2
Wayne Jandoc,M,Raw,Open,107.1,110,51,210,227.5,230,230,157.5,162.5,167.5,167.5,232.5,245,252.5,252.5,650,SBD,1
Phillip Russell,M,Raw,Open,109.7,110,27,190,195,202.5,202.5,152.5,157.5,,157.5,215,227.5,232.5,232.5,592.5,SBD,2
John Planas,M,Raw,Open,118.4,125,34,267.5,282.5,-287.5,282.5,202.5,212.5,-220,212.5,292.5,300,310,310,805,SBD,1
Eugene Chung,M,Raw,Open,119.3,125,31,-218,240,255,255,190,205,215,215,272.5,305,315,315,785,SBD,2
Robert Speno,M,Raw,Open,130.7,125+,40,280,292.5,300,300,197.5,207.5,-212.5,207.5,275,285,-292.5,285,792.5,SBD,1
Dan Harrison,M,Raw,Open,134,125+,27,265,-280,-280,265,-167.5,167.5,-175,167.5,275,-300,,275,707.5,SBD,2
David Zyski,M,Raw,Open,138.8,125+,23,185,227.5,250,250,142.5,160,170,170,225,250,277.5,277.5,697.5,SBD,3
Jim Chaaban,M,Single-ply,40-49,108.3,110,40,,,,,217.5,232.5,-235,232.5,,,,,232.5,B,1
Ron Garcia,M,Single-ply,40-49,113.9,125,45,,,,,172.5,-182.5,182.5,182.5,,,,,182.5,B,1
Alvin Waldon,M,Single-ply,50-59,107,110,57,,,,,182.5,-205,-205,182.5,,,,,182.5,B,1
Bob Evans #1,M,Single-ply,60-69,108.6,110,62,,,,,-195,195,-200.5,195,,,,,195,B,1
Denny Faler,M,Single-ply,60-69,131.6,125+,68,,,,,125,137.5,142.5,142.5,,,,,142.5,B,1
Rudy Garcia,M,Single-ply,Open,79.9,82.5,34,,,,,150,157.5,165,165,,,,,165,B,1
Les Oeri,M,Single-ply,Open,89.2,90,57,,,,,147.5,155,162.5,162.5,,,,,162.5,B,1
Hoddy Fritz,M,Single-ply,Open,89.7,90,42,,,,,150,157.5,-160,157.5,,,,,157.5,B,2
Christopher White,M,Single-ply,Open,98.7,100,30,,,,,185,-190,190,190,,,,,190,B,1
Jim Chaaban,M,Single-ply,Open,108.3,110,40,,,,,217.5,232.5,-235,232.5,,,,,232.5,B,1
Alvin Waldon,M,Single-ply,Open,107,110,57,,,,,182.5,-205,-205,182.5,,,,,182.5,B,2
Russ Ryan,M,Single-ply,Open,108.9,110,34,,,,,-165,-170,175,175,,,,,175,B,3
Ron Garcia,M,Single-ply,Open,113.9,125,45,,,,,172.5,-182.5,182.5,182.5,,,,,182.5,B,1
Pat Cannon,M,Single-ply,Out of State,107.2,110,52,,,,,210,225,230,230,,,,,230,B,1
Lester Dedrick,M,Raw,14-15,200.8,125+,14,,,,,122.5,127.5,-130,127.5,,,,,127.5,B,1
Marcus Jacobo,M,Raw,16-17,66.2,67.5,17,,,,,77.5,85,-87.5,85,,,,,85,B,1
Stacy Dedrick,M,Raw,40-49,88.5,90,43,,,,,-185,-185,-185,,,,,,,B,DQ
Sam Graham,M,Raw,40-49,95.8,100,40,,,,,142.5,150,160,160,,,,,160,B,1
Les Oeri,M,Raw,50-59,89.2,90,57,,,,,147.5,155,162.5,162.5,,,,,162.5,B,1
Alvin Waldon,M,Raw,50-59,107,110,57,,,,,182.5,-205,-205,182.5,,,,,182.5,B,1
Bill Hill,M,Raw,60-69,99.1,100,66,,,,,147.5,-152.5,152.5,152.5,,,,,152.5,B,1
Denny Faler,M,Raw,60-69,131.6,125+,68,,,,,125,137.5,142.5,142.5,,,,,142.5,B,1
Matthew Reep,M,Raw,Open,72.5,75,34,,,,,140,147.5,-155,147.5,,,,,147.5,B,1
Alvin Waldon,M,Raw,Open,107,110,57,,,,,182.5,-205,-205,182.5,,,,,182.5,B,1
