Division,WeightClassKg,Place,Name,Team,BodyweightKg,Best3SquatKg,Best3BenchKg,Best3DeadliftKg,TotalKg,Equipment,Event,Sex
Boys,51.71,1,Justin Davis,Buda Hays,49.8,104.33,79.38,115.67,299.37,Single-ply,SBD,M
Boys,51.71,2,Luis Rios,Geronimo Navarro,44.91,77.11,63.5,124.74,265.35,Single-ply,SBD,M
Boys,51.71,3,Tristen Larison,Lockhart,50.44,40.82,36.29,83.91,161.03,Single-ply,SBD,M
Boys,51.71,DQ,Emanuel Avina,Buda Hays,51.07,,,,,Single-ply,SBD,M
Boys,55.79,1,Josh Fantauzzi,Buda Hays,55.79,156.49,86.18,181.44,424.11,Single-ply,SBD,M
Boys,55.79,2,Josh Estrada,Gonzales,55.52,131.54,86.18,136.08,353.8,Single-ply,SBD,M
Boys,59.87,3,Zach Truillo,Universal City Randolph,56.02,115.67,65.77,142.88,324.32,Single-ply,SBD,M
Boys,55.79,DQ,Ellis Perry,Lockhart,54.98,92.99,,,,Single-ply,SBD,M
Boys,59.87,1,Pedro Carreon,Geronimo Navarro,59.42,167.83,115.67,192.78,476.27,Single-ply,SBD,M
Boys,67.13,DQ,Miguel Rivera,Universal City Randolph,60.1,,,,,Single-ply,SBD,M
Boys,59.87,DQ,Jeffrey Johnson #3,Seguin,58.42,122.47,,,,Single-ply,SBD,M
Boys,67.13,1,Zach Konieczny,Sealy,66.22,183.7,120.2,183.7,487.61,Single-ply,SBD,M
Boys,74.84,2,Tanner Robinson,Lockhart,67.36,158.76,99.79,185.97,444.52,Single-ply,SBD,M
Boys,67.13,3,Evan DeLeon,Geronimo Navarro,64.86,147.42,99.79,185.97,433.18,Single-ply,SBD,M
Boys,67.13,4,Eli Arzola,Seguin,63.96,142.88,104.33,158.76,405.97,Single-ply,SBD,M
Boys,67.13,5,Mason Salinas,Buda Hays,65.77,136.08,83.91,140.61,360.61,Single-ply,SBD,M
Boys,67.13,6,Jacob Jones,Universal City Randolph,65.95,115.67,72.57,136.08,324.32,Single-ply,SBD,M
Boys,67.13,DQ,Justin Hartman,Universal City Randolph,62.05,145.15,,,,Single-ply,SBD,M
Boys,67.13,DQ,Jared Self,Buda Hays,66.5,145.15,,,,Single-ply,SBD,M
Boys,74.84,DQ,Taylor Hough,Buda Hays,67.36,181.44,,,,Single-ply,SBD,M
Boys,74.84,1,Trey Washington,Universal City Randolph,71.4,136.08,104.33,201.85,442.25,Single-ply,SBD,M
Boys,74.84,2,Mike Castillo,Geronimo Navarro,73.94,158.76,115.67,165.56,439.98,Single-ply,SBD,M
Boys,74.84,3,Jacob Rodriguez,Geronimo Navarro,71.67,154.22,97.52,183.7,435.45,Single-ply,SBD,M
Boys,74.84,4,Austin Isaac,Geronimo Navarro,74.39,147.42,88.45,154.22,390.09,Single-ply,SBD,M
Boys,74.84,5,Marshall Benson,San Marcos Baptist,71.21,142.88,81.65,158.76,383.29,Single-ply,SBD,M
Boys,74.84,6,Alonzo Barclift,Universal City Randolph,72.12,124.74,90.72,149.69,365.14,Single-ply,SBD,M
Boys,82.1,7,Spencer Old,Geronimo Navarro,74.93,129.27,99.79,136.08,365.14,Single-ply,SBD,M
Boys,74.84,8,Gunner Brown,Lockhart,68.76,117.93,70.31,149.69,337.93,Single-ply,SBD,M
Boys,74.84,9,Austin Van Meter,Geronimo Navarro,73.57,117.93,74.84,136.08,328.85,Single-ply,SBD,M
Boys,74.84,9,Micheal Trejo,San Marcos Baptist,72.12,149.69,106.59,149.69,405.97,Single-ply,SBD,M
Boys,74.84,10,Austin Hay,San Marcos Baptist,70.85,113.4,56.7,138.35,308.44,Single-ply,SBD,M
Boys,74.84,DQ,Richard Smith,San Marcos Baptist,71.85,,,,,Single-ply,SBD,M
Boys,74.84,DQ,Luke Jarozewski,Geronimo Navarro,73.03,124.74,,,,Single-ply,SBD,M
Boys,82.1,1,Javier Garcia,Seguin,82.1,195.04,115.67,222.26,532.97,Single-ply,SBD,M
Boys,82.1,DQ,Hayden Eskew,Buda Hays,77.34,,,,,Single-ply,SBD,M
Boys,82.1,3,Zack Lopez,Gonzales,81.47,188.24,117.93,213.19,519.36,Single-ply,SBD,M
Boys,82.1,4,Daniel Rivera,Gonzales,80.2,208.65,99.79,190.51,498.95,Single-ply,SBD,M
Boys,82.1,5,Carlos Zepeda,Seguin,80.2,170.1,122.47,190.51,483.08,Single-ply,SBD,M
Boys,82.1,6,DJ Gonzales,Gonzales,76.48,181.44,92.99,167.83,442.25,Single-ply,SBD,M
Boys,82.1,7,Justin Hatfield,Geronimo Navarro,81.19,163.29,90.72,174.63,428.64,Single-ply,SBD,M
Boys,82.1,8,Devin Jennings,Buda Hays,76.29,165.56,99.79,151.95,417.3,Single-ply,SBD,M
Boys,82.1,10,Clark Flinn,Geronimo Navarro,80.74,158.76,92.99,145.15,396.89,Single-ply,SBD,M
Boys,82.1,11,Freddie Larry,Universal City Randolph,80.38,142.88,86.18,156.49,385.55,Single-ply,SBD,M
Boys,82.1,12,Marcos Johnson,Lockhart,79.11,140.61,83.91,156.49,381.02,Single-ply,SBD,M
Boys,82.1,13,Brennan Poole,Universal City Randolph,81.56,129.27,79.38,142.88,351.53,Single-ply,SBD,M
Boys,82.1,14,Tom Brotherton,San Marcos Baptist,77.2,106.59,74.84,147.42,328.85,Single-ply,SBD,M
Boys,82.1,15,Chris Boeker,Lockhart,78.29,90.72,68.04,111.13,269.89,Single-ply,SBD,M
Boys,89.81,1,Landon Lock,Gonzales,88.63,265.35,136.08,235.87,637.3,Single-ply,SBD,M
Boys,89.81,2,Hunter Noack,Gonzales,85.73,213.19,117.93,226.8,557.92,Single-ply,SBD,M
Boys,89.81,3,Tanner Brown,Lockhart,87.63,195.04,113.4,199.58,508.02,Single-ply,SBD,M
Boys,89.81,4,Curtis Hawkins,Lockhart,89.63,197.31,104.33,188.24,489.88,Single-ply,SBD,M
Boys,89.81,5,JT Miller,Gonzales,87.45,181.44,83.91,192.78,458.13,Single-ply,SBD,M
Boys,89.81,6,Eddie Martinez,Sealy,86,181.44,102.06,170.1,453.59,Single-ply,SBD,M
Boys,89.81,7,Kyle Cox,Buda Hays,86,174.63,90.72,181.44,446.79,Single-ply,SBD,M
Boys,89.81,8,Justin Torres,Lockhart,87.82,167.83,95.25,181.44,444.52,Single-ply,SBD,M
Boys,89.81,9,Billy Alegria,Geronimo Navarro,82.83,142.88,99.79,149.69,392.36,Single-ply,SBD,M
Boys,89.81,DQ,Ryan Farrell,Universal City Randolph,83.19,,,,,Single-ply,SBD,M
Boys,99.79,1,Jacob Almaguer,Seguin,90.9,210.92,120.2,210.92,542.04,Single-ply,SBD,M
Boys,99.79,2,Levi Mair,Lockhart,98.7,204.12,129.27,208.65,542.04,Single-ply,SBD,M
Boys,99.79,3,Cole Thompson,Universal City Randolph,91.44,195.04,124.74,208.65,528.44,Single-ply,SBD,M
Boys,99.79,4,Daniel Minor,Buda Hays,91.99,197.31,127.01,204.12,528.44,Single-ply,SBD,M
Boys,99.79,5,Kolby Janek,Poth,95.8,181.44,131.54,192.78,505.76,Single-ply,SBD,M
Boys,99.79,6,Dustin Phelps,Universal City Randolph,99.7,185.97,92.99,195.04,474,Single-ply,SBD,M
Boys,99.79,7,Javier Esparza,Geronimo Navarro,90.72,163.29,113.4,192.78,469.47,Single-ply,SBD,M
Boys,99.79,8,Conner Roe,Geronimo Navarro,92.99,170.1,122.47,172.37,464.93,Single-ply,SBD,M
Boys,99.79,9,Nick Ringler,Universal City Randolph,96.34,167.83,108.86,185.97,462.66,Single-ply,SBD,M
Boys,99.79,10,Sam Jones,Universal City Randolph,90.81,163.29,79.38,201.85,444.52,Single-ply,SBD,M
Boys,99.79,11,Jesus Lopez,Geronimo Navarro,97.43,108.86,90.72,145.15,344.73,Single-ply,SBD,M
Boys,99.79,12,Gage Bush,Geronimo Navarro,96.07,97.52,79.38,145.15,322.05,Single-ply,SBD,M
Boys,99.79,13,Yang Yang,San Marcos Baptist,94.89,95.25,43.09,136.08,274.42,Single-ply,SBD,M
Boys,109.77,1,Pj Hall,Seguin,109.5,263.08,154.22,267.62,684.92,Single-ply,SBD,M
Boys,109.77,2,Baily Rhoads,Buda Hays,107.32,210.92,117.93,213.19,542.04,Single-ply,SBD,M
Boys,109.77,3,Rivonte Chizer,Seguin,109.5,204.12,140.61,192.78,537.51,Single-ply,SBD,M
Boys,109.77,4,David Velasquez,Geronimo Navarro,106.59,206.38,102.06,170.1,478.54,Single-ply,SBD,M
Boys,124.74,5,D'Antre Smith,Seguin,109.95,165.56,120.2,167.83,453.59,Single-ply,SBD,M
Boys,124.74,6,Levi Snider,Gonzales,110,154.22,108.86,158.76,421.84,Single-ply,SBD,M
Boys,109.77,7,Jordan Johnson,Gonzales,104.05,145.15,115.67,158.76,419.57,Single-ply,SBD,M
Boys,109.77,8,David Delacruz,Poth,100.24,136.08,88.45,147.42,371.95,Single-ply,SBD,M
Boys,124.74,1,Ray Sedwick,Lockhart,124.1,249.48,158.76,249.48,657.71,Single-ply,SBD,M
Boys,124.74,2,Zach Perez-Clack,Gonzales,119.84,226.8,140.61,233.6,601.01,Single-ply,SBD,M
Boys,124.74,3,Hunter Ullrich,Seguin,111.22,224.53,145.15,195.04,564.72,Single-ply,SBD,M
Boys,124.74,4,Nestor Minor,Buda Hays,116.75,181.44,138.35,190.51,510.29,Single-ply,SBD,M
Boys,124.74,5,Gama Valdez,Buda Hays,115.48,181.44,136.08,149.69,467.2,Single-ply,SBD,M
Boys,124.74,6,Min Jae Jeong,San Marcos Baptist,115.3,149.69,77.11,127.01,353.8,Single-ply,SBD,M
Boys,124.74+,1,Ryne Lehman,Lockhart,136.53,226.8,163.29,222.26,612.35,Single-ply,SBD,M
Boys,124.74+,2,Tyler Filla,Gonzales,132.99,136.08,92.99,158.76,387.82,Single-ply,SBD,M
