Name,Age,Equipment,Event,Division,Sex,Tested,BodyweightKg,WeightClassKg,Squat1Kg,Squat2Kg,Squat3Kg,Best3SquatKg,Squat4Kg,Bench1Kg,Bench2Kg,Bench3Kg,Best3BenchKg,Bench4Kg,Deadlift1Kg,Deadlift2Kg,Deadlift3Kg,Best3DeadliftKg,Deadlift4Kg,TotalKg,State,Place
Becky Singel,51,Wraps,SBD,Masters 50-59,F,Yes,63.96,67.5,49.9,54.43,58.97,58.97,,52.16,54.43,-58.97,54.43,,83.91,88.45,99.79,99.79,,213.19,IN,1
Dodi Sudau-Glinke,45,Wraps,SBD,Masters 40-49,F,Yes,59.15,60,61.23,65.77,77.11,77.11,,45.36,49.9,-52.16,49.9,,83.91,90.72,-102.06,90.72,,217.72,MI,1
Rachel Lindley,33,Wraps,SBD,Submasters 33-39,F,Yes,79.06,82.5,133.81,140.61,,140.61,,77.11,81.65,-83.91,81.65,,170.1,179.17,183.7,183.7,,405.97,MI,1
Bailey Ward,16,Wraps,SBD,Teen 16-17,F,Yes,61.51,67.5,38.56,47.63,61.23,61.23,68.04,27.22,34.02,43.09,43.09,-49.9,61.23,83.91,102.06,102.06,106.59,206.38,MI,1
Bree Purvis,15,Wraps,SBD,Teen 13-15,F,Yes,59.6,60,34.02,43.09,52.16,52.16,54.43,29.48,36.29,-45.36,36.29,,65.77,74.84,83.91,83.91,,172.37,MI,1
Rachel Lindley,33,Wraps,SBD,Open,F,Yes,79.06,82.5,133.81,140.61,,140.61,,77.11,81.65,-83.91,81.65,,170.1,179.17,183.7,183.7,,405.97,MI,1
Dallas Bird,29,Wraps,SBD,Open,M,No,106.59,110,226.8,242.67,251.74,251.74,,165.56,179.17,183.7,183.7,,238.14,260.82,272.16,272.16,,707.6,MI,1
Christopher Northern,42,Wraps,SBD,Open,M,Yes,108.5,110,199.58,-217.72,-226.8,199.58,,154.22,161.03,-167.83,161.03,,208.65,222.26,235.87,235.87,,596.47,WI,1
Douglas Finley,71,Wraps,SBD,Masters 70-79,M,Yes,97.52,100,129.27,138.35,142.88,142.88,,86.18,92.99,97.52,97.52,,113.4,127.01,136.08,136.08,,376.48,MI,1
Chad Camplese,43,Wraps,SBD,Masters 40-49,M,Yes,81.19,82.5,-142.88,142.88,-156.49,142.88,,102.06,113.4,-124.74,113.4,,165.56,185.97,197.31,197.31,,453.59,MI,1
Christopher Northern,42,Wraps,SBD,Masters 40-49,M,Yes,108.5,110,199.58,-217.72,-226.8,199.58,,154.22,161.03,-167.83,161.03,,208.65,222.26,235.87,235.87,,596.47,WI,1
Chris Avery,35,Wraps,SBD,Submasters 33-39,M,Yes,107.41,110,199.58,219.99,235.87,235.87,,136.08,145.15,-154.22,145.15,,204.12,229.06,-251.74,229.06,,610.08,MI,1
Mark Kryska,35,Wraps,SBD,Submasters 33-39,M,Yes,108.41,110,174.63,183.7,-201.85,183.7,,120.2,129.27,-138.35,129.27,,201.85,210.92,219.99,219.99,,532.97,MI,2
Michael Morris #2,33,Wraps,SBD,Submasters 33-39,M,Yes,119.75,125,170.1,181.44,190.51,190.51,,102.06,-106.59,106.59,106.59,,260.82,272.16,281.23,281.23,,578.33,MI,1
Josh Bolin,39,Wraps,SBD,Submasters 33-39,M,Yes,124.74,125,226.8,249.48,-256.28,249.48,,-158.76,-158.76,-158.76,,,,,,,,,MI,DQ
Charlee Lee,23,Wraps,SBD,Juniors 20-23,M,Yes,83.01,90,165.56,174.63,183.7,183.7,,97.52,108.86,-117.93,108.86,,174.63,185.97,197.31,197.31,,489.88,MI,1
Benjamin Roytburd,19,Wraps,SBD,Teen 18-19,M,Yes,98.52,100,172.37,188.24,201.85,201.85,,108.86,-117.93,-122.47,108.86,,183.7,201.85,217.72,217.72,,528.44,MI,1
Noel Cordero,19,Wraps,SBD,Teen 18-19,M,Yes,72.12,75,142.88,167.83,176.9,176.9,,124.74,-140.61,-147.42,124.74,,165.56,179.17,188.24,188.24,,489.88,OH,1
Mauro Aja-Prado,29,Wraps,SBD,Open,M,Yes,84.37,90,170.1,183.7,192.78,192.78,,92.99,102.06,-111.13,102.06,,192.78,215.46,-233.6,215.46,,510.29,MI,1
Steve Stuecher,29,Wraps,SBD,Open,M,Yes,98.43,100,213.19,226.8,238.14,238.14,,145.15,156.49,163.29,163.29,,240.4,-254.01,254.01,254.01,,655.44,MI,1
Paul Flynn,29,Wraps,SBD,Open,M,Yes,98.16,100,174.63,188.24,204.12,204.12,,113.4,120.2,-129.27,120.2,,183.7,206.38,213.19,213.19,,537.51,MI,2
Vincent Giattino,25,Wraps,SBD,Open,M,Yes,133.99,140,233.6,244.94,265.35,265.35,276.69,165.56,176.9,185.97,185.97,,278.96,294.84,319.78,319.78,,771.11,MI,1
Matt Draper,29,Wraps,SBD,Open,M,Yes,168.1,140+,251.74,265.35,272.16,272.16,,183.7,192.78,-204.12,192.78,,274.42,285.76,-294.84,285.76,,750.7,MI,1
Dylan Price,22,Multi-ply,BD,Juniors 20-23,M,Yes,72.21,75,,,,,,183.7,-201.85,-201.85,183.7,,215.46,233.6,-249.48,233.6,,417.3,MI,1
Ray Voight,25,Multi-ply,BD,Open,M,Yes,142.16,140+,,,,,,294.84,-319.78,-319.78,294.84,,238.14,256.28,-272.16,256.28,,551.11,MI,1
Thomas Moore,44,Raw,BD,Masters 40-49,M,Yes,96.62,100,,,,,,136.08,142.88,-147.42,142.88,,238.14,251.74,256.28,256.28,-260.82,399.16,MI,1
Patrick Morris,47,Raw,BD,Masters 40-49,M,Yes,96.98,100,,,,,,142.88,151.95,161.03,161.03,-165.56,183.7,206.38,,206.38,,367.41,MI,2
Katie Wagner,30,Raw,B,Open,F,No,74.93,75,,,,,,83.91,-92.99,92.99,92.99,,,,,,,92.99,MI,1
John Johnson,48,Multi-ply,B,Masters 40-49,M,Yes,116.21,125,,,,,,-215.46,224.53,-238.14,224.53,,,,,,,224.53,MI,1
Justin Lindley,44,Raw,B,Masters 40-49,M,Yes,88.81,90,,,,,,161.03,165.56,-167.83,165.56,,,,,,,165.56,MI,1
Jason Denovich,33,Raw,B,Open,M,Yes,105.69,110,,,,,,142.88,-151.95,-151.95,142.88,,,,,,,142.88,MI,1
Dave Forstner,45,Multi-ply,B,Masters 40-49,M,Yes,135.99,140,,,,,,-328.85,-328.85,,,,,,,,,,MI,DQ
