Division,WeightClassKg,Place,Name,Team,BodyweightKg,Best3SquatKg,Best3BenchKg,Best3DeadliftKg,TotalKg,Equipment,Event,Sex
Boys,51.71,1,Trey Arras,Texarkana Liberty-Eylau,50.58,127.01,77.11,140.61,344.73,Single-ply,SBD,M
Boys,51.71,2,Jesse Peacock,Diana New Diana,50.35,124.74,74.84,127.01,326.59,Single-ply,SBD,M
Boys,51.71,3,Lucas Edwards,Mount Vernon,48.19,74.84,43.09,102.06,219.99,Single-ply,SBD,M
Boys,51.71,4,Connor Morgan,Texarkana Pleasant Grove,40.37,77.11,40.82,79.38,197.31,Single-ply,SBD,M
Boys,55.79,1,Gilbert Garcia,Longview Spring Hill,55,138.35,77.11,140.61,356.07,Single-ply,SBD,M
Boys,59.87,2,Donovan Roberts,Winnsboro,56.02,151.95,70.31,115.67,337.93,Single-ply,SBD,M
Boys,55.79,3,Dee Sheperd,Mount Vernon,54.88,81.65,58.97,117.93,258.55,Single-ply,SBD,M
Boys,59.87,1,Kyler Cooper,Texarkana Pleasant Grove,58.17,145.15,86.18,158.76,390.09,Single-ply,SBD,M
Boys,59.87,2,Ryan Laborde,Winnsboro,58.17,161.03,77.11,138.35,376.48,Single-ply,SBD,M
Boys,59.87,3,Jared Weeks,Diana New Diana,56.36,142.88,63.5,149.69,356.07,Single-ply,SBD,M
Boys,59.87,4,Noah Craver,Mount Vernon,59.19,131.54,79.38,142.88,353.8,Single-ply,SBD,M
Boys,59.87,5,Jackson Kennedy,Texarkana Pleasant Grove,58.74,122.47,86.18,136.08,344.73,Single-ply,SBD,M
Boys,59.87,6,Christian Colby,Gladewater Union Grove,59.65,127.01,70.31,122.47,319.78,Single-ply,SBD,M
Boys,59.87,7,James Kirkman,Mount Vernon,58.06,122.47,79.38,113.4,315.25,Single-ply,SBD,M
Boys,59.87,8,Deandre Daniels,Daingerfield,57.04,120.2,68.04,122.47,310.71,Single-ply,SBD,M
Boys,67.13,1,Matthew Solomon,Texarkana Liberty-Eylau,65.54,208.65,122.47,195.04,526.17,Single-ply,SBD,M
Boys,67.13,2,Lucas Pinnell,Winnsboro,66.68,179.17,95.25,208.65,483.08,Single-ply,SBD,M
Boys,67.13,3,Miles Pearson,Diana New Diana,65.54,158.76,102.06,195.04,455.86,Single-ply,SBD,M
Boys,67.13,4,Rajuan Crabtree,Texarkana Liberty-Eylau,62.14,161.03,111.13,179.17,451.32,Single-ply,SBD,M
Boys,67.13,5,Ethan Wagner,Texarkana Pleasant Grove,62.03,163.29,90.72,179.17,433.18,Single-ply,SBD,M
Boys,74.84,6,Kaleb Edwards,Winnsboro,67.36,165.56,88.45,176.9,430.91,Single-ply,SBD,M
Boys,67.13,7,Ty Everett,Texarkana Pleasant Grove,63.62,138.35,88.45,183.7,410.5,Single-ply,SBD,M
Boys,74.84,8,Caden Clifford,Gladewater Sabine,67.36,151.95,88.45,154.22,394.63,Single-ply,SBD,M
Boys,67.13,9,Zac Thompson,Big Sandy Harmony,64.07,151.95,86.18,154.22,392.36,Single-ply,SBD,M
Boys,67.13,10,Mauro Gallegos,Gladewater Sabine,61.23,147.42,79.38,147.42,374.21,Single-ply,SBD,M
Boys,67.13,11,Nick Carter,Redwater,66.22,131.54,79.38,154.22,365.14,Single-ply,SBD,M
Boys,67.13,12,Cameron Woods,Mount Vernon,61.8,122.47,63.5,140.61,326.59,Single-ply,SBD,M
Boys,67.13,13,Barry Powers,Gladewater Sabine,62.26,113.4,81.65,102.06,297.1,Single-ply,SBD,M
Boys,67.13,14,Anthony Nava,Daingerfield,66.34,111.13,65.77,120.2,297.1,Single-ply,SBD,M
Boys,67.13,15,Mason Huddleston,Mount Vernon,60.33,102.06,61.23,127.01,290.3,Single-ply,SBD,M
Boys,67.13,DQ,Austin Brewton,Redwater,65.09,127.01,,,,Single-ply,SBD,M
Boys,67.13,DQ,Jared Scott,Texarkana Pleasant Grove,64.86,185.97,,,,Single-ply,SBD,M
Boys,74.84,1,Jeremy Moses,Winnsboro,74.05,210.92,127.01,215.46,553.38,Single-ply,SBD,M
Boys,74.84,2,Ethan Rakich,Winnsboro,71.67,210.92,117.93,215.46,544.31,Single-ply,SBD,M
Boys,74.84,3,Matt Hahn,Texarkana Pleasant Grove,69.4,188.24,122.47,226.8,537.51,Single-ply,SBD,M
Boys,82.1,4,Chris Irizarry,Redwater,75.07,176.9,92.99,183.7,453.59,Single-ply,SBD,M
Boys,74.84,5,Fabin Roman,Quitman,68.27,174.63,90.72,185.97,451.32,Single-ply,SBD,M
Boys,74.84,6,Lamont Byrd,Texarkana Liberty-Eylau,71.21,165.56,102.06,183.7,451.32,Single-ply,SBD,M
Boys,74.84,7,Christian Johnson,Longview Spring Hill,69.85,181.44,95.25,161.03,437.72,Single-ply,SBD,M
Boys,74.84,8,Jonathan Spurlin,Winnsboro,68.83,156.49,104.33,174.63,435.45,Single-ply,SBD,M
Boys,74.84,9,Tydarius Brannon,Daingerfield,71.1,147.42,86.18,167.83,401.43,Single-ply,SBD,M
Boys,74.84,10,John Haller,Mount Vernon,71.21,151.95,74.84,174.63,401.43,Single-ply,SBD,M
Boys,74.84,11,Cameron Greenburg,Mount Vernon,69.85,145.15,92.99,158.76,396.89,Single-ply,SBD,M
Boys,74.84,12,Thurman Morbley,Texarkana Liberty-Eylau,69.74,145.15,90.72,151.95,387.82,Single-ply,SBD,M
Boys,74.84,13,Dain Goudanzi,Gilmer,72.69,147.42,86.18,154.22,387.82,Single-ply,SBD,M
Boys,74.84,14,Erik Arriaga,Big Sandy Harmony,71.55,145.15,79.38,156.49,381.02,Single-ply,SBD,M
Boys,74.84,15,Tevin Roberts,Gladewater Sabine,68.27,138.35,83.91,145.15,367.41,Single-ply,SBD,M
Boys,74.84,16,Noah Tipton,Longview Spring Hill,73.48,136.08,74.84,151.95,362.87,Single-ply,SBD,M
Boys,74.84,17,Nic Poppenhusen,Quitman,73.14,129.27,83.91,147.42,360.61,Single-ply,SBD,M
Boys,74.84,18,Jose Mendez,Daingerfield,72.12,136.08,65.77,142.88,344.73,Single-ply,SBD,M
Boys,74.84,19,Chris Kemp,Daingerfield,71.21,136.08,56.7,133.81,326.59,Single-ply,SBD,M
Boys,74.84,DQ,Dillan Summers,Diana New Diana,73.71,124.74,,,,Single-ply,SBD,M
Boys,74.84,DQ,Mason McCloskey,Redwater,71.78,124.74,,,,Single-ply,SBD,M
Boys,82.1,1,Zanoah Arnold,Texarkana Liberty-Eylau,78.13,215.46,129.27,226.8,571.53,Single-ply,SBD,M
Boys,82.1,2,Maurice Ramirez,Winnsboro,80.85,226.8,142.88,199.58,569.26,Single-ply,SBD,M
Boys,82.1,3,Micah Brantley,Gladewater Union Grove,79.38,192.78,124.74,192.78,510.29,Single-ply,SBD,M
Boys,82.1,4,Patrick Hoffman,Mount Vernon,80.29,190.51,124.74,183.7,498.95,Single-ply,SBD,M
Boys,82.1,5,Mitchell Attaway,Winnsboro,80.17,199.58,92.99,172.37,464.93,Single-ply,SBD,M
Boys,82.1,6,Markevian Grant,Daingerfield,80.06,185.97,104.33,167.83,458.13,Single-ply,SBD,M
Boys,82.1,7,Toby Palmer,Diana New Diana,79.49,163.29,88.45,197.31,449.06,Single-ply,SBD,M
Boys,82.1,8,Zack Troell,Gilmer,75.3,165.56,102.06,172.37,439.98,Single-ply,SBD,M
Boys,82.1,9,Alec Mayhan,Gladewater Union Grove,81.31,183.7,83.91,163.29,430.91,Single-ply,SBD,M
Boys,82.1,10,Hunter Patterson,Quitman,78.7,158.76,83.91,167.83,410.5,Single-ply,SBD,M
Boys,82.1,11,Brennan Watkins,Gladewater Sabine,77.11,163.29,88.45,149.69,401.43,Single-ply,SBD,M
Boys,82.1,12,Ethan Dean,Big Sandy Harmony,77.11,147.42,81.65,156.49,385.55,Single-ply,SBD,M
Boys,82.1,13,Angel Aguillon,Big Sandy Harmony,80.29,136.08,79.38,142.88,358.34,Single-ply,SBD,M
Boys,82.1,14,Cole Hobbs,Gladewater Sabine,78.24,129.27,74.84,138.35,342.46,Single-ply,SBD,M
Boys,82.1,DQ,Dominique Allen,Daingerfield,80.97,147.42,,,,Single-ply,SBD,M
Boys,82.1,DQ,Jeremy Kelly,Gilmer,76.2,145.15,,,,Single-ply,SBD,M
Boys,89.81,1,Tyson Gearner,Winnsboro,88.79,204.12,167.83,224.53,596.47,Single-ply,SBD,M
Boys,89.81,2,Grant Stansberry,Gladewater Sabine,89.7,226.8,122.47,219.99,569.26,Single-ply,SBD,M
Boys,89.81,3,Ke'Mon Freeman,Texarkana Liberty-Eylau,87.54,190.51,120.2,197.31,508.02,Single-ply,SBD,M
Boys,89.81,4,Colton Finney,Redwater,84.59,185.97,108.86,201.85,496.68,Single-ply,SBD,M
Boys,89.81,5,Richard Mainor,Texarkana Liberty-Eylau,87.54,192.78,106.59,197.31,496.68,Single-ply,SBD,M
Boys,89.81,6,Hunter Harrison,Redwater,86.75,167.83,106.59,181.44,455.86,Single-ply,SBD,M
Boys,89.81,7,Chris Wood,Quitman,89.81,149.69,99.79,183.7,433.18,Single-ply,SBD,M
Boys,89.81,8,D'Wayne Coleman,Texarkana Liberty-Eylau,84.94,156.49,88.45,165.56,410.5,Single-ply,SBD,M
Boys,89.81,9,Cole Freeman,Diana New Diana,85.39,156.49,90.72,163.29,410.5,Single-ply,SBD,M
Boys,89.81,10,Kaleb Schwoyer,Longview Spring Hill,86.07,133.81,104.33,158.76,396.89,Single-ply,SBD,M
Boys,89.81,11,Matt Caldwell,Gilmer,85.73,158.76,104.33,129.27,392.36,Single-ply,SBD,M
Boys,99.79,12,Alex Ingram,Redwater,90.04,156.49,111.13,111.13,378.75,Single-ply,SBD,M
Boys,89.81,13,Keagen Phillips,Big Sandy Harmony,87.2,122.47,90.72,136.08,349.27,Single-ply,SBD,M
Boys,89.81,14,Ben Culp,Redwater,88.68,120.2,77.11,142.88,340.19,Single-ply,SBD,M
Boys,89.81,15,Jake Mulkey,Longview Spring Hill,89.36,122.47,65.77,127.01,315.25,Single-ply,SBD,M
Boys,89.81,16,Caleb Freeman,Longview Spring Hill,84.71,113.4,56.7,138.35,308.44,Single-ply,SBD,M
Boys,89.81,DQ,Chris Dells,Diana New Diana,86.75,147.42,,,,Single-ply,SBD,M
Boys,99.79,1,Bryan Winburn,Winnsboro,99.11,272.16,154.22,222.26,648.64,Single-ply,SBD,M
Boys,99.79,2,Dalton White,Redwater,96.84,206.38,161.03,219.99,587.4,Single-ply,SBD,M
Boys,99.79,3,Brandon Gann,Gladewater Sabine,99.45,217.72,129.27,219.99,566.99,Single-ply,SBD,M
Boys,99.79,4,Rowdy Teaff,Quitman,95.93,176.9,127.01,206.38,510.29,Single-ply,SBD,M
Boys,99.79,5,Joseph Snodgrass,Texarkana Pleasant Grove,95.59,199.58,111.13,183.7,494.42,Single-ply,SBD,M
Boys,99.79,6,Drury Vaughan,Winnsboro,94.8,170.1,106.59,210.92,487.61,Single-ply,SBD,M
Boys,99.79,7,Carter Shelton,Longview Spring Hill,94.69,188.24,104.33,190.51,483.08,Single-ply,SBD,M
Boys,99.79,8,Preston White,Diana New Diana,96.39,183.7,97.52,199.58,480.81,Single-ply,SBD,M
Boys,99.79,9,Devante Johnson,Daingerfield,90.72,149.69,92.99,163.29,405.97,Single-ply,SBD,M
Boys,99.79,10,Dakota Manes,Diana New Diana,92.76,163.29,81.65,161.03,405.97,Single-ply,SBD,M
Boys,99.79,11,Donovan Whatley,Diana New Diana,96.05,154.22,90.72,158.76,403.7,Single-ply,SBD,M
Boys,99.79,12,Kendrick Sauls,Texarkana Liberty-Eylau,96.96,163.29,83.91,147.42,394.63,Single-ply,SBD,M
Boys,99.79,13,Colt Bradford,Redwater,94.35,145.15,88.45,145.15,378.75,Single-ply,SBD,M
Boys,99.79,14,Barnabas Hughes,Mount Vernon,94.57,136.08,72.57,136.08,344.73,Single-ply,SBD,M
Boys,99.79,15,Bobby Haggard,Gladewater Union Grove,95.03,113.4,72.57,136.08,322.05,Single-ply,SBD,M
Boys,99.79,DQ,Simeon Spearmon,Daingerfield,95.71,,68.04,136.08,,Single-ply,SBD,M
Boys,99.79,DQ,Recus Hayes,Daingerfield,96.5,156.49,,,,Single-ply,SBD,M
Boys,99.79,DQ,Austin Jones,Redwater,93.55,204.12,,,,Single-ply,SBD,M
Boys,109.77,1,Rowdy Smith,Winnsboro,106.03,254.01,138.35,192.78,585.13,Single-ply,SBD,M
Boys,109.77,2,Jamal Wheeler,Gilmer,104.33,226.8,124.74,208.65,560.19,Single-ply,SBD,M
Boys,124.74,3,Ty Coulter,Diana New Diana,109.88,217.72,102.06,204.12,523.9,Single-ply,SBD,M
Boys,109.77,4,Hunter Childress,Gilmer,102.51,185.97,124.74,206.38,517.1,Single-ply,SBD,M
Boys,109.77,5,Richard Gallegos,Longview Spring Hill,106.59,190.51,111.13,204.12,505.76,Single-ply,SBD,M
Boys,109.77,6,Cheyenne Lockhart,Texarkana Liberty-Eylau,106.37,181.44,92.99,210.92,485.34,Single-ply,SBD,M
Boys,109.77,7,De'Waven Rowden,Texarkana Liberty-Eylau,100.92,167.83,99.79,170.1,437.72,Single-ply,SBD,M
Boys,109.77,8,Aj Carrol,Daingerfield,109.32,170.1,97.52,170.1,437.72,Single-ply,SBD,M
Boys,109.77,9,Alyiass Spiller,Texarkana Liberty-Eylau,104.78,151.95,102.06,161.03,415.04,Single-ply,SBD,M
Boys,109.77,10,Ryan Forbes,Texarkana Pleasant Grove,105.01,149.69,95.25,163.29,408.23,Single-ply,SBD,M
Boys,109.77,11,Marvin Cook,Gladewater Union Grove,107.61,149.69,99.79,158.76,408.23,Single-ply,SBD,M
Boys,109.77,12,Jorge Gutierrez,Mount Vernon,107.61,158.76,86.18,145.15,390.09,Single-ply,SBD,M
Boys,109.77,DQ,Cody Davis,Daingerfield,103.19,111.13,,,,Single-ply,SBD,M
Boys,124.74,1,Hunter Hicks,Longview Spring Hill,121.68,249.48,124.74,195.04,569.26,Single-ply,SBD,M
Boys,124.74,2,Joseph McKee,Winnsboro,110.9,219.99,136.08,210.92,566.99,Single-ply,SBD,M
Boys,124.74,3,Frank Smith,Texarkana Liberty-Eylau,121.45,213.19,111.13,226.8,551.11,Single-ply,SBD,M
Boys,124.74,4,Brady Watson,Mount Vernon,120.66,206.38,104.33,195.04,505.76,Single-ply,SBD,M
Boys,124.74,5,Jon-Michael McKinney,Gladewater Sabine,121.22,190.51,113.4,185.97,489.88,Single-ply,SBD,M
Boys,124.74,6,Justin Peek,Quitman,112.04,185.97,115.67,185.97,487.61,Single-ply,SBD,M
Boys,124.74,7,Morgan Clark,Gladewater Union Grove,110.45,183.7,92.99,190.51,467.2,Single-ply,SBD,M
Boys,124.74,8,Quincy Spells,Texarkana Pleasant Grove,117.59,181.44,113.4,158.76,453.59,Single-ply,SBD,M
Boys,124.74,9,Austin Toler,Texarkana Pleasant Grove,124.17,154.22,120.2,167.83,442.25,Single-ply,SBD,M
Boys,124.74,10,Isaac Sims,Quitman,123.6,149.69,95.25,183.7,428.64,Single-ply,SBD,M
Boys,124.74,11,Tanner Tucker,Gladewater Sabine,121.34,158.76,124.74,136.08,419.57,Single-ply,SBD,M
Boys,124.74,12,James Gray,Daingerfield,114.65,136.08,90.72,142.88,369.68,Single-ply,SBD,M
Boys,124.74,13,Cameron Barron,Daingerfield,116.35,127.01,83.91,142.88,353.8,Single-ply,SBD,M
Boys,124.74+,1,Scott Sparks,Longview Spring Hill,140.95,208.65,140.61,197.31,546.58,Single-ply,SBD,M
Boys,124.74+,2,Colton Chandler,Longview Spring Hill,126.1,192.78,113.4,185.97,492.15,Single-ply,SBD,M
