Place,WeightClassKg,Sex,Event,Equipment,Name,CyrillicName,Division,BirthDate,Age,BodyweightKg,Country,Squat1Kg,Squat2Kg,Squat3Kg,Squat4Kg,Best3SquatKg,Bench1Kg,Bench2Kg,Bench3Kg,Bench4Kg,Best3BenchKg,Deadlift1Kg,Deadlift2Kg,Deadlift3Kg,Deadlift4Kg,Best3DeadliftKg,TotalKg
1,48,F,SBD,Raw,Aurika Gavrilova,,Open,1988-06-21,30,47.6,Latvia,107.5,117.5,120,,120,57.5,60,62.5,,62.5,117.5,125,130,,130,312.5
2,48,F,SBD,Raw,Yuliya Degtyareva,Юлия Дегтярева,Open,1990-09-08,28,47.8,Russia,-105,107.5,-112.5,,107.5,57.5,-60,60,,60,140,145,-150,,145,312.5
3,48,F,SBD,Raw,Elizaveta Bryzgalova,Елизавета Брызгалова,Open,1991-08-02,27,47.9,Russia,75,80,82.5,,82.5,45,47.5,50,,50,95,102.5,-107.5,,102.5,235
4,48,F,SBD,Raw,Raisat Medzhidova,Раисат Меджидова,Open,1988-09-14,30,48,Russia,67.5,72.5,75,,75,35,37.5,-40,,37.5,90,95,-97.5,,95,207.5
1,52,F,SBD,Raw,Regina Kozhina,Регина Кожина,Juniors 20-23,1995-11-21,23,51.5,Russia,87.5,92.5,-97.5,,92.5,62.5,-67.5,67.5,,67.5,100,110,-115,,110,270
2,52,F,SBD,Raw,Nadezhda Uspenskaya,Надежда Успенская,Juniors 20-23,1998-02-19,20,50.7,Russia,-80,80,85,,85,-47.5,-47.5,47.5,,47.5,100,-105,105,,105,237.5
1,52,F,SBD,Raw,Teylane Guna,Тейлане Гуна,Open,1991-05-14,27,50.8,Latvia,80,90,95,,95,45,50,-52.5,,50,102.5,115,120,,120,265
2,52,F,SBD,Raw,Olga Shornikova,Ольга Шорникова,Open,1975-03-17,43,51.1,Russia,-87.5,87.5,92.5,,92.5,50,52.5,-55,,52.5,100,105,112.5,,112.5,257.5
3,52,F,SBD,Raw,Ella Kutsenko,Элла Куценко,Open,1988-04-14,30,51.9,Russia,82.5,-87.5,87.5,,87.5,50,-52.5,-52.5,,50,100,110,-122.5,,110,247.5
DQ,52,F,SBD,Raw,Kseniya Ukhanova,Ксения Уханова,Open,2001-10-01,17,50,Russia,75,-85,-85,,75,45,50,-52.5,,50,,,,,,
1,56,F,SBD,Raw,Ekaterina Dudareva,Екатерина Дударева,Open,1993-11-08,25,55.4,Russia,100,107.5,-110,,107.5,80,-82.5,-82.5,,80,130,-137.5,-137.5,,130,317.5
2,56,F,SBD,Raw,Ekaterina Chernysheva,Екатерина Чернышева,Open,1976-02-10,42,55.3,Russia,90,-95,-95,,90,52.5,55,-57.5,,55,100,110,117.5,,117.5,262.5
1,60,F,SBD,Raw,Alyona Pavlenko,Алёна Павленко,Teen 15-19,2003-10-08,15,59.5,Russia,80,87.5,-92.5,,87.5,50,55,-57.5,,55,80,85,-90,,85,227.5
1,60,F,SBD,Raw,Ekaterina Popova,Екатерина Попова,Open,1988-03-02,30,57.8,Russia,85,90,95,,95,40,42.5,45,,45,100,107.5,115,,115,255
2,60,F,SBD,Raw,Alina Skudnevskaya,Алина Скудневская,Open,1991-03-16,27,59.3,Russia,87.5,95,100,,100,52.5,-55,-55,,52.5,-92.5,-95,95,,95,247.5
3,60,F,SBD,Raw,Elizaveta Kanunnikova,Елизавета Канунникова,Open,1989-05-28,29,60,Russia,65,70,-72.5,,70,-40,40,42.5,,42.5,80,85,90,,90,202.5
1,60,F,SBD,Raw,Lidiya Surkina,Лидия Суркина,Masters 45-49,1972-06-06,46,57.4,Russia,72.5,,,,72.5,52.5,,,,52.5,107.5,,,,107.5,232.5
1,67.5,F,SBD,Raw,Alina Nikityuk,Алина Никитюк,Juniors 20-23,1995-03-23,23,63.8,Russia,105,-112.5,-112.5,,105,50,55,57.5,,57.5,120,130,140,,140,302.5
1,67.5,F,SBD,Raw,Natalya Rebrova,Наталья Реброва,Open,1976-11-15,42,64.9,Russia,-107.5,107.5,112.5,,112.5,52.5,57.5,-60,,57.5,145,150,155,,155,325
1,75,F,SBD,Raw,Ekaterina Nyukhtilina,Екатерина Нюхтилина,Open,1985-08-20,33,71.4,Russia,-85,85,95,,95,50,55,-57.5,,55,110,120,-140,,120,270
1,60,M,SBD,Raw,Ilya Tereshchenko,Илья Терещенко,Teen 15-19,2003-02-06,15,59.6,Russia,102.5,-110,110,,110,67.5,70,-72.5,,70,120,130,-135,,130,310
2,60,M,SBD,Raw,Fedor Starostin,Федор Старостин,Teen 15-19,2000-10-02,18,58.3,Kazakhstan,110,-115,-115,,110,60,-67.5,-70,,60,120,125,-135,,125,295
1,67.5,M,SBD,Raw,Gleb Protsenko,Глеб Проценко,Teen 15-19,2000-07-13,18,66.3,Russia,-135,135,140,,140,105,-110,110,,110,177.5,185,-190,,185,435
2,67.5,M,SBD,Raw,Kirill Sukhov,Кирилл Сухов,Teen 15-19,2004-03-02,14,66.6,Russia,110,122.5,130,,130,-90,90,-92.5,,90,150,160,-170,,160,380
3,67.5,M,SBD,Raw,Andrey Berezhkov,Андрей Бережков,Teen 15-19,2003-07-21,15,64.4,Russia,-60,60,65,,65,40,45,-50,,45,80,90,-100,,90,200
1,67.5,M,SBD,Raw,Vyacheslav Baranov,Вячеслав Баранов,Juniors 20-23,1998-04-23,20,66.6,Russia,160,-170,-170,,160,105,110,-117.5,,110,170,-180,-180,,170,440
1,75,M,SBD,Raw,Vladimir Burnashov,Владимир Бурнашов,Teen 15-19,2002-11-15,16,69.2,Russia,180,185,190,,190,102.5,107.5,-110,,107.5,-237.5,240,245,,245,542.5
2,75,M,SBD,Raw,Sergey Timoshchuk,Сергей Тимощук,Teen 15-19,1998-12-11,19,68.9,Russia,90,100,115,,115,80,-90,-90,,80,100,120,140,,140,335
1,75,M,SBD,Raw,Grigoriy Yarevskiy,Григорий Яревский,Juniors 20-23,1996-05-17,22,74.3,Russia,170,180,190,,190,-120,120,-130,,120,222.5,230,235,,235,545
2,75,M,SBD,Raw,Aleksandr Kovalenko,Александр Коваленко,Juniors 20-23,1996-07-11,22,73.9,Russia,180,-190,190,,190,-120,120,125,,125,200,210,217.5,,217.5,532.5
1,75,M,SBD,Raw,Christos Konstantinou,,Open,1993-07-23,25,74.2,Cyprus,-230,230,250,,250,-135,145,-150,,145,245,-265,-265,,245,640
2,75,M,SBD,Raw,Denis Nikolaev,Денис Николаев,Open,1991-07-15,27,72.7,Russia,190,205,210,,210,110,-117.5,-117.5,,110,212.5,-225,-225,,212.5,532.5
3,75,M,SBD,Raw,Igor Laryushkin,Игорь Ларюшкин,Open,1992-09-15,26,69.2,Russia,150,160,170,,170,110,115,-120,,115,180,195,-205,,195,480
4,75,M,SBD,Raw,Konstantin Smirnov,Константин Смирнов,Open,1987-06-18,31,74.5,Russia,165,-172.5,-172.5,,165,110,-115,-115,,110,-200,-200,200,,200,475
DQ,75,M,SBD,Raw,Evgeniy Shirokov,Евгений Широков,Open,1988-12-03,30,74.8,Russia,180,190,-195,,190,-100,-100,-100,,,,,,,,
1,82.5,M,SBD,Raw,Maksim Novikov,Максим Новиков,Teen 15-19,1998-12-20,19,81.2,Russia,220,230,235,,235,145,150,155,,155,240,250,255,,255,645
1,82.5,M,SBD,Raw,Maksim Novikov,Максим Новиков,Open,1998-12-20,19,81.2,Russia,220,230,235,,235,145,150,155,,155,240,250,255,,255,645
2,82.5,M,SBD,Raw,Artem Shasherin,Артем Шашерин,Open,1984-11-08,34,79.6,Russia,200,210,215,,215,130,135,140,,140,210,220,240,,240,595
3,82.5,M,SBD,Raw,Igor Doronin,Игорь Доронин,Open,1991-05-09,27,80.9,Russia,190,200,205,,205,125,-130,-130,,125,230,240,250,,250,580
4,82.5,M,SBD,Raw,Dmitriy Mikhaylov,Дмитрий Михайлов,Open,1989-10-22,29,81.5,Russia,180,187.5,190,,190,130,135,-137.5,,135,210,-230,230,,230,555
5,82.5,M,SBD,Raw,Roman Nefyodov,Роман Нефёдов,Open,1987-05-29,31,79.5,Russia,100,110,115,,115,85,90,95,,95,120,130,-140,,130,340
DQ,82.5,M,SBD,Raw,Aleksandr Usov,Александр Усов,Open,1988-04-19,30,81.7,Russia,140,147.5,-150,,147.5,-95,-95,-95,,,,,,,,
1,82.5,M,SBD,Raw,Oleg Gerasimenko,Олег Герасименко,Masters 40-44,1975-11-20,43,82.1,Russia,145,155,165,,165,100,110,-115,,110,170,185,195,,195,470
1,82.5,M,SBD,Raw,Valeriy Bukanov,Валерий Буканов,Masters 60-64,1956-01-01,62,81.3,Russia,150,155,160,,160,105,110,,,110,170,180,,,180,450
1,90,M,SBD,Raw,Ilya Zaznobkin,Илья Зазнобкин,Teen 15-19,2001-12-17,16,88.8,Russia,150,-165,170,,170,110,117.5,-120,,117.5,-160,170,180,,180,467.5
2,90,M,SBD,Raw,Ilya Kochan,Илья Кочан,Teen 15-19,2002-07-20,16,86.3,Russia,145,152.5,162.5,,162.5,-100,100,-112.5,,100,150,160,-170,,160,422.5
1,90,M,SBD,Raw,Eduard Lapin,Эдуард Лапин,Juniors 20-23,1996-03-24,22,86.2,Russia,210,220,230,,230,145,152.5,-157.5,,152.5,230,245,-260,,245,627.5
1,90,M,SBD,Raw,Evgeniy Vladimirov,Евгений Владимиров,Open,1964-08-22,54,89,Russia,-255,255,-265,,255,160,165,-167.5,,165,245,-255,-255,,245,665
2,90,M,SBD,Raw,Andrey Arzamazov,Андрей Арзамазов,Open,1992-05-05,26,88,Russia,200,207.5,212.5,,212.5,155,162.5,-167.5,,162.5,230,-237.5,-237.5,,230,605
3,90,M,SBD,Raw,Kirill Surmach,Кирилл Сурмач,Open,1987-07-20,31,88.9,Russia,165,175,-180,,175,145,152.5,-155,,152.5,210,220,230,,230,557.5
4,90,M,SBD,Raw,Sergey Voroshilov,Сергей Ворошилов,Open,1988-08-03,30,88.1,Russia,-165,165,175,,175,140,145,-150,,145,-190,195,205,,205,525
5,90,M,SBD,Raw,Evgeniy Dmitrik,Евгений Дмитрик,Open,1980-08-23,38,87.6,Russia,170,180,190,,190,125,-130,130,,130,190,-200,200,,200,520
DQ,90,M,SBD,Raw,Sergey Ondrin,Сергей Ондрин,Open,1986-06-04,32,85.4,Russia,-150,150,-165,,150,-110,-110,-115,,,,,,,,
1,90,M,SBD,Raw,Evgeniy Vladimirov,Евгений Владимиров,Masters 50-54,1964-08-22,54,89,Russia,-255,255,-265,,255,160,165,-167.5,,165,245,-255,-255,,245,665
1,100,M,SBD,Raw,Demid Daneykin,Демид Данейкин,Juniors 20-23,1997-11-28,21,96.4,Russia,220,230,245,,245,115,120,-130,,120,240,252.5,270,,270,635
1,100,M,SBD,Raw,Delger-Khishig Banzragch,,Open,1980-01-20,38,97,Mongolia,-220,230,-240,,230,145,155,162.5,,162.5,240,-255,255,,255,647.5
2,100,M,SBD,Raw,Nikolay Zabelin,Николай Забелин,Open,1985-05-23,33,97.9,Russia,200,210,220,,220,155,160,-162.5,,160,240,250,-255,,250,630
3,100,M,SBD,Raw,Andrey Andreev,Андрей Андреев,Open,1979-03-08,39,98.8,Russia,190,200,210,,210,170,180,185,,185,220,-235,235,,235,630
4,100,M,SBD,Raw,Aleksandr Apukhtin,Александр Апухтин,Open,1993-12-21,24,96,Russia,175,185,192.5,,192.5,135,140,145,,145,220,230,240,,240,577.5
5,100,M,SBD,Raw,Ilya Lapshinov,Илья Лапшинов,Open,1980-03-11,38,96,Russia,155,162.5,170,,170,-130,130,-137.5,,130,160,175,185,,185,485
DQ,100,M,SBD,Raw,Igor Kuznetsov,Игорь Кузнецов,Open,1982-08-02,36,99.1,Russia,185,200,,,200,145,152.5,-160,,152.5,-215,-225,-225,,,
DQ,100,M,SBD,Raw,Sergey Moiseev,Сергей Моисеев,Masters 40-44,1977-08-24,41,97.4,Russia,210,222.5,-235,,222.5,-150,-150,-150,,,,,,,,
1,100,M,SBD,Raw,Ilya Nefedov,Илья Нефедов,Masters 45-49,1972-05-25,46,99.7,Russia,220,230,232.5,,232.5,140,145,147.5,,147.5,240,260,265,,265,645
1,100,M,SBD,Raw,Ermek Kapanov,Ермек Капанов,Masters 50-54,1964-07-03,54,97.3,Kazakhstan,150,-170,-170,,150,-90,90,100,,100,150,170,180,,180,430
1,110,M,SBD,Raw,Ion Parshikov,Ион Паршиков,Juniors 20-23,1995-10-14,23,109.5,Russia,232.5,-237.5,-237.5,,232.5,-155,155,160,,160,-230,230,240,,240,632.5
1,110,M,SBD,Raw,Anton Chyomov,Антон Чёмов,Open,1980-05-02,38,109.2,Russia,200,215,-225,,215,150,-157.5,-157.5,,150,200,212.5,-222.5,,212.5,577.5
1,125,M,SBD,Raw,Anton Shurov,Антон Шуров,Teen 15-19,2000-06-01,18,122,Russia,240,250,260,265,260,152.5,157.5,162.5,,162.5,245,255,265,,265,687.5
1,125,M,SBD,Raw,Anton Bukhman,Антон Бухман,Open,1988-08-22,30,116.5,Russia,250,270,282.5,,282.5,187.5,197.5,207.5,,207.5,275,295,-305,,295,785
2,125,M,SBD,Raw,Anatoliy Milyoshkin,Анатолий Милёшкин,Open,1977-08-21,41,117.5,Kazakhstan,270,-280,-280,,270,160,170,-180,,170,240,255,265,,265,705
1,125,M,SBD,Raw,Anatoliy Milyoshkin,Анатолий Милёшкин,Masters 40-44,1977-08-21,41,117.5,Kazakhstan,270,-280,-280,,270,160,170,-180,,170,240,255,265,,265,705
1,56,F,SBD,Wraps,Natalya Konchakova,Наталья Кончакова,Open,1977-08-14,41,54.7,Russia,145,155,160,,160,70,75,77.5,,77.5,-165,165,175,,175,412.5
2,56,F,SBD,Wraps,Natalya Medenkova,Наталья Меденкова,Open,1987-10-25,31,55.5,Russia,100,-105,-105,,100,45,50,52.5,,52.5,90,100,112.5,,112.5,265
1,56,F,SBD,Wraps,Zhanna Afanaseva,Жанна Афанасьева,Masters 40-44,1977-05-08,41,55.5,Russia,-87.5,90,95,,95,45,-50,-50,,45,100,-115,-115,,100,240
1,75,F,SBD,Wraps,Margarita Labeykite,Маргарита Лабейките,Open,1978-05-12,40,71.9,Russia,140,150,-160,,150,60,70,-77.5,,70,150,160,-170,,160,380
DQ,60,M,SBD,Wraps,Tair Faykov,Таир Файков,Open,1988-05-22,30,59.6,Russia,160,170,180,,180,-70,-70,-70,,,177.5,-190,-190,,177.5,
1,67.5,M,SBD,Wraps,Artyom Piven,Артём Пивень,Teen 15-19,2001-04-25,17,66.8,Russia,140,155,162.5,,162.5,95,105,110,,110,160,167.5,175,,175,447.5
1,75,M,SBD,Wraps,Andrey Tonkov,Андрей Тонков,Teen 15-19,2002-10-28,16,74.2,Russia,175,-190,190,,190,90,100,-105,,100,-215,215,-225,,215,505
1,82.5,M,SBD,Wraps,Dmitriy Yaskevich,Дмитрий Яскевич,Juniors 20-23,1997-01-24,21,80.3,Russia,197.5,205,210,,210,-115,115,-120,,115,215,-230,230,,230,555
2,82.5,M,SBD,Wraps,Nikita Monchenko,Никита Монченко,Juniors 20-23,1997-07-06,21,79,Russia,-140,150,155,,155,90,100,-105,,100,-200,205,215,,215,470
1,82.5,M,SBD,Wraps,Ruslan Tavtilov,Руслан Тавтилов,Open,1980-02-26,38,82.1,Russia,210,220,-225,,220,130,137.5,-140,,137.5,220,230,242.5,,242.5,600
2,82.5,M,SBD,Wraps,Pavel Tsvetkov,Павел Цветков,Open,1988-10-15,30,82.1,Russia,220,-235,-235,,220,145,152.5,-157.5,,152.5,190,210,225,,225,597.5
3,82.5,M,SBD,Wraps,Grigoriy Yudin,Григорий Юдин,Open,1985-06-06,33,81.6,Russia,220,235,242.5,,242.5,140,147.5,152.5,,152.5,180,192.5,-202.5,,192.5,587.5
1,82.5,M,SBD,Wraps,Yuriy Efremov,Юрий Ефремов,Masters 45-49,1972-04-05,46,80.8,Russia,200,210,215,,215,160,170,175,,175,215,225,235,,235,625
1,90,M,SBD,Wraps,Dmitriy Chernyshev,Дмитрий Чернышев,Open,1974-01-22,44,88.5,Russia,220,230,235,,235,155,-160,-160,,155,280,290,297.5,302.5,297.5,687.5
2,90,M,SBD,Wraps,Andrey Simkin,Андрей Симкин,Open,1983-05-27,35,89.7,Russia,215,230,245,,245,130,140,145,,145,-210,210,222.5,,222.5,612.5
3,90,M,SBD,Wraps,Evgeniy Neverov,Евгений Неверов,Open,1983-05-21,35,88.3,Russia,185,197.5,210,,210,132.5,140,145,,145,210,-220,-225,,210,565
4,90,M,SBD,Wraps,Vitaliy Dutchak,Виталий Дутчак,Open,1985-08-26,33,89.7,Russia,-205,205,215,,215,90,95,-100,,95,190,202.5,-210,,202.5,512.5
DQ,90,M,SBD,Wraps,Dmitriy Melsitov,Дмитрий Мельситов,Masters 40-44,1978-04-01,40,87.3,Russia,-190,-190,-190,,,,,,,,,,,,,
1,100,M,SBD,Wraps,Amarzaya Taivantumur,,Open,1987-08-02,31,99.1,Mongolia,270,-300,-300,,270,170,-185,185,,185,240,-255,,,240,695
2,100,M,SBD,Wraps,Sergey Banturov,Сергей Бантуров,Open,1982-09-28,36,100,Russia,210,-220,-220,,210,120,-132.5,-132.5,,120,210,230,-252.5,,230,560
DQ,100,M,SBD,Wraps,Pavel Spiridonov,Павел Спиридонов,Open,1983-10-22,35,99,Russia,-230,-230,-230,,,,,,,,,,,,,
1,100,M,SBD,Wraps,Aleksey Khangeldyan,Алексей Хангелдян,Masters 45-49,1970-12-14,47,95.1,Russia,190,-200,205,,205,115,122.5,127.5,,127.5,200,220,240,,240,572.5
1,100,M,SBD,Wraps,Ermek Kapanov,Ермек Капанов,Masters 50-54,1964-07-03,54,97.3,Kazakhstan,150,-170,-170,,150,-90,90,100,,100,150,170,180,,180,430
1,110,M,SBD,Wraps,Sergey Frolov,Сергей Фролов,Open,1986-03-21,32,108,Russia,210,225,240,,240,170,-177.5,-180,,170,-220,-230,230,,230,640
1,110,M,SBD,Wraps,Vitaliy Komarchuk,Виталий Комарчук,Masters 40-44,1977-10-07,41,105.9,Russia,265,275,,,275,145,150,-155,,150,210,222.5,232.5,,232.5,657.5
1,125,M,SBD,Wraps,Ugtakhbayar Khurelchuluun,,Open,1989-04-04,29,124.5,Mongolia,345,-375,-375,,345,-215,215,-225,,215,272.5,-290,-290,,272.5,832.5
1,125,M,SBD,Wraps,Andrey Sadovskiy,Андрей Садовский,Masters 55-59,1962-02-10,56,112,Russia,155,165,170,,170,90,-95,100,,100,180,190,200,,200,470
1,140,M,SBD,Wraps,Aleksandr Lugovoy,Александр Луговой,Open,1995-10-28,23,127,Russia,280,300,315,,315,180,190,-195,,190,300,325,342.5,,342.5,847.5
DQ,75,M,SBD,Single-ply,Roman Durnov,Роман Дурнов,Open,1986-09-23,32,74.7,Russia,250,260,-270,,260,-165,-165,-165,,,,,,,,
1,82.5,M,SBD,Single-ply,Evgeniy Zarinskiy,Евгений Заринский,Open,1991-04-12,27,79.4,Russia,210,225,-240,,225,130,140,152.5,,152.5,220,-230,-235,,220,597.5
1,100,M,SBD,Single-ply,Aleksey Bastrykin,Алексей Бастрыкин,Open,1991-05-03,27,94.8,Russia,-310,310,-320,,310,230,-240,-240,,230,275,287.5,,,287.5,827.5
1,48,F,BD,Raw,Yuliya Degtyareva,Юлия Дегтярева,Open,1990-09-08,28,47.8,Russia,,,,,,57.5,-60,60,,60,140,145,-150,,145,205
2,48,F,BD,Raw,Anna Mamont,Анна Мамонт,Open,1993-06-11,25,47.1,Russia,,,,,,52.5,-57.5,-57.5,,52.5,105,115,-122.5,,115,167.5
3,48,F,BD,Raw,Yana Volkova,Яна Волкова,Open,1991-08-24,27,46.2,Russia,,,,,,45,-50,-50,,45,100,110,-120,,110,155
1,52,F,BD,Raw,Teylane Guna,Тейлане Гуна,Open,1991-05-14,27,50.8,Latvia,,,,,,45,50,-52.5,,50,102.5,115,120,,120,170
1,60,F,BD,Raw,Anna Kremleva,Анна Кремлева,Open,1990-06-22,28,57.8,Russia,,,,,,35,40,-45,,40,85,90,,,90,130
1,67.5,F,BD,Raw,Elena Emelyova,Елена Емелёва,Masters 40-44,1976-07-11,42,61.1,Russia,,,,,,57.5,60,62.5,,62.5,115,122.5,127.5,,127.5,190
1,67.5,M,BD,Raw,Aldair Aliev,Альдаир Алиев,Open,1992-12-06,26,66.3,Russia,,,,,,-130,-130,130,,130,210,-215,215,-222.5,215,345
1,75,M,BD,Raw,Denis Kuklin,Денис Куклин,Open,1989-09-06,29,72.5,Russia,,,,,,127.5,-135,135,,135,150,160,170,,170,305
2,75,M,BD,Raw,Artem Mukharyamov,Артем Мухарьямов,Open,1989-08-03,29,71.9,Russia,,,,,,100,107.5,-112.5,,107.5,-165,165,175,,175,282.5
1,82.5,M,BD,Raw,Nikita Klevin,Никита Клевин,Juniors 20-23,1995-11-27,23,80.5,Russia,,,,,,125,130,-132.5,,130,182.5,192.5,-202.5,,192.5,322.5
1,82.5,M,BD,Raw,Mikhail Kiselev,Михаил Киселев,Open,1992-12-20,25,82.4,Russia,,,,,,145,150,,,150,265,285,292.5,-300,292.5,442.5
2,82.5,M,BD,Raw,Roman Klishch,Роман Клищ,Open,1992-03-29,26,81.2,Russia,,,,,,-135,135,-137.5,,135,165,172.5,-177.5,,172.5,307.5
1,90,M,BD,Raw,Evgeniy Mazur,Евгений Мазур,Open,1990-11-30,28,90,Russia,,,,,,-185,185,-190,,185,210,220,-230,,220,405
2,90,M,BD,Raw,Georgiy Kotelnikov,Георгий Котельников,Open,1992-06-04,26,90,Russia,,,,,,150,160,-165,,160,215,-225,225,,225,385
3,90,M,BD,Raw,Dmitriy Mayzel,Дмитрий Майзель,Open,1980-08-23,38,89.1,Russia,,,,,,145,150,-155,,150,190,-200,-200,,190,340
4,90,M,BD,Raw,Evgeniy Dmitrik,Евгений Дмитрик,Open,1980-08-23,38,87.6,Russia,,,,,,125,-130,130,,130,190,-200,200,,200,330
5,90,M,BD,Raw,Aleksey Tuzov,Алексей Тузов,Open,1989-05-21,29,86.9,Russia,,,,,,105,115,-120,,115,170,180,-190,,180,295
1,90,M,BD,Raw,Dmitriy Melsitov,Дмитрий Мельситов,Masters 40-44,1978-04-01,40,87.3,Russia,,,,,,110,117.5,122.5,,122.5,185,195,-205,,195,317.5
1,90,M,BD,Raw,Vasiliy Leonenko,Василий Леоненко,Masters 50-54,1967-04-06,51,88.8,Russia,,,,,,125,135,,,135,225,235,245,,245,380
1,100,M,BD,Raw,Emil Mamedov,Эмиль Мамедов,Open,1992-05-05,26,93.9,Russia,,,,,,132.5,-137.5,-137.5,,132.5,260,267.5,-275,,267.5,400
2,100,M,BD,Raw,Denis Plenkin,Денис Пленкин,Open,1974-05-19,44,99.8,Russia,,,,,,140,-150,-150,,140,-220,220,-230,,220,360
1,100,M,BD,Raw,Denis Plenkin,Денис Пленкин,Masters 40-44,1974-05-19,44,99.8,Russia,,,,,,140,-150,-150,,140,-220,220,-230,,220,360
1,110,M,BD,Raw,Ion Parshikov,Ион Паршиков,Juniors 20-23,1995-10-14,23,109.5,Russia,,,,,,-155,155,160,,160,-230,230,240,,240,400
1,125,M,BD,Raw,Dmitriy Trishin,Дмитрий Тришин,Teen 15-19,2002-07-23,16,123,Russia,,,,,,110,115,120,,120,-175,182.5,190,,190,310
DQ,90,M,BD,Multi-ply,Aleksandr Rogatenko,Александр Рогатенко,Open,1982-05-07,36,88.5,Russia,,,,,,-185,-185,-197.5,,,,,,,,
1,60,F,S,Raw,Ekaterina Popova,Екатерина Попова,Open,1988-03-02,30,57.8,Russia,85,90,95,,95,,,,,,,,,,,95
1,90,M,S,Raw,Andrey Stepanenko,Андрей Степаненко,Open,1983-05-02,35,89.7,Russia,150,160,-165,,160,,,,,,,,,,,160
DQ,100,M,S,Raw,Roman Panfilov,Роман Панфилов,Open,1976-07-15,42,100,Russia,-225,-225,,,,,,,,,,,,,,
1,100,M,S,Raw,Ermek Kapanov,Ермек Капанов,Masters 50-54,1964-07-03,54,97.3,Kazakhstan,150,-170,-170,,150,,,,,,,,,,,150
1,110,M,S,Raw,Ion Parshikov,Ион Паршиков,Juniors 20-23,1995-10-14,23,109.5,Russia,232.5,-237.5,-237.5,,232.5,,,,,,,,,,,232.5
1,60,M,S,Wraps,Tair Faykov,Таир Файков,Open,1988-05-22,30,59.6,Russia,160,170,180,,180,,,,,,,,,,,180
1,82.5,M,S,Wraps,Grigoriy Yudin,Григорий Юдин,Open,1985-06-06,33,81.6,Russia,220,235,242.5,,242.5,,,,,,,,,,,242.5
1,90,M,S,Wraps,Andrey Simkin,Андрей Симкин,Open,1983-05-27,35,89.7,Russia,215,230,245,,245,,,,,,,,,,,245
2,90,M,S,Wraps,Vitaliy Dutchak,Виталий Дутчак,Open,1985-08-26,33,89.7,Russia,-205,205,215,,215,,,,,,,,,,,215
1,110,M,S,Wraps,Vitaliy Komarchuk,Виталий Комарчук,Masters 40-44,1977-10-07,41,105.9,Russia,265,275,,,275,,,,,,,,,,,275
1,125,M,S,Wraps,Maksim Mezheritskiy,Максим Межерицкий,Open,1987-03-31,31,119.7,Russia,240,255,265,,265,,,,,,,,,,,265
1,44,F,B,Raw,Olga Khmeleva,Ольга Хмелева,Teen 15-19,2009-05-07,9,40.2,Russia,,,,,,22.5,25,-27.5,,25,,,,,,25
1,48,F,B,Raw,Natalya Zaboeva,Наталья Забоева,Teen 15-19,1999-04-24,19,48,Russia,,,,,,37.5,40,-45,,40,,,,,,40
1,48,F,B,Raw,Mariya Denisova,Мария Денисова,Masters 45-49,1971-06-09,47,47.5,Russia,,,,,,50,55,-60,,55,,,,,,55
2,48,F,B,Raw,Tatyana Grosheva,Татьяна Грошева,Masters 45-49,1971-01-06,47,46.9,Russia,,,,,,40,42.5,-45,,42.5,,,,,,42.5
1,52,F,B,Raw,Regina Kozhina,Регина Кожина,Open,1995-11-21,23,51.5,Russia,,,,,,62.5,-67.5,67.5,,67.5,,,,,,67.5
2,52,F,B,Raw,Kseniya Ukhanova,Ксения Уханова,Open,2001-10-01,17,50,Russia,,,,,,45,50,-52.5,,50,,,,,,50
3,52,F,B,Raw,Oksana Aleksandrova,Оксана Александрова,Open,1982-12-10,35,51.2,Russia,,,,,,42.5,47.5,-52.5,,47.5,,,,,,47.5
1,52,F,B,Raw,Natalya Palmina,Наталья Пальмина,Masters 45-49,1972-07-30,46,49.8,Russia,,,,,,45,-50,-50,,45,,,,,,45
1,56,F,B,Raw,Ekaterina Dudareva,Екатерина Дударева,Open,1993-11-08,25,55.4,Russia,,,,,,80,-82.5,-82.5,,80,,,,,,80
2,56,F,B,Raw,Anna Derebchinskaya,Анна Деребчинская,Open,1982-11-01,36,55.4,Russia,,,,,,45,47.5,-50,,47.5,,,,,,47.5
3,56,F,B,Raw,Ekaterina Markova,Екатерина Маркова,Open,1984-05-24,34,55.1,Russia,,,,,,40,-45,45,,45,,,,,,45
4,56,F,B,Raw,Sofiya Arfanova,София Арфанова,Open,1990-12-29,27,55.1,Russia,,,,,,37.5,42.5,-47.5,,42.5,,,,,,42.5
1,60,F,B,Raw,Anna Shmeleva,Анна Шмелева,Juniors 20-23,1996-10-17,22,58.5,Russia,,,,,,47.5,52.5,57.5,,57.5,,,,,,57.5
1,60,F,B,Raw,Valeriya Logacheva,Валерия Логачева,Open,1993-03-11,25,58.8,Russia,,,,,,62.5,67.5,70,,70,,,,,,70
2,60,F,B,Raw,Viktoriya Bryakkieva,Виктория Бряккиева,Open,1981-07-26,37,58.3,Russia,,,,,,62.5,67.5,-70,,67.5,,,,,,67.5
3,60,F,B,Raw,Olga Gurevich,Ольга Гуревич,Open,1985-02-21,33,59.5,Russia,,,,,,55,-57.5,-57.5,,55,,,,,,55
1,60,F,B,Raw,Olga Andriyanova,Ольга Андриянова,Masters 45-49,1972-02-09,46,59.2,Russia,,,,,,40,-47.5,-47.5,,40,,,,,,40
1,67.5,F,B,Raw,Ekaterina Karanova,Екатерина Каранова,Open,1988-11-02,30,66,Russia,,,,,,42.5,-50,-50,,42.5,,,,,,42.5
1,67.5,F,B,Raw,Mariya Vinogradova,Мария Виноградова,Masters 40-44,1975-08-01,43,65.4,Russia,,,,,,60,65,-70,,65,,,,,,65
2,67.5,F,B,Raw,Elena Dmitrieva,Елена Дмитриева,Masters 40-44,1974-11-03,44,67.1,Russia,,,,,,60,-65,65,,65,,,,,,65
1,75,F,B,Raw,Anastasiya Lisenkova,Анастасия Лисенкова,Teen 15-19,2002-05-15,16,73.6,Russia,,,,,,57.5,-60,60,,60,,,,,,60
1,75,F,B,Raw,Natalya Ogryzko,Наталья Огрызько,Open,1975-07-12,43,70.6,Russia,,,,,,107.5,,,,107.5,,,,,,107.5
1,75,F,B,Raw,Anna Ermolaeva,Анна Ермолаева,Masters 40-44,1975-04-27,43,68.8,Russia,,,,,,75,-80,-80,,75,,,,,,75
1,82.5,F,B,Raw,Alyona Kholina,Алёна Холина,Teen 15-19,2000-02-25,18,77.2,Russia,,,,,,65,67.5,70,,70,,,,,,70
1,56,M,B,Raw,Ivan Nikitinskiy,Иван Никитинский,Teen 15-19,2005-07-07,13,55.2,Russia,,,,,,60,65,70,,70,,,,,,70
1,56,M,B,Raw,Ivan Nikitinskiy,Иван Никитинский,Open,2005-07-07,13,55.2,Russia,,,,,,60,65,70,,70,,,,,,70
1,60,M,B,Raw,Mikhail Grebenshchikov,Михаил Гребенщиков,Open,1987-12-08,31,59.2,Russia,,,,,,120,-127.5,-127.5,,120,,,,,,120
1,60,M,B,Raw,Aleksandr Bovin,Александр Бовин,Masters 54-59,1958-12-23,59,57.5,Russia,,,,,,65,70,-72.5,,70,,,,,,70
1,67.5,M,B,Raw,Oleg Tityuk,Олег Титюк,Teen 15-19,2001-10-20,17,64.2,Russia,,,,,,85,90,-95,,90,,,,,,90
1,67.5,M,B,Raw,Igor Kuchin,Игорь Кучин,Open,1967-06-11,51,66.1,Russia,,,,,,140,148,-150,,148,,,,,,148
2,67.5,M,B,Raw,Yuriy Dorokhov,Юрий Дорохов,Open,1977-11-06,41,67.3,Russia,,,,,,127.5,135,-142.5,,135,,,,,,135
3,67.5,M,B,Raw,Vladimir Agafonov,Владимир Агафонов,Open,1992-05-11,26,66.7,Russia,,,,,,100,107.5,-110,,107.5,,,,,,107.5
1,67.5,M,B,Raw,Yuriy Dorokhov,Юрий Дорохов,Masters 40-44,1977-11-06,41,67.3,Russia,,,,,,127.5,135,-142.5,,135,,,,,,135
1,67.5,M,B,Raw,Igor Kuchin,Игорь Кучин,Masters 50-54,1967-06-11,51,66.1,Russia,,,,,,140,148,-150,,148,,,,,,148
1,67.5,M,B,Raw,Anatoliy Vilchitskiy,Анатолий Вильчицкий,Masters 60-64,1955-08-24,63,66.5,Russia,,,,,,95,100,105,,105,,,,,,105
1,75,M,B,Raw,Ivan Mazurin,Иван Мазурин,Teen 15-19,2001-04-21,17,72.1,Russia,,,,,,145,-150,-150,,145,,,,,,145
2,75,M,B,Raw,Aleksandr Filippov,Александр Филиппов,Teen 15-19,2002-03-27,16,72.1,Russia,,,,,,110,-115,-115,,110,,,,,,110
3,75,M,B,Raw,Daniil Raevskiy,Даниил Раевский,Teen 15-19,2001-11-16,17,74.3,Russia,,,,,,90,95,100,,100,,,,,,100
1,75,M,B,Raw,Andrey Skoryatin,Андрей Скорятин,Open,1992-10-16,26,73.2,Russia,,,,,,150,155,157.5,,157.5,,,,,,157.5
2,75,M,B,Raw,Arutyun Sargsyan,Арутюн Саргсян,Open,1983-12-06,35,73.4,Russia,,,,,,-145,150,-157.5,,150,,,,,,150
3,75,M,B,Raw,Anzor Bolotokov,Анзор Болотоков,Open,1977-11-18,41,74.9,Russia,,,,,,-145,145,150,,150,,,,,,150
4,75,M,B,Raw,Aleksandr Soldatov,Александр Солдатов,Open,1987-06-28,31,74.1,Russia,,,,,,135,140,-147.5,,140,,,,,,140
5,75,M,B,Raw,German Pochetnyy,Герман Почетный,Open,1987-07-04,31,74.2,Russia,,,,,,127.5,-135,135,,135,,,,,,135
6,75,M,B,Raw,Sergey An,Сергей Ан,Open,1987-11-09,31,73.9,Russia,,,,,,122.5,-135,-135,,122.5,,,,,,122.5
DQ,75,M,B,Raw,Mikhail Danilov,Михаил Данилов,Open,1984-07-27,34,74.5,Russia,,,,,,-135,,,,,,,,,,
1,75,M,B,Raw,Denis Farutin,Денис Фарутин,Masters 40-44,1977-01-24,41,70.9,Russia,,,,,,140,-147.5,147.5,,147.5,,,,,,147.5
1,75,M,B,Raw,Sergey Toming,Сергей Томинг,Masters 45-49,1968-12-09,49,73.1,Russia,,,,,,-120,120,125,,125,,,,,,125
1,82.5,M,B,Raw,Denis Ostapenko,Денис Остапенко,Teen 15-19,1999-11-19,19,79.5,Russia,,,,,,120,127.5,-130,,127.5,,,,,,127.5
2,82.5,M,B,Raw,Evgeniy Tseyklin,Евгений Цейклин,Teen 15-19,2000-09-17,18,77.1,Russia,,,,,,107.5,112.5,115,,115,,,,,,115
1,82.5,M,B,Raw,Aleksandr Vladimirov,Александр Владимиров,Open,1982-02-06,36,77.5,Russia,,,,,,150,160,167.5,,167.5,,,,,,167.5
2,82.5,M,B,Raw,Sergey Pilyugov,Сергей Пилюгов,Open,1990-02-26,28,79.3,Russia,,,,,,160,162.5,167.5,,167.5,,,,,,167.5
3,82.5,M,B,Raw,Parviz Mamadov,Парвиз Мамадов,Open,1981-03-13,37,80.7,Russia,,,,,,-150,150,-160,,150,,,,,,150
4,82.5,M,B,Raw,Aleksandr Ligay,Александр Лигай,Open,1987-03-21,31,80.7,Russia,,,,,,135,140,-145,,140,,,,,,140
5,82.5,M,B,Raw,Roman Klishch,Роман Клищ,Open,1992-03-29,26,81.2,Russia,,,,,,-135,135,-137.5,,135,,,,,,135
6,82.5,M,B,Raw,Aleksandr Prusov,Александр Прусов,Open,1985-08-13,33,81.4,Russia,,,,,,120,127.5,132.5,,132.5,,,,,,132.5
7,82.5,M,B,Raw,Maksim Branchukov,Максим Бранчуков,Open,1982-05-25,36,81,Russia,,,,,,127.5,-132.5,-132.5,,127.5,,,,,,127.5
8,82.5,M,B,Raw,Aleksey Maslenkov,Алексей Масленков,Open,1987-05-12,31,82,Russia,,,,,,115,122.5,-130,,122.5,,,,,,122.5
1,82.5,M,B,Raw,Stanislav Rusinov,Станислав Русинов,Masters 40-44,1978-04-21,40,81,Russia,,,,,,135,140,-142.5,,140,,,,,,140
2,82.5,M,B,Raw,Kirill Danilov,Кирилл Данилов,Masters 40-44,1978-06-26,40,81,Russia,,,,,,137.5,-145,-145,,137.5,,,,,,137.5
3,82.5,M,B,Raw,Dmitriy Klyukvin,Дмитрий Клюквин,Masters 40-44,1977-06-08,41,82.5,Russia,,,,,,130,137.5,-140,,137.5,,,,,,137.5
4,82.5,M,B,Raw,Ruslan Stepanov,Руслан Степанов,Masters 40-44,1978-04-06,40,82.3,Russia,,,,,,132.5,-137.5,-137.5,,132.5,,,,,,132.5
1,82.5,M,B,Raw,Mikhail Petrov,Михаил Петров,Masters 45-49,1973-05-27,45,79.7,Russia,,,,,,122.5,127.5,,,127.5,,,,,,127.5
1,90,M,B,Raw,Yuriy Shipitsyn,Юрий Шипицын,Teen 15-19,1999-03-06,19,88,Russia,,,,,,145,152.5,157.5,,157.5,,,,,,157.5
1,90,M,B,Raw,Dmitriy Krasnov,Дмитрий Краснов,Open,1992-04-26,26,89.8,Russia,,,,,,195,202.5,-205,,202.5,,,,,,202.5
2,90,M,B,Raw,Evgeniy Mazur,Евгений Мазур,Open,1990-11-30,28,90,Russia,,,,,,-185,185,-190,,185,,,,,,185
3,90,M,B,Raw,Aleksandr Kuznetsov,Александр Кузнецов,Open,1994-07-19,24,85.7,Russia,,,,,,150,160,-165,,160,,,,,,160
4,90,M,B,Raw,Bogdan Lugovoy,Богдан Луговой,Open,1975-11-26,43,89.1,Russia,,,,,,-155,155,160,,160,,,,,,160
5,90,M,B,Raw,Aleksey Kryachko,Алексей Крячко,Open,1990-08-13,28,88.5,Belarus,,,,,,145,-152.5,-152.5,,145,,,,,,145
6,90,M,B,Raw,Mikhail Goenko,Михаил Гоенко,Open,1992-03-16,26,88.7,Russia,,,,,,132.5,-152.5,-152.5,,132.5,,,,,,132.5
7,90,M,B,Raw,Vladimir Krasivykh,Владимир Красивых,Open,1982-11-09,36,86.1,Russia,,,,,,110,125,-132.5,,125,,,,,,125
8,90,M,B,Raw,Aleksandr Nifatov,Александр Нифатов,Open,1981-10-20,37,87.2,Russia,,,,,,-110,115,120,,120,,,,,,120
1,90,M,B,Raw,Bogdan Lugovoy,Богдан Луговой,Masters 40-44,1975-11-26,43,89.1,Russia,,,,,,-155,155,160,,160,,,,,,160
1,90,M,B,Raw,Vladimir Pleshkov,Владимир Плешков,Masters 70-74,1944-08-29,74,86.2,Russia,,,,,,107.5,115,-117.5,,115,,,,,,115
1,100,M,B,Raw,German Kozlov,Герман Козлов,Teen 15-19,1999-03-17,19,95.7,Russia,,,,,,-105,-115,120,,120,,,,,,120
2,100,M,B,Raw,Ruslan Zhelkobaev,Руслан Желкобаев,Teen 15-19,2000-08-30,18,99.2,Russia,,,,,,115,120,-122.5,,120,,,,,,120
1,100,M,B,Raw,Roman Legchaev,Роман Легчаев,Juniors 20-23,1995-12-03,23,94.5,Russia,,,,,,145,-155,-155,,145,,,,,,145
1,100,M,B,Raw,Timur Korzhinov,Тимур Коржинов,Open,1993-08-28,25,97.7,Russia,,,,,,175,187.5,190,,190,,,,,,190
2,100,M,B,Raw,Aleksandr Kalyagin,Александр Калягин,Open,1983-06-12,35,99.7,Russia,,,,,,190,-195,-195,,190,,,,,,190
3,100,M,B,Raw,Zaur Matiev,Заур Матиев,Open,1986-11-26,32,96.4,Russia,,,,,,175,185,-187.5,,185,,,,,,185
4,100,M,B,Raw,Amarzaya Taivantumur,,Open,1987-08-02,31,99.1,Mongolia,,,,,,170,-185,185,,185,,,,,,185
5,100,M,B,Raw,Evgeniy Murashev,Евгений Мурашев,Open,1990-12-17,27,93.2,Russia,,,,,,162.5,167.5,-175,,167.5,,,,,,167.5
6,100,M,B,Raw,Sergey Karataev,Сергей Каратаев,Open,1984-01-13,34,98.7,Russia,,,,,,150,162.5,-170,,162.5,,,,,,162.5
7,100,M,B,Raw,Pavel Spiridonov,Павел Спиридонов,Open,1983-10-22,35,99,Russia,,,,,,150,160,-170,,160,,,,,,160
8,100,M,B,Raw,Andrey Okunev,Андрей Окунев,Open,1993-06-28,25,99,Russia,,,,,,152.5,-162.5,-162.5,,152.5,,,,,,152.5
9,100,M,B,Raw,Andrey Shilenkov,Андрей Шиленков,Open,1993-07-06,25,97.9,Belarus,,,,,,135,-140,-140,,135,,,,,,135
10,100,M,B,Raw,Tuvshinzaya Batkhuu,,Open,1984-03-13,34,95.2,Mongolia,,,,,,115,125,-132.5,,125,,,,,,125
11,100,M,B,Raw,Aleksey Izosimov,Алексей Изосимов,Open,1982-05-02,36,97.3,Russia,,,,,,110,115,-120,,115,,,,,,115
1,100,M,B,Raw,Georgiy Paradiz,Георгий Парадиз,Masters 40-44,1975-05-14,43,97.8,Russia,,,,,,170,180,-185,,180,,,,,,180
2,100,M,B,Raw,Munkh-Erdene Zundui,,Masters 40-44,1976-12-12,41,98.1,Mongolia,,,,,,165,172.5,-182.5,,172.5,,,,,,172.5
3,100,M,B,Raw,Andrey Savitskiy,Андрей Савицкий,Masters 40-44,1975-03-16,43,90.2,Russia,,,,,,120,130,140,,140,,,,,,140
1,100,M,B,Raw,Aleksandr Dymov,Александр Дымов,Masters 45-49,1973-08-13,45,95,Russia,,,,,,165,172.5,180,,180,,,,,,180
2,100,M,B,Raw,Sergey Shamov,Сергей Шамов,Masters 45-49,1973-08-21,45,97.6,Russia,,,,,,155,165,-170,,165,,,,,,165
3,100,M,B,Raw,Klim Kachanov,Клим Качанов,Masters 45-49,1973-06-19,45,97.5,Russia,,,,,,152.5,-162.5,-162.5,,152.5,,,,,,152.5
1,100,M,B,Raw,Ermek Kapanov,Ермек Капанов,Masters 50-54,1964-07-03,54,97.3,Kazakhstan,,,,,,-90,90,100,,100,,,,,,100
1,100,M,B,Raw,Aleksandr Belousov,Александр Белоусов,Masters 55-59,1960-08-02,58,94.3,Russia,,,,,,147.5,-152.5,152.5,,152.5,,,,,,152.5
2,100,M,B,Raw,Yuriy Malchevskiy,Юрий Мальчевский,Masters 55-59,1961-04-11,57,99.2,Russia,,,,,,130,-137.5,-137.5,,130,,,,,,130
1,110,M,B,Raw,Vladislav Makushka,Владислав Макушка,Juniors 20-23,1995-06-15,23,107.8,Russia,,,,,,200,210,-225,,210,,,,,,210
1,110,M,B,Raw,Vadim Smirnov,Вадим Смирнов,Open,1982-10-13,36,105.2,Russia,,,,,,207.5,210,-212.5,,210,,,,,,210
2,110,M,B,Raw,Ilya Karpov,Илья Карпов,Open,1993-06-29,25,108.6,Russia,,,,,,205,-210,210,,210,,,,,,210
3,110,M,B,Raw,Denis Petrov,Денис Петров,Open,1979-09-27,39,102.9,Russia,,,,,,-165,-165,165,,165,,,,,,165
4,110,M,B,Raw,Sergey Makarov,Сергей Макаров,Open,1984-01-15,34,106.3,Russia,,,,,,160,165,-167.5,,165,,,,,,165
1,110,M,B,Raw,Kirill Ostapenko,Кирилл Остапенко,Masters 40-44,1977-10-19,41,102.6,Russia,,,,,,160,167.5,-175,,167.5,,,,,,167.5
1,110,M,B,Raw,Andrey Sugorovskiy,Андрей Сугоровский,Masters 45-49,1969-03-02,49,104.6,Russia,,,,,,160,170,-180,,170,,,,,,170
1,110,M,B,Raw,Viktor Erkovich,Виктор Еркович,Masters 60-64,1954-09-11,64,107.1,Russia,,,,,,-100,100,105,,105,,,,,,105
1,125,M,B,Raw,Dmitriy Trishin,Дмитрий Тришин,Teen 15-19,2002-07-23,16,123,Russia,,,,,,110,115,120,,120,,,,,,120
1,125,M,B,Raw,Vasiliy Glazychev,Василий Глазычев,Open,1982-05-31,36,122.4,Russia,,,,,,205,212.5,217.5,,217.5,,,,,,217.5
2,125,M,B,Raw,Artem Vorontsov,Артем Воронцов,Open,1976-08-03,42,115.1,Russia,,,,,,200,210,215,,215,,,,,,215
3,125,M,B,Raw,Ugtakhbayar Khurelchuluun,,Open,1989-04-04,29,124.5,Mongolia,,,,,,-215,215,-225,,215,,,,,,215
4,125,M,B,Raw,Anton Bukhman,Антон Бухман,Open,1988-08-22,30,116.5,Russia,,,,,,187.5,197.5,207.5,,207.5,,,,,,207.5
5,125,M,B,Raw,Andrey Kiryanov,Андрей Кирьянов,Open,1974-05-21,44,123.4,Russia,,,,,,195,202.5,205,,205,,,,,,205
6,125,M,B,Raw,Anatoliy Kroshko,Анатолий Крошко,Open,1987-07-31,31,120.7,Russia,,,,,,170,177.5,-180,,177.5,,,,,,177.5
7,125,M,B,Raw,Aleksandr Sergeev,Александр Сергеев,Open,1979-02-08,39,120.8,Russia,,,,,,172.5,-177.5,177.5,,177.5,,,,,,177.5
DQ,125,M,B,Raw,Anton Kulikov,Антон Куликов,Open,1982-12-22,35,117.6,Russia,,,,,,-200,-200,-200,,,,,,,,
1,125,M,B,Raw,Artem Vorontsov,Артем Воронцов,Masters 40-44,1976-08-03,42,115.1,Russia,,,,,,200,210,215,,215,,,,,,215
2,125,M,B,Raw,Andrey Kiryanov,Андрей Кирьянов,Masters 40-44,1974-05-21,44,123.4,Russia,,,,,,195,202.5,205,,205,,,,,,205
3,125,M,B,Raw,Aleksey Sablukov,Алексей Саблуков,Masters 50-54,1966-06-01,52,122.5,Russia,,,,,,145,150,155,,155,,,,,,155
1,140,M,B,Raw,Aleksandr Lugovoy,Александр Луговой,Open,1995-10-28,23,127,Russia,,,,,,180,190,-195,,190,,,,,,190
2,140,M,B,Raw,Sergey Doronin,Сергей Доронин,Open,1986-06-14,32,135.8,Russia,,,,,,180,185,-192.5,,185,,,,,,185
1,67.5,F,B,Single-ply,Tatyana Samsonova,Татьяна Самсонова,Open,1983-10-03,35,65.6,Russia,,,,,,80,-85,,,80,,,,,,80
1,67.5,M,B,Single-ply,Igor Kuchin,Игорь Кучин,Open,1967-06-11,51,66.1,Russia,,,,,,180,187.5,192.5,197.5,192.5,,,,,,192.5
1,90,M,B,Single-ply,Vladimir Konchakov,Владимир Кончаков,Open,1973-05-25,45,90,Russia,,,,,,270,285,-300,,285,,,,,,285
DQ,90,M,B,Single-ply,Aleksandr Rogatenko,Александр Рогатенко,Open,1982-05-07,36,88.5,Russia,,,,,,-185,-185,-197.5,,,,,,,,
1,100,M,B,Single-ply,Aleksey Berezhkov,Алексей Бережков,Open,1982-08-08,36,98.9,Russia,,,,,,205,215,-225,,215,,,,,,215
DQ,100,M,B,Single-ply,Maksim Maslennikov,Максим Масленников,Open,1988-03-04,30,99.2,Russia,,,,,,-210,-210,-215,,,,,,,,
1,140,M,B,Single-ply,Oleg Vnukov,Олег Внуков,Open,1974-06-11,44,127,Russia,,,,,,-260,260,,,260,,,,,,260
1,48,F,D,Raw,Yuliya Degtyareva,Юлия Дегтярева,Open,1990-09-08,28,47.8,Russia,,,,,,,,,,,140,145,-150,,145,145
1,52,F,D,Raw,Mariya Matveeva,Мария Матвеева,Open,1986-05-29,32,51.2,Russia,,,,,,,,,,,92.5,97.5,102.5,,102.5,102.5
1,56,F,D,Raw,Natalya Pilipyuk,Наталья Пилипюк,Open,1983-12-21,34,54.4,Russia,,,,,,,,,,,135,142.5,147.5,,147.5,147.5
1,60,F,D,Raw,Olga Kontsevaya,Ольга Концевая,Juniors 20-23,1995-07-08,23,59,Russia,,,,,,,,,,,105,-115,-115,,105,105
1,60,F,D,Raw,Elena Razumova,Елена Разумова,Open,1977-02-24,41,59.1,Russia,,,,,,,,,,,110,115,-122.5,,115,115
2,60,F,D,Raw,Aleksandra Osipenko,Александра Осипенко,Open,1993-10-01,25,58.8,Russia,,,,,,,,,,,90,100,-110,,100,100
3,60,F,D,Raw,Zinaida Rudenko,Зинаида Руденко,Open,1975-09-07,43,58.9,Russia,,,,,,,,,,,92.5,97.5,-102.5,,97.5,97.5
1,60,F,D,Raw,Elena Razumova,Елена Разумова,Masters 40-44,1977-02-24,41,59.1,Russia,,,,,,,,,,,110,115,-122.5,,115,115
2,60,F,D,Raw,Zinaida Rudenko,Зинаида Руденко,Masters 40-44,1975-09-07,43,58.9,Russia,,,,,,,,,,,92.5,97.5,-102.5,,97.5,97.5
1,67.5,F,D,Raw,Anastasiya Avdeeva,Анастасия Авдеева,Open,1978-09-18,40,62.3,Russia,,,,,,,,,,,95,100,-110,,100,100
1,67.5,F,D,Raw,Anastasiya Avdeeva,Анастасия Авдеева,Masters 40-44,1978-09-18,40,62.3,Russia,,,,,,,,,,,95,100,-110,,100,100
1,75,F,D,Raw,Valeriya Chernomashentseva,Валерия Черномашенцева,Open,1989-01-07,29,74.7,Russia,,,,,,,,,,,145,152.5,-160,,152.5,152.5
1,75,F,D,Raw,Irina Danielyan,Ирина Даниелян,Masters 45-49,1972-11-22,46,74.1,Russia,,,,,,,,,,,110,120,-127.5,,120,120
1,52,M,D,Raw,Nikita Chizhov,Никита Чижов,Juniors 20-23,1995-10-04,23,45.5,Russia,,,,,,,,,,,135,140,150,-155,150,150
DQ,56,M,D,Raw,Vyacheslav Gretskov,Вячеслав Грецков,Teen 15-19,2000-07-30,18,55.7,Russia,,,,,,,,,,,-155,-155,-155,,,
1,60,M,D,Raw,Tair Faykov,Таир Файков,Open,1988-05-22,30,59.6,Russia,,,,,,,,,,,177.5,-190,-190,,177.5,177.5
1,67.5,M,D,Raw,Maksim Kuznetsov,Максим Кузнецов,Teen 15-19,2002-04-19,16,64.3,Russia,,,,,,,,,,,150,157.5,165,,165,165
2,67.5,M,D,Raw,Kirill Sukhov,Кирилл Сухов,Teen 15-19,2004-03-02,14,66.6,Russia,,,,,,,,,,,150,160,-170,,160,160
1,67.5,M,D,Raw,Aldair Aliev,Альдаир Алиев,Open,1992-12-06,26,66.3,Russia,,,,,,,,,,,210,-215,215,-222.5,215,215
1,75,M,D,Raw,Andrey Tonkov,Андрей Тонков,Teen 15-19,2002-10-28,16,74.2,Russia,,,,,,,,,,,-215,215,-225,,215,215
2,75,M,D,Raw,Danila Ivanov,Данила Иванов,Teen 15-19,1999-01-20,19,71.9,Russia,,,,,,,,,,,140,147.5,-152.5,,147.5,147.5
1,75,M,D,Raw,Christos Konstantinou,,Open,1993-07-23,25,74.2,Cyprus,,,,,,,,,,,245,-265,-265,,245,245
2,75,M,D,Raw,Arsen Rangulov,Арсен Рангулов,Open,1990-07-05,28,71.8,Russia,,,,,,,,,,,-197.5,207.5,215,,215,215
3,75,M,D,Raw,Aleksey Popkov,Алексей Попков,Open,1989-02-03,29,74.7,Belarus,,,,,,,,,,,200,-210,-210,,200,200
4,75,M,D,Raw,Evgeniy Shirokov,Евгений Широков,Open,1988-12-03,30,74.8,Russia,,,,,,,,,,,190,-200,-200,,190,190
1,82.5,M,D,Raw,Egor Ablaev,Егор Аблаев,Teen 15-19,2002-10-17,16,81.6,Russia,,,,,,,,,,,170,180,185,,185,185
1,82.5,M,D,Raw,Mikhail Kiselev,Михаил Киселев,Open,1992-12-20,25,82.4,Russia,,,,,,,,,,,265,285,292.5,-300,292.5,292.5
2,82.5,M,D,Raw,Igor Doronin,Игорь Доронин,Open,1991-05-09,27,80.9,Russia,,,,,,,,,,,230,240,250,,250,250
3,82.5,M,D,Raw,Sergey Stotik,Сергей Стотик,Open,1990-01-23,28,82,Belarus,,,,,,,,,,,242.5,-250,-250,,242.5,242.5
4,82.5,M,D,Raw,Vyacheslav Rokhmanko,Вячеслав Рохманко,Open,1988-05-17,30,81.1,Russia,,,,,,,,,,,170,190,-200,,190,190
5,82.5,M,D,Raw,Sergey Kirshin,Сергей Киршин,Open,1989-01-18,29,80.9,Russia,,,,,,,,,,,150,-155,-155,,150,150
1,82.5,M,D,Raw,Maksim Abramov,Максим Абрамов,Masters 45-49,1969-02-07,49,80.9,Russia,,,,,,,,,,,190,-205,-205,,190,190
1,82.5,M,D,Raw,Sergey Batrakov,Сергей Батраков,Masters 60-64,1956-07-06,62,82.4,Russia,,,,,,,,,,,152.5,157.5,-162.5,,157.5,157.5
1,90,M,D,Raw,Aleksey Boyarintsev,Алексей Бояринцев,Open,1989-01-02,29,88.5,Russia,,,,,,,,,,,280,297.5,-302.5,,297.5,297.5
2,90,M,D,Raw,Aleksandr Filatov,Александр Филатов,Open,1993-05-10,25,86.9,Russia,,,,,,,,,,,235,250,262.5,,262.5,262.5
3,90,M,D,Raw,Vitaliy Dutchak,Виталий Дутчак,Open,1985-08-26,33,89.7,Russia,,,,,,,,,,,190,202.5,-210,,202.5,202.5
DQ,90,M,D,Raw,Evgeniy Lukashevich,Евгений Лукашевич,Open,1994-01-03,24,86.8,Russia,,,,,,,,,,,-297.5,-297.5,-297.5,,,
1,90,M,D,Raw,Vasiliy Leonenko,Василий Леоненко,Masters 50-54,1967-04-06,51,88.8,Russia,,,,,,,,,,,225,235,245,,245,245
1,100,M,D,Raw,Daniil Katin,Даниил Катин,Teen 15-19,1999-08-24,19,97.7,Russia,,,,,,,,,,,260,-275,-275,,260,260
1,100,M,D,Raw,Evgeniy Dorofeyskiy,Евгений Дорофейский,Juniors 20-23,1995-09-14,23,97.3,Russia,,,,,,,,,,,260,-280,-280,,260,260
2,100,M,D,Raw,Aleksandr Ogoreltsev,Александр Огорельцев,Juniors 20-23,1995-04-20,23,97.4,Russia,,,,,,,,,,,240,245,-250,,245,245
1,100,M,D,Raw,Eduard Marchenko,Эдуард Марченко,Open,1992-03-17,26,92.3,Ukraine,,,,,,,,,,,300,-307.5,-312.5,,300,300
2,100,M,D,Raw,Zaur Matiev,Заур Матиев,Open,1986-11-26,32,96.4,Russia,,,,,,,,,,,260,275,280,,280,280
3,100,M,D,Raw,Emil Mamedov,Эмиль Мамедов,Open,1992-05-05,26,93.9,Russia,,,,,,,,,,,260,267.5,-275,,267.5,267.5
4,100,M,D,Raw,Pavel Karpela,Павел Карпела,Open,1985-06-14,33,94.1,Russia,,,,,,,,,,,-180,190,202.5,,202.5,202.5
5,100,M,D,Raw,Vasiliy Belov,Василий Белов,Open,1987-05-05,31,95.5,Russia,,,,,,,,,,,190,197.5,202.5,,202.5,202.5
1,100,M,D,Raw,Sergey Moiseev,Сергей Моисеев,Masters 40-44,1977-08-24,41,97.4,Russia,,,,,,,,,,,240,255,265,,265,265
2,100,M,D,Raw,Roman Belyaev,Роман Беляев,Masters 40-44,1976-01-22,42,99.7,Russia,,,,,,,,,,,240,-260,,,240,240
1,100,M,D,Raw,Ermek Kapanov,Ермек Капанов,Masters 50-54,1964-07-03,54,97.3,Kazakhstan,,,,,,,,,,,150,170,180,,180,180
1,100,M,D,Raw,Viktor Smyshlyaev,Виктор Смышляев,Masters 55-59,1962-05-20,56,99.2,Russia,,,,,,,,,,,170,190,200,,200,200
1,110,M,D,Raw,Aleksandr Suvorov,Александр Суворов,Juniors 20-23,1995-04-16,23,108.6,Russia,,,,,,,,,,,260,-275,,,260,260
1,110,M,D,Raw,Pavel Anufriev,Павел Ануфриев,Open,1984-10-02,34,106.8,Russia,,,,,,,,,,,-215,225,-247.5,,225,225
1,125,M,D,Raw,Dmitriy Trishin,Дмитрий Тришин,Teen 15-19,2002-07-23,16,123,Russia,,,,,,,,,,,-175,182.5,190,,190,190
1,125,M,D,Raw,Anatoliy Belyakov,Анатолий Беляков,Juniors 20-23,1996-10-19,22,118.1,Russia,,,,,,,,,,,200,210,-220,,210,210
1,140,M,D,Raw,Aleksandr Lugovoy,Александр Луговой,Open,1995-10-28,23,127,Russia,,,,,,,,,,,300,325,342.5,,342.5,342.5
1,140,M,D,Raw,Grigoriy Sakharov,Григорий Сахаров,Masters 40-44,1977-06-17,41,130.8,Russia,,,,,,,,,,,232.5,-265,-265,,232.5,232.5
1,75,M,D,Single-ply,Roman Durnov,Роман Дурнов,Open,1986-09-23,32,74.7,Russia,,,,,,,,,,,205,217.5,-225,,217.5,217.5
1,90,M,D,Single-ply,Aleksandr Rogatenko,Александр Рогатенко,Open,1982-05-07,36,88.5,Russia,,,,,,,,,,,235,,,,235,235
