Division,WeightClassKg,Place,Name,Team,BodyweightKg,Best3SquatKg,Best3BenchKg,Best3DeadliftKg,TotalKg,Equipment,Event,Sex
Boys,51.71,1,Cody Villa,Crawford,51.62,127.01,83.91,163.29,374.21,Single-ply,SBD,M
Boys,55.79,2,Darius Jackson,Robinson,51.8,,79.38,136.08,215.46,Single-ply,BD,M
Boys,51.71,3,Jeffery Wood,Valley Mills,42.73,90.72,40.82,79.38,210.92,Single-ply,SBD,M
Boys,51.71,4,Austin McKain,Valley Mills,42.18,77.11,36.29,68.04,181.44,Single-ply,SBD,M
Boys,55.79,1,Miguel Contreras,Robinson,53.98,151.95,83.91,142.88,378.75,Single-ply,SBD,M
Boys,55.79,2,Jesus Tonche,Waco Connally,55.34,136.08,74.84,145.15,356.07,Single-ply,SBD,M
Boys,55.79,3,Sam Aguire,Bruceville-Eddy,55.07,92.99,65.77,106.59,265.35,Single-ply,SBD,M
Boys,55.79,4,Shawn Murphy #2,Bosqueville,54.7,70.31,49.9,102.06,222.26,Single-ply,SBD,M
Boys,55.79,5,Jordan Whicker,Valley Mills,53.98,79.38,,92.99,172.37,Single-ply,SD,M
Boys,59.87,1,Luis Juarez,Bosqueville,57.97,154.22,106.59,181.44,442.25,Single-ply,SBD,M
Boys,67.13,2,Cory Sauer,Robinson,59.96,149.69,99.79,138.35,387.82,Single-ply,SBD,M
Boys,59.87,3,Dylan Fuschino,Waco Connally,57.24,108.86,56.7,113.4,278.96,Single-ply,SBD,M
Boys,59.87,4,Kaden Trice,Salado,57.88,108.86,54.43,113.4,276.69,Single-ply,SBD,M
Boys,59.87,5,John Mendoza,Moody,56.34,92.99,61.23,102.06,256.28,Single-ply,SBD,M
Boys,59.87,6,Brandon Putnam,Moody,56.79,92.99,61.23,56.7,210.92,Single-ply,SBD,M
Boys,74.84,1,Bo Pearson,Crawford,67.31,138.35,79.38,147.42,365.14,Single-ply,SBD,M
Boys,67.13,2,Harley Eldridge,Waco Connally,63.05,108.86,79.38,131.54,319.78,Single-ply,SBD,M
Boys,67.13,3,Desmond Harris,Waco Connally,66.95,102.06,65.77,131.54,299.37,Single-ply,SBD,M
Boys,67.13,4,Alex Smith,Bosqueville,63.68,102.06,58.97,115.67,276.69,Single-ply,SBD,M
Boys,67.13,5,Justin Farmer,Moody,64.23,102.06,,133.81,235.87,Single-ply,SD,M
Boys,74.84,1,Josh Robinson,Salado,73.39,190.51,142.88,188.24,521.63,Single-ply,SBD,M
Boys,74.84,2,Hunter Work,Robinson,74.48,181.44,136.08,183.7,501.22,Single-ply,SBD,M
Boys,74.84,3,Zach Robinson,Salado,73.39,185.97,115.67,195.04,496.68,Single-ply,SBD,M
Boys,74.84,4,Lane Fikes,Robinson,68.04,174.63,92.99,190.51,458.13,Single-ply,SBD,M
Boys,74.84,5,Chandler Gordon,Hillsboro,70.22,151.95,97.52,165.56,415.04,Single-ply,SBD,M
Boys,74.84,6,Colton Reeves,Valley Mills,68.86,147.42,92.99,149.69,390.09,Single-ply,SBD,M
Boys,74.84,7,Trae Grams,Bruceville-Eddy,74.03,129.27,92.99,133.81,356.07,Single-ply,SBD,M
Boys,74.84,8,Trey Miller,Hillsboro,71.67,136.08,81.65,136.08,353.8,Single-ply,SBD,M
Boys,74.84,9,Oscar Gomez,Hillsboro,74.3,117.93,79.38,140.61,337.93,Single-ply,SBD,M
Boys,74.84,10,Levi Whipkey,Moody,72.21,102.06,79.38,154.22,335.66,Single-ply,SBD,M
Boys,74.84,11,Jose Rodriguez,Valley Mills,70.4,113.4,70.31,142.88,326.59,Single-ply,SBD,M
Boys,82.1,12,Lance Spakes,Salado,75.02,124.74,74.84,124.74,324.32,Single-ply,SBD,M
Boys,74.84,13,Jake Lynch,Crawford,68.63,115.67,72.57,113.4,301.64,Single-ply,SBD,M
Boys,74.84,14,Dalton Butler,Bruceville-Eddy,69.22,129.27,,122.47,251.74,Single-ply,SD,M
Boys,89.81,1,Brody Jones,Crawford,82.28,235.87,149.69,219.99,605.55,Single-ply,SBD,M
Boys,82.1,2,Matt Brown #7,Crawford,79.38,154.22,108.86,170.1,433.18,Single-ply,SBD,M
Boys,82.1,3,Matthew Weatherman,Crawford,80.2,163.29,83.91,174.63,421.84,Single-ply,SBD,M
Boys,82.1,4,David Librado,Hillsboro,78.74,136.08,77.11,124.74,337.93,Single-ply,SBD,M
Boys,82.1,5,Michael Autenrieth,Waco Connally,79.56,131.54,74.84,124.74,331.12,Single-ply,SBD,M
Boys,82.1,6,Ricky Sampson,Salado,81.1,122.47,68.04,136.08,326.59,Single-ply,SBD,M
Boys,89.81,1,Darian Robinson,Waco Connally,86.27,199.58,131.54,215.46,546.58,Single-ply,SBD,M
Boys,89.81,2,Ricky Thompson,Robinson,85.18,195.04,117.93,222.26,535.24,Single-ply,SBD,M
Boys,89.81,3,Riley Allen,Robinson,84.1,185.97,113.4,165.56,464.93,Single-ply,SBD,M
Boys,89.81,4,Dillon Van Zandt,Crawford,86.55,181.44,97.52,158.76,437.72,Single-ply,SBD,M
Boys,89.81,5,Brett Mathis,Bosqueville,89.09,151.95,92.99,165.56,410.5,Single-ply,SBD,M
Boys,89.81,6,Cody Davis,Moody,84.55,136.08,83.91,181.44,401.43,Single-ply,SBD,M
Boys,89.81,7,Cole Pisarcik,Crawford,86,158.76,81.65,149.69,390.09,Single-ply,SBD,M
Boys,89.81,8,Amalio Trejo,Hillsboro,89.54,154.22,90.72,142.88,387.82,Single-ply,SBD,M
Boys,89.81,9,Ernest Sanchez,Waco Connally,85.18,136.08,72.57,158.76,367.41,Single-ply,SBD,M
Boys,89.81,10,Tristan Cale,Bosqueville,88.54,102.06,77.11,154.22,333.39,Single-ply,SBD,M
Boys,89.81,11,Emanuel Chavez,Valley Mills,82.64,102.06,56.7,113.4,272.16,Single-ply,SBD,M
Boys,99.79,1,Chris Robinson,Waco Connally,99.06,254.01,149.69,249.48,653.17,Single-ply,SBD,M
Boys,99.79,2,Marcos Alfaro,Hillsboro,96.25,181.44,111.13,208.65,501.22,Single-ply,SBD,M
Boys,99.79,3,Matt McNew,Robinson,93.8,181.44,117.93,181.44,480.81,Single-ply,SBD,M
Boys,99.79,4,Tyler Talbott,Salado,96.71,181.44,104.33,183.7,469.47,Single-ply,SBD,M
Boys,99.79,5,Jacob Kevil,Crawford,99.61,170.1,115.67,183.7,469.47,Single-ply,SBD,M
Boys,99.79,6,Tony Quintana,Hillsboro,99.79,156.49,129.27,170.1,455.86,Single-ply,SBD,M
Boys,99.79,7,Ryan Blackford,Valley Mills,94.71,113.4,70.31,136.08,319.78,Single-ply,SBD,M
Boys,99.79,8,Gustavo Campos,Hillsboro,94.89,113.4,79.38,124.74,317.51,Single-ply,SBD,M
Boys,109.77,1,Billy Golding,Salado,109.04,263.08,167.83,235.87,666.78,Single-ply,SBD,M
Boys,109.77,2,Ryan de la Garza,Waco Connally,108.5,226.8,136.08,213.19,576.06,Single-ply,SBD,M
Boys,109.77,3,Peyton Womack,Salado,104.87,210.92,122.47,204.12,537.51,Single-ply,SBD,M
Boys,109.77,4,Cody Ewing,Valley Mills,101.33,136.08,83.91,124.74,344.73,Single-ply,SBD,M
Boys,124.74,1,Alfredo Librado,Hillsboro,111.67,224.53,145.15,185.97,555.65,Single-ply,SBD,M
Boys,124.74,2,Erik Zavala,Hillsboro,110.86,199.58,108.86,210.92,519.36,Single-ply,SBD,M
Boys,124.74,3,Jody Hodges,Salado,113.58,204.12,127.01,172.37,503.49,Single-ply,SBD,M
Boys,124.74,4,Bobby Davis,Bosqueville,115.58,170.1,108.86,192.78,471.74,Single-ply,SBD,M
Boys,124.74,5,Andrew Netherland,Robinson,111.49,181.44,122.47,161.03,464.93,Single-ply,SBD,M
Boys,124.74,6,Blake Kasparian,Crawford,114.31,170.1,115.67,174.63,460.4,Single-ply,SBD,M
Boys,124.74,7,Alex Balch,Valley Mills,113.4,151.95,83.91,136.08,371.95,Single-ply,SBD,M
Boys,124.74+,1,Trent Andrews,Bosqueville,128,278.96,145.15,260.82,684.92,Single-ply,SBD,M
Boys,124.74+,2,Shane Murphy,Robinson,158.76,269.89,204.12,210.92,684.92,Single-ply,SBD,M
Boys,124.74+,3,Pedro Salvador,Hillsboro,132.54,226.8,172.37,204.12,603.28,Single-ply,SBD,M
Boys,124.74+,4,Edgar Salvador,Hillsboro,158.3,226.8,172.37,195.04,594.21,Single-ply,SBD,M
Boys,124.74+,5,Marcus Robinson,Waco Connally,134.35,226.8,136.08,192.78,555.65,Single-ply,SBD,M
Boys,124.74+,6,Tanner Smith,Robinson,126.19,181.44,120.2,163.29,464.93,Single-ply,SBD,M
Boys,124.74+,7,Narisco Molina,Waco Connally,133.54,204.12,102.06,136.08,442.25,Single-ply,SBD,M
Boys,124.74+,8,Jacob Jimmerson,Salado,132.72,185.97,97.52,142.88,426.38,Single-ply,SBD,M
Boys,124.74+,9,Jarrett Hodges,Salado,126.1,129.27,65.77,108.86,303.91,Single-ply,SBD,M
Boys,,NS,Luis Villafranco,Salado,,,,,,Single-ply,SBD,M
Boys,,NS,James Collins,Salado,,,,,,Single-ply,SBD,M
Boys,,NS,Dustin Free,Salado,,,,,,Single-ply,SBD,M
Boys,,NS,Edgar Slavador,Hillsboro,,,,,,Single-ply,SBD,M
Boys,,NS,Saucedo Jaime,Bosqueville,,,,,,Single-ply,SBD,M
