Division,WeightClassKg,Place,Name,Team,BodyweightKg,Best3SquatKg,Best3BenchKg,Best3DeadliftKg,TotalKg,Equipment,Event,Sex
Boys,51.71,1,Caleb Chacon,Merkel,51.71,97.52,61.23,111.13,269.89,Single-ply,SBD,M
Boys,51.71,2,Noah Perez,Abilene,49.17,92.99,52.16,113.4,258.55,Single-ply,SBD,M
Boys,51.71,3,Christian Martin,Abilene Cooper,50.71,83.91,43.09,104.33,231.33,Single-ply,SBD,M
Boys,51.71,4,Jayton Pimentel,Clyde,49.26,81.65,52.16,90.72,224.53,Single-ply,SBD,M
Boys,51.71,5,Jason Webster,Abilene Cooper,49.08,74.84,38.56,90.72,204.12,Single-ply,SBD,M
Boys,51.71,DQ,Eric Leach,Tuscola Jim Ned,45.54,92.99,,,,Single-ply,SBD,M
Boys,55.79,1,Lleyton Frazier,Tuscola Jim Ned,54.79,140.61,83.91,145.15,369.68,Single-ply,SBD,M
Boys,55.79,2,Adam Hathaway,Merkel,55.7,102.06,61.23,129.27,292.57,Single-ply,SBD,M
Boys,55.79,3,Brody Stanford,Abilene Cooper,54.7,108.86,52.16,113.4,274.42,Single-ply,SBD,M
Boys,55.79,4,Angel Marin,Abilene,55.47,102.06,43.09,113.4,258.55,Single-ply,SBD,M
Boys,59.87,1,Alec Arredondo,Abilene,58.06,147.42,90.72,154.22,392.36,Single-ply,SBD,M
Boys,59.87,2,Matthew Gray,Tuscola Jim Ned,59.51,138.35,72.57,156.49,367.41,Single-ply,SBD,M
Boys,59.87,3,Riley Perry,Tuscola Jim Ned,59.15,136.08,88.45,140.61,365.14,Single-ply,SBD,M
Boys,59.87,4,Carson Parker,Merkel,59.33,113.4,74.84,129.27,317.51,Single-ply,SBD,M
Boys,59.87,5,Austin Tobar,Abilene Cooper,58.15,113.4,77.11,120.2,310.71,Single-ply,SBD,M
Boys,59.87,6,Jackson Heidenheimer,Anson,58.33,120.2,61.23,117.93,299.37,Single-ply,SBD,M
Boys,59.87,7,Kirkland Leverett,Abilene,57.88,106.59,56.7,117.93,281.23,Single-ply,SBD,M
Boys,67.13,1,Luis Morales,San Angelo Central,62.23,167.83,88.45,163.29,419.57,Single-ply,SBD,M
Boys,67.13,2,Joseph Flores,Abilene Cooper,67.13,161.03,83.91,165.56,410.5,Single-ply,SBD,M
Boys,67.13,3,Bryce Munoz,Anson,62.51,158.76,83.91,165.56,408.23,Single-ply,SBD,M
Boys,67.13,4,Rj Hoffman,Clyde,65.05,181.44,77.11,145.15,403.7,Single-ply,SBD,M
Boys,67.13,5,Bo Baker,Clyde,64.68,151.95,79.38,149.69,381.02,Single-ply,SBD,M
Boys,67.13,6,Kendal Adames,Sweetwater,65.68,136.08,83.91,158.76,378.75,Single-ply,SBD,M
Boys,67.13,7,Christian Rodriguez,Abilene Cooper,63.59,122.47,77.11,142.88,342.46,Single-ply,SBD,M
Boys,67.13,8,Clayton Sparks,Merkel,62.6,108.86,63.5,136.08,308.44,Single-ply,SBD,M
Boys,67.13,9,Joe Angel Torres,Abilene,60.51,106.59,61.23,106.59,274.42,Single-ply,SBD,M
Boys,74.84,1,Mario Martinez,San Angelo Central,74.66,192.78,117.93,197.31,508.02,Single-ply,SBD,M
Boys,74.84,2,Austin Eubanks,Clyde,69.76,188.24,83.91,154.22,426.38,Single-ply,SBD,M
Boys,74.84,3,Jacob Contreras,Tuscola Jim Ned,71.12,154.22,92.99,163.29,410.5,Single-ply,SBD,M
Boys,74.84,4,Brian Morales,Cross Plains,74.84,154.22,88.45,167.83,410.5,Single-ply,SBD,M
Boys,74.84,5,Michael Schubert,Abilene Cooper,69.85,147.42,83.91,176.9,408.23,Single-ply,SBD,M
Boys,74.84,6,Elijah Moser,Anson,73.84,151.95,83.91,172.37,408.23,Single-ply,SBD,M
Boys,74.84,7,Brandon Gassiot,Tuscola Jim Ned,67.22,145.15,88.45,172.37,405.97,Single-ply,SBD,M
Boys,74.84,8,Marcus Garner,Abilene Cooper,73.12,151.95,86.18,165.56,403.7,Single-ply,SBD,M
Boys,74.84,9,Rhett Payne,Tuscola Jim Ned,68.4,138.35,81.65,142.88,362.87,Single-ply,SBD,M
Boys,74.84,10,George Fassett,Sweetwater,69.13,136.08,68.04,142.88,347,Single-ply,SBD,M
Boys,74.84,11,Trey Starr,Abilene,68.49,136.08,79.38,124.74,340.19,Single-ply,SBD,M
Boys,74.84,DQ,Dillon McCoy,Tuscola Jim Ned,72.39,136.08,,,,Single-ply,SBD,M
Boys,82.1,1,Ethan Tapia,Clyde,81.19,204.12,138.35,192.78,535.24,Single-ply,SBD,M
Boys,82.1,2,Donovan Gomez,Clyde,81.28,206.38,113.4,197.31,517.1,Single-ply,SBD,M
Boys,82.1,3,Gabriel Salazar,Sweetwater,76.57,181.44,102.06,204.12,487.61,Single-ply,SBD,M
Boys,82.1,4,Chase Brooks,Abilene Cooper,78.7,174.63,108.86,174.63,458.13,Single-ply,SBD,M
Boys,82.1,5,Donte Mitchell,Abilene Cooper,81.56,170.1,104.33,158.76,433.18,Single-ply,SBD,M
Boys,82.1,6,Casey Hall,Tuscola Jim Ned,77.29,156.49,95.25,176.9,428.64,Single-ply,SBD,M
Boys,82.1,7,Chris Reeves,Merkel,78.56,163.29,92.99,154.22,410.5,Single-ply,SBD,M
Boys,82.1,8,Antwan Louis,Abilene Cooper,77.84,161.03,74.84,170.1,405.97,Single-ply,SBD,M
Boys,82.1,9,Preston Freeman,Tuscola Jim Ned,80.74,145.15,90.72,149.69,385.55,Single-ply,SBD,M
Boys,82.1,10,Tavian Bonds,Abilene Cooper,80.47,136.08,90.72,151.95,378.75,Single-ply,SBD,M
Boys,82.1,11,Juan Torres,Abilene,77.29,142.88,86.18,147.42,376.48,Single-ply,SBD,M
Boys,82.1,12,John Wheeler,Tuscola Jim Ned,82.01,142.88,90.72,142.88,376.48,Single-ply,SBD,M
Boys,82.1,13,Noah Flowers,Abilene Cooper,81.74,140.61,79.38,154.22,374.21,Single-ply,SBD,M
Boys,82.1,14,Willie Ellis,Abilene,80.2,145.15,79.38,142.88,367.41,Single-ply,SBD,M
Boys,82.1,DQ,Jacob Dearing,Merkel,81.1,142.88,79.38,,,Single-ply,SBD,M
Boys,82.1,DQ,Nick Powell,Abilene Cooper,79.83,151.95,,,,Single-ply,SBD,M
Boys,89.81,1,Matt Holmes,Merkel,86,242.67,154.22,233.6,630.49,Single-ply,SBD,M
Boys,89.81,2,Actavias Lowry,Abilene Cooper,83.91,190.51,129.27,190.51,510.29,Single-ply,SBD,M
Boys,89.81,3,Eduardo Marin,Anson,82.55,188.24,102.06,174.63,464.93,Single-ply,SBD,M
Boys,89.81,4,Morgan Porter,Clyde,85.55,183.7,97.52,167.83,449.06,Single-ply,SBD,M
Boys,89.81,5,Xavier Rodriguez,Anson,83.64,156.49,79.38,151.95,387.82,Single-ply,SBD,M
Boys,89.81,6,Jacob Hutton,Abilene,88.18,158.76,86.18,142.88,387.82,Single-ply,SBD,M
Boys,89.81,DQ,Evan Andrews,Merkel,89.54,158.76,,,,Single-ply,SBD,M
Boys,89.81,DQ,Kanen Herd,Merkel,84.91,,,,,Single-ply,SBD,M
Boys,89.81,DQ,Adriel Perez,Merkel,89.45,163.29,81.65,,,Single-ply,SBD,M
Boys,89.81,DQ,Devin Romero,Abilene,84.64,240.4,117.93,,,Single-ply,SBD,M
Boys,99.79,1,Braden Kesler,Tuscola Jim Ned,96.16,206.38,113.4,254.01,573.79,Single-ply,SBD,M
Boys,99.79,2,Jacob Collier,Cross Plains,99.43,204.12,124.74,190.51,519.36,Single-ply,SBD,M
Boys,99.79,3,Brandon Romero,Abilene Cooper,94.17,199.58,108.86,181.44,489.88,Single-ply,SBD,M
Boys,99.79,4,Jacob Turner,Tuscola Jim Ned,93.8,174.63,97.52,210.92,483.08,Single-ply,SBD,M
Boys,99.79,5,Tye Landeros,Tuscola Jim Ned,98.34,204.12,113.4,158.76,476.27,Single-ply,SBD,M
Boys,99.79,6,Jaxon Smith,Abilene,93.17,192.78,97.52,181.44,471.74,Single-ply,SBD,M
Boys,99.79,7,Mateo Valero,Abilene Cooper,97.79,181.44,95.25,174.63,451.32,Single-ply,SBD,M
Boys,99.79,8,Colby Ernst,Abilene,94.98,174.63,97.52,158.76,430.91,Single-ply,SBD,M
Boys,99.79,9,Roy Courtney,Abilene,92.62,172.37,92.99,151.95,417.3,Single-ply,SBD,M
Boys,99.79,10,Cooper Graham,Anson,95.89,154.22,72.57,165.56,392.36,Single-ply,SBD,M
Boys,99.79,11,Kolby Griffin,Anson,95.35,142.88,77.11,158.76,378.75,Single-ply,SBD,M
Boys,99.79,12,Donnie Brookes,Merkel,93.98,145.15,97.52,111.13,353.8,Single-ply,SBD,M
Boys,99.79,13,Josh Diaz,San Angelo Central,91.72,97.52,79.38,124.74,301.64,Single-ply,SBD,M
Boys,109.77,1,Brandon Padilla,Anson,103.96,235.87,133.81,226.8,596.47,Single-ply,SBD,M
Boys,109.77,2,Raymond Delgado,Sweetwater,101.6,195.04,142.88,199.58,537.51,Single-ply,SBD,M
Boys,109.77,3,Zack Thompson,Abilene,102.87,204.12,127.01,183.7,514.83,Single-ply,SBD,M
Boys,109.77,4,Israel DelaCruz,Anson,108.32,204.12,115.67,179.17,498.95,Single-ply,SBD,M
Boys,109.77,5,Brian Palacios,Abilene,105.14,213.19,104.33,179.17,496.68,Single-ply,SBD,M
Boys,109.77,6,Austin Schoonmaker,Clyde,101.7,185.97,115.67,185.97,487.61,Single-ply,SBD,M
Boys,109.77,7,Tim Balderas,Abilene Cooper,104.96,167.83,129.27,183.7,480.81,Single-ply,SBD,M
Boys,109.77,8,Luis Barrientes,Abilene,108,183.7,111.13,174.63,469.47,Single-ply,SBD,M
Boys,109.77,9,Lucio Ramirez,Abilene,103.51,176.9,102.06,163.29,442.25,Single-ply,SBD,M
Boys,109.77,10,Eddie Hernandez,Anson,107.86,174.63,86.18,174.63,435.45,Single-ply,SBD,M
Boys,109.77,11,Gavin Reyes,Sweetwater,104.96,136.08,90.72,163.29,390.09,Single-ply,SBD,M
Boys,109.77,DQ,Derick Palacios,Sweetwater,103.96,,,,,Single-ply,SBD,M
Boys,109.77,DQ,Hunter Stelly,San Angelo Central,108.77,199.58,127.01,,,Single-ply,SBD,M
Boys,109.77,DQ,Josh Elliott,Abilene Cooper,106.23,,,,,Single-ply,SBD,M
Boys,109.77,DQ,Triston Patterson,Tuscola Jim Ned,105.32,163.29,,,,Single-ply,SBD,M
Boys,109.77,DQ,Taylor Cullum,Merkel,107.59,172.37,,,,Single-ply,SBD,M
Boys,124.74,1,Carlos Gallegos,Sweetwater,116.66,217.72,124.74,204.12,546.58,Single-ply,SBD,M
Boys,124.74,2,Miguel Valdez,Clyde,115.39,197.31,136.08,190.51,523.9,Single-ply,SBD,M
Boys,124.74,3,Collin Gardner,Anson,114.67,195.04,111.13,170.1,476.27,Single-ply,SBD,M
Boys,124.74,4,David Schuman,Merkel,110.68,181.44,111.13,174.63,467.2,Single-ply,SBD,M
Boys,124.74,5,CJ Ugalde,Merkel,117.21,172.37,117.93,158.76,449.06,Single-ply,SBD,M
Boys,124.74,6,Caleb McVey,Abilene Cooper,122.2,165.56,102.06,151.95,419.57,Single-ply,SBD,M
Boys,124.74,7,Javier Santana,Abilene,111.81,154.22,74.84,142.88,371.95,Single-ply,SBD,M
Boys,124.74,8,Khalil Spivey,Abilene,116.39,142.88,74.84,149.69,367.41,Single-ply,SBD,M
Boys,124.74,9,Cole Pendleton,Tuscola Jim Ned,111.31,133.81,81.65,142.88,358.34,Single-ply,SBD,M
Boys,124.74+,1,Cedric Smith,San Angelo Central,132.81,265.35,138.35,244.94,648.64,Single-ply,SBD,M
Boys,124.74+,2,Malik Smith,San Angelo Central,127.46,213.19,138.35,206.38,557.92,Single-ply,SBD,M
Boys,124.74+,3,Jeremiah Barrera,Sweetwater,131.63,231.33,108.86,215.46,555.65,Single-ply,SBD,M
Boys,124.74+,4,Jackson Sellers,Abilene,133.81,226.8,124.74,183.7,535.24,Single-ply,SBD,M
Boys,124.74+,5,Quadryll Ramirez,Abilene,155.13,208.65,127.01,195.04,530.7,Single-ply,SBD,M
Boys,124.74+,6,Jarrett Hill,San Angelo Central,130.82,206.38,106.59,192.78,505.76,Single-ply,SBD,M
Boys,124.74+,7,Ricardo Rios,Abilene Cooper,134.72,181.44,102.06,181.44,464.93,Single-ply,SBD,M
Boys,124.74+,8,Devon Cosby,Abilene Cooper,130,172.37,97.52,181.44,451.32,Single-ply,SBD,M
Boys,124.74+,9,Johnathan Presley,Abilene Cooper,138.35,156.49,83.91,136.08,376.48,Single-ply,SBD,M
Boys,124.74+,DQ,Chris De La Garza,Clyde,146.33,,,,,Single-ply,SBD,M
Boys,124.74+,DQ,Donnie Bowers,San Angelo Central,124.92,,,,,Single-ply,SBD,M
Boys,,NS,Braden Sigler,Merkel,,,,,,Single-ply,SBD,M
Boys,,NS,Nick Massey,Merkel,,,,,,Single-ply,SBD,M
Boys,,NS,Jayton Wells,Anson,,,,,,Single-ply,SBD,M
Boys,,NS,Xavier Graves,Abilene,,,,,,Single-ply,SBD,M
Boys,,NS,Azekiel Raya,Abilene Cooper,,,,,,Single-ply,SBD,M
Boys,,NS,Colton Rich,San Angelo Central,,,,,,Single-ply,SBD,M
Boys,,NS,Omar Duarte,San Angelo Central,,,,,,Single-ply,SBD,M
Boys,,NS,Dereck Duclos,Sweetwater,,,,,,Single-ply,SBD,M
Boys,,NS,Tyler Phipps,Sweetwater,,,,,,Single-ply,SBD,M
Boys,,NS,Kade Heatherly,Abilene Cooper,,,,,,Single-ply,SBD,M
