EESchema Schematic File Version 4
LIBS:Condome-cache
EELAYER 26 0
EELAYER END
$Descr A4 11693 8268
encoding utf-8
Sheet 1 1
Title ""
Date ""
Rev ""
Comp ""
Comment1 ""
Comment2 ""
Comment3 ""
Comment4 ""
$EndDescr
$Comp
L Connector:USB_A J1
U 1 1 5C81567D
P 4200 1600
F 0 "J1" H 4000 2050 50  0000 L CNN
F 1 "USB_A_MALE" H 4000 1950 50  0000 L CNN
F 2 "digikey-footprints:USB_Male_A_UP2-AH-1-TH" H 4350 1550 50  0001 C CNN
F 3 "" H 4350 1550 50  0001 C CNN
	1    4200 1600
	1    0    0    -1  
$EndComp
$Comp
L Connector:USB_A J2
U 1 1 5C8156E1
P 8050 1600
F 0 "J2" H 7850 2050 50  0000 L CNN
F 1 "USB_A_FEMALE" H 7850 1950 50  0000 L CNN
F 2 "digikey-footprints:USB_A_Female_UE27AC54100" H 8200 1550 50  0001 C CNN
F 3 "" H 8200 1550 50  0001 C CNN
	1    8050 1600
	-1   0    0    -1  
$EndComp
$Comp
L Condome-rescue:LM358-Condome-rescue U1
U 1 1 5C8160FD
P 7100 2700
F 0 "U1" H 7100 2900 50  0000 L CNN
F 1 "LM358" H 7100 2500 50  0000 L CNN
F 2 "Package_SO:SOIC-8_3.9x4.9mm_P1.27mm" H 7100 2700 50  0001 C CNN
F 3 "" H 7100 2700 50  0001 C CNN
	1    7100 2700
	1    0    0    -1  
$EndComp
$Comp
L Device:R R1
U 1 1 5C8163F7
P 6000 2600
F 0 "R1" V 6080 2600 50  0000 C CNN
F 1 "10k" V 6000 2600 50  0000 C CNN
F 2 "Resistor_SMD:R_1206_3216Metric" V 5930 2600 50  0001 C CNN
F 3 "" H 6000 2600 50  0001 C CNN
	1    6000 2600
	0    1    1    0   
$EndComp
$Comp
L Device:R R2
U 1 1 5C8164E5
P 6500 2850
F 0 "R2" V 6580 2850 50  0000 C CNN
F 1 "100k" V 6500 2850 50  0000 C CNN
F 2 "Resistor_SMD:R_1206_3216Metric" V 6430 2850 50  0001 C CNN
F 3 "" H 6500 2850 50  0001 C CNN
	1    6500 2850
	1    0    0    -1  
$EndComp
$Comp
L Device:R R4
U 1 1 5C81659A
P 7550 3550
F 0 "R4" V 7630 3550 50  0000 C CNN
F 1 "1k" V 7550 3550 50  0000 C CNN
F 2 "Resistor_SMD:R_1206_3216Metric" V 7480 3550 50  0001 C CNN
F 3 "" H 7550 3550 50  0001 C CNN
	1    7550 3550
	1    0    0    -1  
$EndComp
$Comp
L Device:R R3
U 1 1 5C816688
P 7550 3050
F 0 "R3" V 7630 3050 50  0000 C CNN
F 1 "67k" V 7550 3050 50  0000 C CNN
F 2 "Resistor_SMD:R_1206_3216Metric" V 7480 3050 50  0001 C CNN
F 3 "" H 7550 3050 50  0001 C CNN
	1    7550 3050
	1    0    0    -1  
$EndComp
$Comp
L Device:R R5
U 1 1 5C8166C7
P 7850 3050
F 0 "R5" V 7930 3050 50  0000 C CNN
F 1 "300" V 7850 3050 50  0000 C CNN
F 2 "Resistor_SMD:R_1206_3216Metric" V 7780 3050 50  0001 C CNN
F 3 "" H 7850 3050 50  0001 C CNN
	1    7850 3050
	1    0    0    -1  
$EndComp
$Comp
L Device:D D1
U 1 1 5C81699A
P 4850 2600
F 0 "D1" H 4850 2700 50  0000 C CNN
F 1 "1n445" H 4850 2500 50  0000 C CNN
F 2 "Diode_SMD:D_MiniMELF" H 4850 2600 50  0001 C CNN
F 3 "" H 4850 2600 50  0001 C CNN
	1    4850 2600
	-1   0    0    1   
$EndComp
$Comp
L Device:LED D2
U 1 1 5C816C63
P 7850 3550
F 0 "D2" H 7850 3650 50  0000 C CNN
F 1 "LED" H 7850 3450 50  0000 C CNN
F 2 "LED_SMD:LED_1206_3216Metric" H 7850 3550 50  0001 C CNN
F 3 "" H 7850 3550 50  0001 C CNN
	1    7850 3550
	0    -1   -1   0   
$EndComp
$Comp
L Device:C C1
U 1 1 5C816E7A
P 6250 2850
F 0 "C1" H 6275 2950 50  0000 L CNN
F 1 "1n" H 6275 2750 50  0000 L CNN
F 2 "Capacitor_SMD:C_1206_3216Metric" H 6288 2700 50  0001 C CNN
F 3 "" H 6250 2850 50  0001 C CNN
	1    6250 2850
	1    0    0    -1  
$EndComp
$Comp
L Condome-rescue:SW_DPDT_x2-Condome-rescue SW1
U 1 1 5C817275
P 5200 1350
F 0 "SW1" H 5200 1520 50  0000 C CNN
F 1 "SW_DPDT_x2" H 5200 1600 50  0000 C CNN
F 2 "foots:sk22d02" H 5200 1350 50  0001 C CNN
F 3 "" H 5200 1350 50  0001 C CNN
	1    5200 1350
	-1   0    0    1   
$EndComp
$Comp
L Switch:SW_DPDT_x2 SW1
U 2 1 5C817501
P 5200 1850
F 0 "SW1" H 5200 2020 50  0000 C CNN
F 1 "SW_DPDT_x2" H 5200 2100 50  0000 C CNN
F 2 "foots:sk22d02" H 5200 1850 50  0001 C CNN
F 3 "" H 5200 1850 50  0001 C CNN
	2    5200 1850
	-1   0    0    1   
$EndComp
Wire Wire Line
	4500 1400 4650 1400
Wire Wire Line
	7750 1400 7600 1400
Text GLabel 4650 1400 2    60   BiDi ~ 0
V5
Text GLabel 7600 1400 0    60   BiDi ~ 0
V5
Wire Wire Line
	4500 1600 4900 1600
Text GLabel 5500 1350 2    60   BiDi ~ 0
D+
Text GLabel 5500 1850 2    60   BiDi ~ 0
D-
Wire Wire Line
	7750 1600 7600 1600
Wire Wire Line
	7750 1700 7600 1700
Text GLabel 7600 1600 0    60   BiDi ~ 0
D+
Text GLabel 7600 1700 0    60   BiDi ~ 0
D-
$Comp
L power:GNDD #PWR01
U 1 1 5C825F6B
P 8050 2200
F 0 "#PWR01" H 8050 1950 50  0001 C CNN
F 1 "GNDD" H 8050 2075 50  0000 C CNN
F 2 "" H 8050 2200 50  0001 C CNN
F 3 "" H 8050 2200 50  0001 C CNN
	1    8050 2200
	1    0    0    -1  
$EndComp
$Comp
L power:GNDD #PWR02
U 1 1 5C826351
P 4200 2200
F 0 "#PWR02" H 4200 1950 50  0001 C CNN
F 1 "GNDD" H 4200 2075 50  0000 C CNN
F 2 "" H 4200 2200 50  0001 C CNN
F 3 "" H 4200 2200 50  0001 C CNN
	1    4200 2200
	1    0    0    -1  
$EndComp
Wire Wire Line
	8050 2000 8050 2100
Wire Wire Line
	4200 2000 4200 2100
Wire Wire Line
	4700 2600 4600 2600
Text GLabel 4600 2600 0    60   BiDi ~ 0
D-
$Comp
L power:GNDD #PWR03
U 1 1 5C82EEF5
P 7850 3800
F 0 "#PWR03" H 7850 3550 50  0001 C CNN
F 1 "GNDD" H 7850 3675 50  0000 C CNN
F 2 "" H 7850 3800 50  0001 C CNN
F 3 "" H 7850 3800 50  0001 C CNN
	1    7850 3800
	1    0    0    -1  
$EndComp
$Comp
L power:GNDD #PWR04
U 1 1 5C82F088
P 7550 3800
F 0 "#PWR04" H 7550 3550 50  0001 C CNN
F 1 "GNDD" H 7550 3675 50  0000 C CNN
F 2 "" H 7550 3800 50  0001 C CNN
F 3 "" H 7550 3800 50  0001 C CNN
	1    7550 3800
	1    0    0    -1  
$EndComp
$Comp
L power:GNDD #PWR05
U 1 1 5C82F5C1
P 6500 3100
F 0 "#PWR05" H 6500 2850 50  0001 C CNN
F 1 "GNDD" H 6500 2975 50  0000 C CNN
F 2 "" H 6500 3100 50  0001 C CNN
F 3 "" H 6500 3100 50  0001 C CNN
	1    6500 3100
	1    0    0    -1  
$EndComp
$Comp
L power:GNDD #PWR06
U 1 1 5C82F63C
P 6250 3100
F 0 "#PWR06" H 6250 2850 50  0001 C CNN
F 1 "GNDD" H 6250 2975 50  0000 C CNN
F 2 "" H 6250 3100 50  0001 C CNN
F 3 "" H 6250 3100 50  0001 C CNN
	1    6250 3100
	1    0    0    -1  
$EndComp
$Comp
L power:GNDD #PWR07
U 1 1 5C82F815
P 7000 3050
F 0 "#PWR07" H 7000 2800 50  0001 C CNN
F 1 "GNDD" H 7000 2925 50  0000 C CNN
F 2 "" H 7000 3050 50  0001 C CNN
F 3 "" H 7000 3050 50  0001 C CNN
	1    7000 3050
	1    0    0    -1  
$EndComp
Wire Wire Line
	8150 2000 8150 2100
Wire Wire Line
	8150 2100 8050 2100
Connection ~ 8050 2100
Wire Wire Line
	4100 2000 4100 2100
Wire Wire Line
	4100 2100 4200 2100
Connection ~ 4200 2100
Wire Wire Line
	6150 2600 6250 2600
Wire Wire Line
	6500 2700 6500 2600
Connection ~ 6500 2600
Wire Wire Line
	6250 2700 6250 2600
Connection ~ 6250 2600
Wire Wire Line
	5850 2600 5550 2600
Wire Wire Line
	6250 3000 6250 3100
Wire Wire Line
	6500 3000 6500 3100
Wire Wire Line
	7400 2700 7550 2700
Wire Wire Line
	7000 3000 7000 3050
Wire Wire Line
	7850 2700 7850 2900
Wire Wire Line
	7550 2900 7550 2700
Connection ~ 7550 2700
Wire Wire Line
	7550 3400 7550 3300
Wire Wire Line
	7850 3400 7850 3200
Wire Wire Line
	7850 3800 7850 3700
Wire Wire Line
	7550 3800 7550 3700
Wire Wire Line
	7550 3300 6700 3300
Connection ~ 7550 3300
Wire Wire Line
	6700 3300 6700 2800
Wire Wire Line
	6700 2800 6800 2800
Text GLabel 7000 2300 1    60   BiDi ~ 0
V5
Wire Wire Line
	7000 2400 7000 2300
Text GLabel 2450 950  1    60   BiDi ~ 0
V5
$Comp
L power:GNDD #PWR08
U 1 1 5C83E859
P 2450 1350
F 0 "#PWR08" H 2450 1100 50  0001 C CNN
F 1 "GNDD" H 2450 1225 50  0000 C CNN
F 2 "" H 2450 1350 50  0001 C CNN
F 3 "" H 2450 1350 50  0001 C CNN
	1    2450 1350
	1    0    0    -1  
$EndComp
$Comp
L power:PWR_FLAG #FLG09
U 1 1 5C840B57
P 2450 1350
F 0 "#FLG09" H 2450 1425 50  0001 C CNN
F 1 "PWR_FLAG" H 2450 1500 50  0000 C CNN
F 2 "" H 2450 1350 50  0001 C CNN
F 3 "" H 2450 1350 50  0001 C CNN
	1    2450 1350
	1    0    0    -1  
$EndComp
$Comp
L power:PWR_FLAG #FLG010
U 1 1 5C840E25
P 2450 950
F 0 "#FLG010" H 2450 1025 50  0001 C CNN
F 1 "PWR_FLAG" H 2450 1100 50  0000 C CNN
F 2 "" H 2450 950 50  0001 C CNN
F 3 "" H 2450 950 50  0001 C CNN
	1    2450 950 
	-1   0    0    1   
$EndComp
Wire Wire Line
	8050 2100 8050 2200
Wire Wire Line
	4200 2100 4200 2200
Wire Wire Line
	6500 2600 6800 2600
Wire Wire Line
	6250 2600 6500 2600
Wire Wire Line
	7550 2700 7850 2700
Wire Wire Line
	7550 3300 7550 3200
Wire Wire Line
	4900 1600 4900 1450
Wire Wire Line
	4900 1450 5000 1450
Wire Wire Line
	4500 1700 4900 1700
Wire Wire Line
	4900 1700 4900 1950
Wire Wire Line
	4900 1950 5000 1950
Wire Wire Line
	5400 1350 5500 1350
Wire Wire Line
	5400 1850 5500 1850
Text Label 4600 1600 0    50   ~ 0
MD+
Text Label 4600 1700 0    50   ~ 0
MD-
$Comp
L Device:R R7
U 1 1 5C9977AF
P 6100 1450
F 0 "R7" V 6180 1450 50  0000 C CNN
F 1 "13k" V 6100 1450 50  0000 C CNN
F 2 "Resistor_SMD:R_1206_3216Metric" V 6030 1450 50  0001 C CNN
F 3 "" H 6100 1450 50  0001 C CNN
	1    6100 1450
	-1   0    0    1   
$EndComp
$Comp
L Device:R R6
U 1 1 5C997839
P 6100 1050
F 0 "R6" V 6180 1050 50  0000 C CNN
F 1 "39k" V 6100 1050 50  0000 C CNN
F 2 "Resistor_SMD:R_1206_3216Metric" V 6030 1050 50  0001 C CNN
F 3 "" H 6100 1050 50  0001 C CNN
	1    6100 1050
	-1   0    0    1   
$EndComp
$Comp
L Condome-rescue:R-Condome-rescue R8
U 1 1 5C997875
P 6100 1850
F 0 "R8" V 6180 1850 50  0000 C CNN
F 1 "33k" V 6100 1850 50  0000 C CNN
F 2 "Resistor_SMD:R_1206_3216Metric" V 6030 1850 50  0001 C CNN
F 3 "" H 6100 1850 50  0001 C CNN
	1    6100 1850
	-1   0    0    1   
$EndComp
$Comp
L power:GNDD #PWR09
U 1 1 5C9978C9
P 6100 2100
F 0 "#PWR09" H 6100 1850 50  0001 C CNN
F 1 "GNDD" H 6100 1975 50  0000 C CNN
F 2 "" H 6100 2100 50  0001 C CNN
F 3 "" H 6100 2100 50  0001 C CNN
	1    6100 2100
	1    0    0    -1  
$EndComp
Text GLabel 6100 800  1    60   BiDi ~ 0
V5
Wire Wire Line
	6100 800  6100 900 
Wire Wire Line
	6100 1200 6100 1250
Wire Wire Line
	6100 1600 6100 1650
Wire Wire Line
	6100 2000 6100 2100
Wire Wire Line
	6100 1250 5500 1250
Wire Wire Line
	4900 1250 5000 1250
Connection ~ 6100 1250
Wire Wire Line
	6100 1250 6100 1300
Wire Wire Line
	6100 1650 4950 1650
Wire Wire Line
	4950 1650 4950 1750
Wire Wire Line
	4950 1750 5000 1750
Connection ~ 6100 1650
Wire Wire Line
	6100 1650 6100 1700
Wire Wire Line
	4900 1250 4900 1150
Wire Wire Line
	4900 1150 5500 1150
Wire Wire Line
	5500 1150 5500 1250
Text Notes 7250 7100 0    394  ~ 0
USB_C0nd0m
Text Notes 10700 7650 0    79   ~ 0
2.2
Text Notes 6200 1050 0    50   ~ 0
R7 can be 150-200 for USB BC 1.2\nWoks on android\nFor apple use this values (works)
Text Notes 6000 3450 0    50   ~ 0
R2 may be 56k, works well
Text Notes 8000 3150 0    50   ~ 0
R5 calculated for you LED\nabout 150-200 for bright LEDs\nabout 250-500 for standart LEDs
$Comp
L Device:C C2
U 1 1 5D9CF1AE
P 5400 2600
F 0 "C2" H 5425 2700 50  0000 L CNN
F 1 "1u" H 5425 2500 50  0000 L CNN
F 2 "Capacitor_SMD:C_1206_3216Metric" H 5438 2450 50  0001 C CNN
F 3 "" H 5400 2600 50  0001 C CNN
	1    5400 2600
	0    -1   -1   0   
$EndComp
Wire Wire Line
	5250 2600 5000 2600
Text Notes 4950 3100 0    50   ~ 0
v2.3 addded\nDisabling constant\nlight and makes\nLED blinks on level D- change
$Comp
L Device:D D3
U 1 1 5DA628DA
P 9450 1400
F 0 "D3" H 9450 1500 50  0000 C CNN
F 1 "1n445" H 9450 1300 50  0000 C CNN
F 2 "Diode_SMD:D_MiniMELF" H 9450 1400 50  0001 C CNN
F 3 "" H 9450 1400 50  0001 C CNN
	1    9450 1400
	0    1    1    0   
$EndComp
$Comp
L Device:D D4
U 1 1 5DA65863
P 9750 1400
F 0 "D4" H 9750 1500 50  0000 C CNN
F 1 "1n445" H 9750 1300 50  0000 C CNN
F 2 "Diode_SMD:D_MiniMELF" H 9750 1400 50  0001 C CNN
F 3 "" H 9750 1400 50  0001 C CNN
	1    9750 1400
	0    1    1    0   
$EndComp
Wire Wire Line
	9450 1250 9450 1050
Wire Wire Line
	9750 1250 9750 1050
$Comp
L power:GNDD #PWR0101
U 1 1 5DA67897
P 9600 1750
F 0 "#PWR0101" H 9600 1500 50  0001 C CNN
F 1 "GNDD" H 9600 1625 50  0000 C CNN
F 2 "" H 9600 1750 50  0001 C CNN
F 3 "" H 9600 1750 50  0001 C CNN
	1    9600 1750
	1    0    0    -1  
$EndComp
Wire Wire Line
	9450 1550 9450 1650
Wire Wire Line
	9750 1550 9750 1650
Wire Wire Line
	9450 1650 9600 1650
Wire Wire Line
	9600 1650 9600 1750
Connection ~ 9600 1650
Wire Wire Line
	9600 1650 9750 1650
Text GLabel 9450 1050 0    60   BiDi ~ 0
D+
Text GLabel 9750 1050 2    60   BiDi ~ 0
D-
Text Notes 8600 2000 0    50   ~ 0
Simple USB_killer defence, tested on 200v charge, diodes is OK!
$EndSCHEMATC
