[
  {
    "title": "producto prueba1",
    "description": "Este es un producto prueba1",
    "price": 200,
    "thumbnail": "Sin imagen1",
    "code": "abc1234",
    "stock": 25,
    "id": 1
  },
  {
    "title": "producto prueba2",
    "description": "Este es un producto prueba2",
    "price": 200,
    "thumbnail": "Sin imagen2",
    "code": "abc12345",
    "stock": 25,
    "id": 2
  },
  {
    "title": "producto prueba2",
    "description": "Este es un producto prueba3",
    "price": 200,
    "thumbnail": "Sin imagen2",
    "code": "abc123451",
    "stock": 25,
    "id": 3
  },
  {
    "title": "producto prueba2",
    "description": "Este es un producto prueba4",
    "price": 200,
    "thumbnail": "Sin imagen2",
    "code": "abc123452",
    "stock": 25,
    "id": 4
  },
  {
    "title": "producto prueba2",
    "description": "Este es un producto prueba5",
    "price": 200,
    "thumbnail": "Sin imagen2",
    "code": "abc123454",
    "stock": 25,
    "id": 5
  }
]