<svg xmlns="http://www.w3.org/2000/svg"
     xmlns:xlink="http://www.w3.org/1999/xlink"
     viewBox="0 0 1000 1000">
  <rect x="25" y="25" width="950" height="950" rx="50" ry="50" fill="white" stroke="rgb(38, 64, 64)" stroke-width="50" />

  <g transform="translate(0 30)">
    <path d="M145 205 l0 515 q177.5 -60 355 0 q177.5 -60 355 0 l0 -515" fill="none" stroke="rgb(38, 64, 64)" stroke-width="50" stroke-linecap="round" />
    <ellipse cx="500" cy="720" rx="90" ry="30" fill="rgb(38, 64, 64)" />

    <path d="M150 190 q175 -60 350 0 q175 -60 350 0 l0 500 q-175 -60 -350 0 q-175 -60 -350 0 Z" stroke="rgb(38, 64, 64)" fill="white" stroke-width="25" />

    <path d="M200 290 q125 -40 250 0" fill="none" stroke="rgb(38, 64, 64)" stroke-width="25" stroke-linecap="round" />
    <path d="M200 390 q125 -40 250 0" fill="none" stroke="rgb(38, 64, 64)" stroke-width="25" stroke-linecap="round" />
    <path d="M200 490 q125 -40 250 0" fill="none" stroke="rgb(38, 64, 64)" stroke-width="25" stroke-linecap="round" />
    <path d="M200 590 q125 -40 250 0" fill="none" stroke="rgb(38, 64, 64)" stroke-width="25" stroke-linecap="round" />

    <path d="M550 290 q125 -40 250 0" fill="none" stroke="rgb(38, 64, 64)" stroke-width="25" stroke-linecap="round" />
    <path d="M550 390 q125 -40 250 0" fill="none" stroke="rgb(38, 64, 64)" stroke-width="25" stroke-linecap="round" />
    <path d="M550 490 q125 -40 250 0" fill="none" stroke="rgb(38, 64, 64)" stroke-width="25" stroke-linecap="round" />
    <path d="M550 590 q125 -40 250 0" fill="none" stroke="rgb(38, 64, 64)" stroke-width="25" stroke-linecap="round" />
  </g>
</svg>
