<?xml version="1.0" encoding="UTF-8" standalone="no"?>
<!DOCTYPE svg PUBLIC "-//W3C//DTD SVG 1.0//EN" "http://www.w3.org/TR/2001/PR-SVG-20010719/DTD/svg10.dtd">
<svg width="34cm" height="17cm" viewBox="167 98 674 321" xmlns="http://www.w3.org/2000/svg" xmlns:xlink="http://www.w3.org/1999/xlink">
  <g id="Hintergrund">
    <g>
      <rect style="fill: #d5e8d4; fill-opacity: 1; stroke-opacity: 1; stroke-width: 2; stroke: #000000" x="172.1" y="99.6" width="409" height="75" rx="0" ry="0"/>
      <text font-size="14.1111" style="fill: #000000; fill-opacity: 1; stroke: none;text-anchor:middle;font-family:sans-serif;font-style:normal;font-weight:normal" x="376.6" y="141.379">
        <tspan x="376.6" y="141.379">externe Ebene</tspan>
      </text>
    </g>
    <g>
      <rect style="fill: #dae8fc; fill-opacity: 1; stroke-opacity: 1; stroke-width: 2; stroke: #000000" x="169" y="221.2" width="413" height="75" rx="0" ry="0"/>
      <text font-size="14.1111" style="fill: #000000; fill-opacity: 1; stroke: none;text-anchor:middle;font-family:sans-serif;font-style:normal;font-weight:normal" x="375.5" y="262.979">
        <tspan x="375.5" y="262.979">konzeptionelle Ebene</tspan>
      </text>
    </g>
    <g>
      <rect style="fill: #eeeeee; fill-opacity: 1; stroke-opacity: 1; stroke-width: 2; stroke: #000000" x="168.9" y="342.8" width="413" height="75" rx="0" ry="0"/>
      <text font-size="14.1111" style="fill: #000000; fill-opacity: 1; stroke: none;text-anchor:middle;font-family:sans-serif;font-style:normal;font-weight:normal" x="375.4" y="384.579">
        <tspan x="375.4" y="384.579">interne Ebene</tspan>
      </text>
    </g>
    <text font-size="12.8" style="fill: #000000; fill-opacity: 1; stroke: none;text-anchor:start;font-family:sans-serif;font-style:normal;font-weight:normal" x="376.6" y="137.1">
      <tspan x="376.6" y="137.1"></tspan>
    </text>
    <text font-size="12.8" style="fill: #000000; fill-opacity: 1; stroke: none;text-anchor:start;font-family:sans-serif;font-style:normal;font-weight:normal" x="648.1" y="135.6">
      <tspan x="648.1" y="135.6"></tspan>
    </text>
    <text font-size="12.8" style="fill: #000000; fill-opacity: 1; stroke: none;text-anchor:start;font-family:sans-serif;font-style:normal;font-weight:normal" x="606.1" y="126.6">
      <tspan x="606.1" y="126.6"></tspan>
    </text>
    <text font-size="12.8" style="fill: #000000; fill-opacity: 1; stroke: none;text-anchor:start;font-family:sans-serif;font-style:normal;font-weight:normal" x="375.5" y="258.7">
      <tspan x="375.5" y="258.7"></tspan>
    </text>
    <text font-size="12.8" style="fill: #000000; fill-opacity: 1; stroke: none;text-anchor:start;font-family:sans-serif;font-style:normal;font-weight:normal" x="376.6" y="137.1">
      <tspan x="376.6" y="137.1"></tspan>
    </text>
    <text font-size="12.8" style="fill: #000000; fill-opacity: 1; stroke: none;text-anchor:start;font-family:sans-serif;font-style:normal;font-weight:normal" x="817.1" y="143.6">
      <tspan x="817.1" y="143.6"></tspan>
    </text>
    <text font-size="12.8" style="fill: #000000; fill-opacity: 1; stroke: none;text-anchor:start;font-family:sans-serif;font-style:normal;font-weight:normal" x="610.1" y="259.6">
      <tspan x="610.1" y="259.6">Beziehungen und Daten</tspan>
    </text>
    <text font-size="12.8" style="fill: #000000; fill-opacity: 1; stroke: none;text-anchor:start;font-family:sans-serif;font-style:normal;font-weight:normal" x="375.5" y="258.7">
      <tspan x="375.5" y="258.7"></tspan>
    </text>
    <text font-size="12.8" style="fill: #000000; fill-opacity: 1; stroke: none;text-anchor:start;font-family:sans-serif;font-style:normal;font-weight:normal" x="375.5" y="258.7">
      <tspan x="375.5" y="258.7"></tspan>
    </text>
    <text font-size="12.8" style="fill: #000000; fill-opacity: 1; stroke: none;text-anchor:start;font-family:sans-serif;font-style:normal;font-weight:normal" x="375.5" y="258.7">
      <tspan x="375.5" y="258.7"></tspan>
    </text>
    <text font-size="12.8" style="fill: #000000; fill-opacity: 1; stroke: none;text-anchor:start;font-family:sans-serif;font-style:normal;font-weight:normal" x="375.5" y="258.7">
      <tspan x="375.5" y="258.7"></tspan>
    </text>
    <text font-size="12.8" style="fill: #000000; fill-opacity: 1; stroke: none;text-anchor:start;font-family:sans-serif;font-style:normal;font-weight:normal" x="376.6" y="137.1">
      <tspan x="376.6" y="137.1"></tspan>
    </text>
    <text font-size="12.8" style="fill: #000000; fill-opacity: 1; stroke: none;text-anchor:start;font-family:sans-serif;font-style:normal;font-weight:normal" x="690.1" y="174.6">
      <tspan x="690.1" y="174.6"></tspan>
    </text>
    <text font-size="12.8" style="fill: #000000; fill-opacity: 1; stroke: none;text-anchor:start;font-family:sans-serif;font-style:normal;font-weight:normal" x="675.1" y="152.6">
      <tspan x="675.1" y="152.6"></tspan>
    </text>
    <text font-size="12.8" style="fill: #000000; fill-opacity: 1; stroke: none;text-anchor:start;font-family:sans-serif;font-style:normal;font-weight:normal" x="610.1" y="138.6">
      <tspan x="610.1" y="138.6">Benutzeroberflächen, Datensichten,</tspan>
      <tspan x="610.1" y="154.6">API und Schnittstellen</tspan>
    </text>
    <text font-size="12.8" style="fill: #000000; fill-opacity: 1; stroke: none;text-anchor:start;font-family:sans-serif;font-style:normal;font-weight:normal" x="376.6" y="137.1">
      <tspan x="376.6" y="137.1"></tspan>
    </text>
    <text font-size="12.8" style="fill: #000000; fill-opacity: 1; stroke: none;text-anchor:start;font-family:sans-serif;font-style:normal;font-weight:normal" x="376.6" y="137.1">
      <tspan x="376.6" y="137.1"></tspan>
    </text>
    <text font-size="12.8" style="fill: #000000; fill-opacity: 1; stroke: none;text-anchor:start;font-family:sans-serif;font-style:normal;font-weight:normal" x="612.1" y="379.6">
      <tspan x="612.1" y="379.6">Art und Form der Speicherung</tspan>
    </text>
    <text font-size="12.8" style="fill: #000000; fill-opacity: 1; stroke: none;text-anchor:start;font-family:sans-serif;font-style:normal;font-weight:normal" x="375.4" y="380.3">
      <tspan x="375.4" y="380.3"></tspan>
    </text>
    <text font-size="12.8" style="fill: #000000; fill-opacity: 1; stroke: none;text-anchor:start;font-family:sans-serif;font-style:normal;font-weight:normal" x="375.4" y="380.3">
      <tspan x="375.4" y="380.3"></tspan>
    </text>
    <text font-size="12.8" style="fill: #000000; fill-opacity: 1; stroke: none;text-anchor:start;font-family:sans-serif;font-style:normal;font-weight:normal" x="375.4" y="380.3">
      <tspan x="375.4" y="380.3"></tspan>
    </text>
    <text font-size="12.8" style="fill: #000000; fill-opacity: 1; stroke: none;text-anchor:start;font-family:sans-serif;font-style:normal;font-weight:normal" x="375.4" y="380.3">
      <tspan x="375.4" y="380.3"></tspan>
    </text>
    <text font-size="12.8" style="fill: #000000; fill-opacity: 1; stroke: none;text-anchor:start;font-family:sans-serif;font-style:normal;font-weight:normal" x="991.1" y="596.6">
      <tspan x="991.1" y="596.6"></tspan>
    </text>
    <text font-size="12.8" style="fill: #000000; fill-opacity: 1; stroke: none;text-anchor:start;font-family:sans-serif;font-style:normal;font-weight:normal" x="803.1" y="133.6">
      <tspan x="803.1" y="133.6"></tspan>
    </text>
  </g>
</svg>
