<?xml version="1.0" encoding="UTF-8" standalone="no"?>
<svg
   xmlns:dc="http://purl.org/dc/elements/1.1/"
   xmlns:cc="http://creativecommons.org/ns#"
   xmlns:rdf="http://www.w3.org/1999/02/22-rdf-syntax-ns#"
   xmlns:svg="http://www.w3.org/2000/svg"
   xmlns="http://www.w3.org/2000/svg"
   xmlns:sodipodi="http://sodipodi.sourceforge.net/DTD/sodipodi-0.dtd"
   xmlns:inkscape="http://www.inkscape.org/namespaces/inkscape"
   viewBox="200 19 161.62205 75.396386"
   version="1.1"
   id="svg7943"
   sodipodi:docname="Beziehungstyp.svg"
   width="161.62206"
   height="75.396385"
   inkscape:version="0.92.5 (2060ec1f9f, 2020-04-08)">
  <metadata
     id="metadata7949">
    <rdf:RDF>
      <cc:Work
         rdf:about="">
        <dc:format>image/svg+xml</dc:format>
        <dc:type
           rdf:resource="http://purl.org/dc/dcmitype/StillImage" />
        <dc:title></dc:title>
      </cc:Work>
    </rdf:RDF>
  </metadata>
  <defs
     id="defs7947" />
  <sodipodi:namedview
     pagecolor="#ffffff"
     bordercolor="#666666"
     borderopacity="1"
     objecttolerance="10"
     gridtolerance="10"
     guidetolerance="10"
     inkscape:pageopacity="0"
     inkscape:pageshadow="2"
     inkscape:window-width="1744"
     inkscape:window-height="776"
     id="namedview7945"
     showgrid="false"
     inkscape:zoom="1.1188119"
     inkscape:cx="109.96317"
     inkscape:cy="66.11333"
     inkscape:window-x="2087"
     inkscape:window-y="98"
     inkscape:window-maximized="0"
     inkscape:current-layer="svg7943"
     showguides="false" />
  <text
     font-size="12.7998"
     style="font-style:normal;font-weight:normal;font-size:12.79979992px;font-family:monospace;text-anchor:end;fill:#000000"
     x="218.4915"
     y="50.698196"
     id="text7937" />
  <text
     font-size="12.7998"
     style="font-style:normal;font-weight:normal;font-size:12.79979992px;font-family:monospace;text-anchor:start;fill:#000000"
     x="339.79147"
     y="50.698196"
     id="text7939" />
  <path
     style="fill:#dddddd;fill-opacity:1;stroke:#000000;stroke-width:1px;stroke-linecap:butt;stroke-linejoin:miter;stroke-opacity:1"
     d="m 201.19775,56.698196 80.85998,-37.146457 78.39662,37.146457 -78.39662,37.146453 z"
     id="path8543"
     inkscape:connector-curvature="0" />
  <text
     font-size="12.7998"
     style="font-style:normal;font-weight:normal;font-size:12.79979992px;font-family:monospace;text-anchor:middle;fill:#000000"
     x="280.92911"
     y="59.804386"
     id="text7941">Beziehungstyp</text>
</svg>
