<?xml version="1.0" encoding="UTF-8" standalone="no"?>
<!-- Created with Inkscape (http://www.inkscape.org/) -->

<svg
   xmlns:dc="http://purl.org/dc/elements/1.1/"
   xmlns:cc="http://creativecommons.org/ns#"
   xmlns:rdf="http://www.w3.org/1999/02/22-rdf-syntax-ns#"
   xmlns:svg="http://www.w3.org/2000/svg"
   xmlns="http://www.w3.org/2000/svg"
   xmlns:sodipodi="http://sodipodi.sourceforge.net/DTD/sodipodi-0.dtd"
   xmlns:inkscape="http://www.inkscape.org/namespaces/inkscape"
   width="52.940479mm"
   height="29.36875mm"
   viewBox="0 0 52.940479 29.36875"
   version="1.1"
   id="svg4786"
   inkscape:version="0.92.5 (2060ec1f9f, 2020-04-08)"
   sodipodi:docname="Kontaktformular.svg">
  <defs
     id="defs4780" />
  <sodipodi:namedview
     id="base"
     pagecolor="#ffffff"
     bordercolor="#666666"
     borderopacity="1.0"
     inkscape:pageopacity="0.0"
     inkscape:pageshadow="2"
     inkscape:zoom="2.8"
     inkscape:cx="14.016606"
     inkscape:cy="96.305523"
     inkscape:document-units="mm"
     inkscape:current-layer="layer1"
     showgrid="true"
     inkscape:window-width="1852"
     inkscape:window-height="1016"
     inkscape:window-x="1988"
     inkscape:window-y="27"
     inkscape:window-maximized="1">
    <inkscape:grid
       type="xygrid"
       id="grid8250" />
  </sodipodi:namedview>
  <metadata
     id="metadata4783">
    <rdf:RDF>
      <cc:Work
         rdf:about="">
        <dc:format>image/svg+xml</dc:format>
        <dc:type
           rdf:resource="http://purl.org/dc/dcmitype/StillImage" />
        <dc:title />
      </cc:Work>
    </rdf:RDF>
  </metadata>
  <g
     inkscape:label="Ebene 1"
     inkscape:groupmode="layer"
     id="layer1"
     transform="translate(-63.242952,-251.68087)">
    <rect
       id="rect6108"
       pointer-events="all"
       height="5.2916665"
       width="46.698959"
       y="145.61339"
       x="51.650547"
       style="fill:none;stroke:none;stroke-width:0.26458332" />
    <rect
       id="rect6128"
       pointer-events="all"
       height="1.9393958"
       width="1.8811876"
       y="156.9693"
       x="94.563316"
       style="fill:#d5e8d4;stroke:#82b366;stroke-width:0.26458332" />
    <rect
       id="rect6957"
       pointer-events="all"
       height="29.104166"
       width="52.675896"
       y="251.81316"
       x="63.375244"
       style="fill:#dae8fc;stroke:#6c8ebf;stroke-width:0.26458332" />
    <rect
       id="rect6959"
       pointer-events="all"
       height="29.104166"
       width="52.675896"
       y="251.81316"
       x="63.375244"
       style="fill:#ffffff;stroke:#666666;stroke-width:0.26458332" />
    <rect
       id="rect6961"
       pointer-events="all"
       height="21.341286"
       width="47.193737"
       y="257.0625"
       x="66.320045"
       style="fill:#f5f5f5;stroke:none;stroke-width:0.2589792" />
    <rect
       id="rect6967"
       pointer-events="all"
       height="1.9393958"
       width="41.388767"
       y="253.75255"
       x="65.256432"
       style="fill:#d5e8d4;stroke:#82b366;stroke-width:0.26458332" />
    <rect
       id="rect6969"
       pointer-events="all"
       height="1.9393958"
       width="1.8811876"
       y="253.75255"
       x="109.2778"
       style="fill:#d5e8d4;stroke:#82b366;stroke-width:0.26458332" />
    <rect
       id="rect6971"
       pointer-events="all"
       height="1.9393958"
       width="1.6933334"
       y="253.75255"
       x="112.47662"
       style="fill:#d5e8d4;stroke:#82b366;stroke-width:0.26458332" />
    <rect
       id="rect6975"
       pointer-events="all"
       height="5.0244374"
       width="20.531666"
       y="273.24707"
       x="64.309219"
       style="fill:none;stroke:none;stroke-width:0.26458332" />
    <rect
       id="rect6983"
       pointer-events="all"
       height="5.2916665"
       width="20.531666"
       y="273.24707"
       x="79.448685"
       style="fill:none;stroke:none;stroke-width:0.26458332" />
    <rect
       id="rect6991"
       pointer-events="all"
       height="5.2916665"
       width="20.531666"
       y="273.11478"
       x="95.040573"
       style="fill:none;stroke:none;stroke-width:0.26458332" />
    <text
       xml:space="preserve"
       style="font-style:normal;font-weight:normal;font-size:2.33579612px;line-height:1.25;font-family:sans-serif;letter-spacing:0px;word-spacing:0px;fill:#262626;fill-opacity:1;stroke:none;stroke-width:0.29197451"
       x="71.093216"
       y="253.57994"
       id="text8112"
       transform="scale(0.96757015,1.0335168)"><tspan
         sodipodi:role="line"
         id="tspan8110"
         x="71.093216"
         y="253.57994"
         style="fill:#262626;fill-opacity:1;stroke-width:0.29197451">Name: </tspan><tspan
         sodipodi:role="line"
         x="71.093216"
         y="256.49969"
         style="fill:#262626;fill-opacity:1;stroke-width:0.29197451"
         id="tspan8116">Vorname:</tspan><tspan
         sodipodi:role="line"
         x="71.093216"
         y="259.41943"
         style="fill:#262626;fill-opacity:1;stroke-width:0.29197451"
         id="tspan8124">E-Mail:</tspan><tspan
         sodipodi:role="line"
         x="71.093216"
         y="262.33917"
         style="fill:#262626;fill-opacity:1;stroke-width:0.29197451"
         id="tspan8122">Adresse:</tspan></text>
    <rect
       id="rect6961-6"
       pointer-events="all"
       height="2.2288284"
       width="12.034904"
       y="259.88293"
       x="80.440872"
       style="fill:#d1d1d1;fill-opacity:1;stroke:none;stroke-width:0.04226414" />
    <rect
       id="rect6961-6-9"
       pointer-events="all"
       height="2.2288284"
       width="12.034904"
       y="262.52878"
       x="80.440872"
       style="fill:#d1d1d1;fill-opacity:1;stroke:none;stroke-width:0.04226414" />
    <rect
       id="rect6961-6-9-1"
       pointer-events="all"
       height="2.2288284"
       width="12.034904"
       y="265.17462"
       x="80.440872"
       style="fill:#d1d1d1;fill-opacity:1;stroke:none;stroke-width:0.04226414" />
    <rect
       id="rect6961-6-9-1-2"
       pointer-events="all"
       height="7.9374981"
       width="12.034904"
       y="267.82043"
       x="80.440872"
       style="fill:#d1d1d1;fill-opacity:1;stroke:none;stroke-width:0.07975823" />
    <rect
       id="rect6961-6-7"
       pointer-events="all"
       height="1.968376"
       width="1.968376"
       y="259.88293"
       x="94.99295"
       style="fill:#ffffff;fill-opacity:1;stroke:#23313d;stroke-width:0.03162399;stroke-opacity:1" />
    <text
       xml:space="preserve"
       style="font-style:normal;font-weight:normal;font-size:2.21329117px;line-height:1.25;font-family:sans-serif;letter-spacing:0px;word-spacing:0px;fill:#262626;fill-opacity:1;stroke:none;stroke-width:0.2766614"
       x="98.808075"
       y="261.54382"
       id="text8229"><tspan
         sodipodi:role="line"
         id="tspan8227"
         x="98.808075"
         y="261.54382"
         style="fill:#262626;fill-opacity:1;stroke-width:0.2766614">Orange</tspan><tspan
         sodipodi:role="line"
         x="98.808075"
         y="264.31042"
         style="fill:#262626;fill-opacity:1;stroke-width:0.2766614"
         id="tspan8231">Schoko</tspan><tspan
         sodipodi:role="line"
         x="98.808075"
         y="267.07706"
         style="fill:#262626;fill-opacity:1;stroke-width:0.2766614"
         id="tspan8233">Waldmeister</tspan></text>
    <rect
       id="rect6961-6-7-0"
       pointer-events="all"
       height="1.9683762"
       width="1.9683762"
       y="262.52878"
       x="94.99295"
       style="fill:#ffffff;fill-opacity:1;stroke:#23313d;stroke-width:0.03162399;stroke-opacity:1" />
    <rect
       id="rect6961-6-7-0-9"
       pointer-events="all"
       height="1.9683762"
       width="1.9683762"
       y="265.17462"
       x="94.99295"
       style="fill:#ffffff;fill-opacity:1;stroke:#23313d;stroke-width:0.03162399;stroke-opacity:1" />
    <text
       xml:space="preserve"
       style="font-style:normal;font-weight:normal;font-size:2.11666656px;line-height:1.25;font-family:sans-serif;letter-spacing:0px;word-spacing:0px;fill:#262626;fill-opacity:1;stroke:none;stroke-width:0.26458332"
       x="95.380424"
       y="261.66214"
       id="text8269"><tspan
         sodipodi:role="line"
         id="tspan8267"
         x="95.380424"
         y="261.66214"
         style="fill:#262626;fill-opacity:1;stroke-width:0.26458332">2</tspan></text>
    <text
       xml:space="preserve"
       style="font-style:normal;font-weight:normal;font-size:2.11666656px;line-height:1.25;font-family:sans-serif;letter-spacing:0px;word-spacing:0px;fill:#262626;fill-opacity:1;stroke:none;stroke-width:0.26458332"
       x="95.313271"
       y="266.91385"
       id="text8269-3"><tspan
         sodipodi:role="line"
         id="tspan8267-6"
         x="95.313271"
         y="266.91385"
         style="fill:#262626;fill-opacity:1;stroke-width:0.26458332">3</tspan></text>
    <g
       id="g8377"
       transform="translate(-3.0448039e-6,-1.3229232)">
      <rect
         style="fill:#b1afda;fill-opacity:1;stroke:#1a1936;stroke-width:0.13421431;stroke-miterlimit:4;stroke-dasharray:none;stroke-opacity:1"
         x="100.28462"
         y="273.22156"
         width="11.906249"
         height="3.859304"
         pointer-events="all"
         id="rect6961-6-9-1-2-0" />
      <text
         id="text8306"
         y="275.82477"
         x="100.99544"
         style="font-style:normal;font-weight:normal;font-size:2.11666656px;line-height:1.25;font-family:sans-serif;letter-spacing:0px;word-spacing:0px;fill:#262626;fill-opacity:1;stroke:none;stroke-width:0.26458332"
         xml:space="preserve"><tspan
           style="fill:#262626;fill-opacity:1;stroke-width:0.26458332"
           y="275.82477"
           x="100.99544"
           id="tspan8304"
           sodipodi:role="line">Absenden</tspan></text>
    </g>
    <text
       xml:space="preserve"
       style="font-style:normal;font-weight:normal;font-size:2.11666656px;line-height:1.25;font-family:sans-serif;letter-spacing:0px;word-spacing:0px;fill:#262626;fill-opacity:1;stroke:none;stroke-width:0.26458332"
       x="95.285927"
       y="264.30798"
       id="text8269-6"><tspan
         sodipodi:role="line"
         id="tspan8267-2"
         x="95.285927"
         y="264.30798"
         style="fill:#262626;fill-opacity:1;stroke-width:0.26458332">0</tspan></text>
  </g>
</svg>
