<?xml version="1.0" encoding="UTF-8" standalone="no"?>
<!DOCTYPE svg PUBLIC "-//W3C//DTD SVG 1.0//EN" "http://www.w3.org/TR/2001/PR-SVG-20010719/DTD/svg10.dtd">
<svg width="16cm" height="7cm" viewBox="208 185 313 121" xmlns="http://www.w3.org/2000/svg" xmlns:xlink="http://www.w3.org/1999/xlink">
  <g id="Hintergrund">
    <g>
      <rect style="fill: #dae8fc; fill-opacity: 1; stroke-opacity: 1; stroke-width: 2; stroke: #000000" x="209.1" y="191.9" width="66.5" height="36"/>
      <text font-size="12.8" style="fill: #000000; fill-opacity: 1; stroke: none;text-anchor:middle;font-family:monospace;font-style:normal;font-weight:normal" x="242.35" y="213.781">Kunde</text>
      <rect style="fill: #dae8fc; fill-opacity: 1; stroke-opacity: 1; stroke-width: 2; stroke: #000000" x="438" y="191.9" width="81.9" height="36"/>
      <text font-size="12.8" style="fill: #000000; fill-opacity: 1; stroke: none;text-anchor:middle;font-family:monospace;font-style:normal;font-weight:normal" x="478.95" y="213.781">Artikel</text>
      <polygon style="fill: #dddddd; fill-opacity: 1; stroke-opacity: 1; stroke-width: 2; stroke: #000000" fill-rule="evenodd" points="320.1,210.45 359.35,186.9 398.6,210.45 359.35,234 "/>
      <text font-size="12.8" style="fill: #000000; fill-opacity: 1; stroke: none;text-anchor:end;font-family:monospace;font-style:normal;font-weight:normal" x="314.1" y="204.45">m</text>
      <text font-size="12.8" style="fill: #000000; fill-opacity: 1; stroke: none;text-anchor:start;font-family:monospace;font-style:normal;font-weight:normal" x="404.6" y="204.45">n</text>
      <text font-size="12.8" style="fill: #000000; fill-opacity: 1; stroke: none;text-anchor:middle;font-family:monospace;font-style:normal;font-weight:normal" x="359.35" y="214.331">kauft</text>
      <polyline style="fill: none; stroke-opacity: 1; stroke-width: 2; stroke: #000000" points="275.6,209.9 297.85,209.9 297.85,210.45 320.1,210.45 "/>
      <ellipse style="fill: #ffe6cc; fill-opacity: 1; stroke: none" cx="359.35" cy="286.9" rx="39.25" ry="18"/>
      <ellipse style="fill: none; stroke-opacity: 1; stroke-width: 2; stroke: #000000" cx="359.35" cy="286.9" rx="39.25" ry="18"/>
      <text font-size="12.8" style="fill: #000000; fill-opacity: 1; stroke: none;text-anchor:middle;font-family:monospace;font-style:normal;font-weight:normal" x="359.35" y="290.781">Datum</text>
      <polyline style="fill: none; stroke-opacity: 1; stroke-width: 2; stroke: #000000" points="359.35,234 359.35,251.45 359.35,251.45 359.35,268.9 "/>
      <polyline style="fill: none; stroke-opacity: 1; stroke-width: 2; stroke: #000000" points="398.6,210.45 419.3,210.45 419.3,210 440,210 "/>
    </g>
  </g>
</svg>
