<?xml version="1.0" encoding="utf-8"?>
<!-- Generator: Adobe Illustrator 15.0.2, SVG Export Plug-In . SVG Version: 6.00 Build 0)  -->
<!DOCTYPE svg PUBLIC "-//W3C//DTD SVG 1.1//EN" "http://www.w3.org/Graphics/SVG/1.1/DTD/svg11.dtd">
<svg
    xmlns="http://www.w3.org/2000/svg"
    xmlns:xlink="http://www.w3.org/1999/xlink"
    xmlns:svg="http://www.w3.org/2000/svg"
    xmlns:inkscape="http://www.inkscape.org/namespaces/inkscape"
    xmlns:sodipodi="http://sodipodi.sourceforge.net/DTD/sodipodi-0.dtd"
    xmlns:ns1="http://sozi.baierouge.fr"
    xmlns:dc="http://purl.org/dc/elements/1.1/"
    xmlns:cc="http://web.resource.org/cc/"
    xmlns:rdf="http://www.w3.org/1999/02/22-rdf-syntax-ns#"
    version="1.1"
    id="Layer_1"
    x="0px"
    y="0px"
    width="85.039px"
    height="141.732px"
    viewBox="0 0 85.039 141.732"
    enable-background="new 0 0 85.039 141.732"
    xml:space="preserve"
  >
<linearGradient
      id="SVGID_1_"
      gradientUnits="userSpaceOnUse"
      x1="42.3794"
      y1="108.1807"
      x2="42.5626"
      y2="133.3524"
    >
	<stop
        offset="0"
        style="stop-color:#9D9D9C"
    />
	<stop
        offset="1"
        style="stop-color:#FDFDFD;stop-opacity:0"
    />
</linearGradient
  >
<path
      fill="url(#SVGID_1_)"
      d="M76.42,119.217c0-6.688-5.048-12.108-11.28-12.108H20.035c-6.231,0-11.281,5.42-11.281,12.108  c0,0.244,0.021,0.483,0.034,0.725H8.619v15.556h67.786v-15.556h-0.02C76.398,119.7,76.42,119.461,76.42,119.217z"
  />
<g
    >
	<g
      >
		
			<linearGradient
          id="SVGID_2_"
          gradientUnits="userSpaceOnUse"
          x1="42.1733"
          y1="8.4053"
          x2="42.835"
          y2="99.2968"
          gradientTransform="matrix(1 0 0 1 0 3.002)"
        >
			<stop
            offset="0"
            style="stop-color:#9D9D9C"
        />
			<stop
            offset="1"
            style="stop-color:#FDFDFD;stop-opacity:0"
        />
		</linearGradient
      >
		<path
          fill="url(#SVGID_2_)"
          d="M35.724,15.064H49.31c1.07,0,1.943-0.869,1.943-1.939s-0.873-1.939-1.943-1.939H35.724    c-1.071,0-1.938,0.869-1.938,1.939S34.652,15.064,35.724,15.064z"
      />
		
			<linearGradient
          id="SVGID_3_"
          gradientUnits="userSpaceOnUse"
          x1="42.1733"
          y1="8.4053"
          x2="42.835"
          y2="99.2968"
          gradientTransform="matrix(1 0 0 1 0 3.002)"
        >
			<stop
            offset="0"
            style="stop-color:#9D9D9C"
        />
			<stop
            offset="1"
            style="stop-color:#FDFDFD;stop-opacity:0"
        />
		</linearGradient
      >
		<path
          fill="url(#SVGID_3_)"
          d="M58.045,13.006c0.871,0,1.574-0.708,1.574-1.58c0-0.868-0.703-1.576-1.574-1.576    s-1.58,0.708-1.58,1.576C56.465,12.298,57.174,13.006,58.045,13.006z"
      />
		
			<linearGradient
          id="SVGID_4_"
          gradientUnits="userSpaceOnUse"
          x1="42.1733"
          y1="8.4053"
          x2="42.835"
          y2="99.2968"
          gradientTransform="matrix(1 0 0 1 0 3.002)"
        >
			<stop
            offset="0"
            style="stop-color:#9D9D9C"
        />
			<stop
            offset="1"
            style="stop-color:#FDFDFD;stop-opacity:0"
        />
		</linearGradient
      >
		<path
          fill="url(#SVGID_4_)"
          d="M34.018,18.576H15.464v16.579v47.567v14.881h18.554h16.997h18.554V35.155l0,0V18.576H51.015H34.018    z M25.428,96.792h-8.484v-8.487h8.484V96.792z M25.428,42.953h-8.49v-8.488h8.49V42.953z M25.428,31.191h-8.49l0.006-8.488h8.484    V31.191z M39.648,96.792l-8.484-0.003v-8.487l8.484,0.003V96.792z M39.648,42.953h-8.484v-8.488h8.484V42.953z M39.648,31.191    h-8.484v-8.488h8.484V31.191z M53.868,96.548h-8.483v-8.489l8.483-0.003V96.548z M53.868,42.953h-8.483v-8.488h8.483V42.953z     M59.611,22.703h8.484v8.488h-8.49L59.611,22.703z M59.611,88.059h8.484v8.489h-8.484V88.059z M53.868,31.191h-8.483v-8.488h8.483    V31.191z"
      />
		
			<linearGradient
          id="SVGID_5_"
          gradientUnits="userSpaceOnUse"
          x1="42.1733"
          y1="8.4053"
          x2="42.835"
          y2="99.2968"
          gradientTransform="matrix(1 0 0 1 0 3.002)"
        >
			<stop
            offset="0"
            style="stop-color:#9D9D9C"
        />
			<stop
            offset="1"
            style="stop-color:#FDFDFD;stop-opacity:0"
        />
		</linearGradient
      >
		<path
          fill="url(#SVGID_5_)"
          d="M53.182,7.022h-2.167H34.018h-2.167c-10.665,0-19.765,5.214-19.765,11.644v16.486v47.571v16.492    c0,6.434,9.1,11.643,19.765,11.643l2.167-0.003h16.997l2.167,0.003c10.672,0,19.771-5.209,19.771-11.643V82.723l0,0V18.666    C72.953,12.236,63.854,7.022,53.182,7.022z M58.045,9.85c0.871,0,1.574,0.708,1.574,1.576c0,0.873-0.703,1.58-1.574,1.58    s-1.58-0.708-1.58-1.58C56.465,10.558,57.174,9.85,58.045,9.85z M35.724,15.064c-1.071,0-1.938-0.869-1.938-1.939    s0.866-1.939,1.938-1.939H49.31c1.07,0,1.943,0.869,1.943,1.939s-0.873,1.939-1.943,1.939 M69.568,35.155L69.568,35.155v62.449    H51.015H34.018H15.464V82.723V35.155V18.576h18.554h16.997h18.554V35.155z"
      />
		
			<linearGradient
          id="SVGID_6_"
          gradientUnits="userSpaceOnUse"
          x1="42.1733"
          y1="8.4053"
          x2="42.835"
          y2="99.2968"
          gradientTransform="matrix(1 0 0 1 0 3.002)"
        >
			<stop
            offset="0"
            style="stop-color:#9D9D9C"
        />
			<stop
            offset="1"
            style="stop-color:#FDFDFD;stop-opacity:0"
        />
		</linearGradient
      >
		<path
          fill="url(#SVGID_6_)"
          d="M50.208,104.293c0,1.502-0.847,2.723-1.884,2.723H36.715c-1.044,0-1.89-1.221-1.89-2.723l0,0    c0-1.5,0.846-2.721,1.89-2.721h11.609C49.361,101.572,50.208,102.793,50.208,104.293L50.208,104.293z"
      />
		
			<linearGradient
          id="SVGID_7_"
          gradientUnits="userSpaceOnUse"
          x1="42.1733"
          y1="8.4053"
          x2="42.835"
          y2="99.2968"
          gradientTransform="matrix(1 0 0 1 0 3.002)"
        >
			<stop
            offset="0"
            style="stop-color:#9D9D9C"
        />
			<stop
            offset="1"
            style="stop-color:#FDFDFD;stop-opacity:0"
        />
		</linearGradient
      >
		<polygon
          fill="url(#SVGID_7_)"
          points="16.938,31.191 25.428,31.191 25.428,22.703 16.943,22.703   "
      />
		
			<linearGradient
          id="SVGID_8_"
          gradientUnits="userSpaceOnUse"
          x1="42.1733"
          y1="8.4053"
          x2="42.835"
          y2="99.2968"
          gradientTransform="matrix(1 0 0 1 0 3.002)"
        >
			<stop
            offset="0"
            style="stop-color:#9D9D9C"
        />
			<stop
            offset="1"
            style="stop-color:#FDFDFD;stop-opacity:0"
        />
		</linearGradient
      >
		<rect
          x="31.164"
          y="22.703"
          fill="url(#SVGID_8_)"
          width="8.484"
          height="8.488"
      />
		
			<linearGradient
          id="SVGID_9_"
          gradientUnits="userSpaceOnUse"
          x1="42.1733"
          y1="8.4053"
          x2="42.835"
          y2="99.2968"
          gradientTransform="matrix(1 0 0 1 0 3.002)"
        >
			<stop
            offset="0"
            style="stop-color:#9D9D9C"
        />
			<stop
            offset="1"
            style="stop-color:#FDFDFD;stop-opacity:0"
        />
		</linearGradient
      >
		<rect
          x="45.385"
          y="22.703"
          fill="url(#SVGID_9_)"
          width="8.483"
          height="8.488"
      />
		
			<linearGradient
          id="SVGID_10_"
          gradientUnits="userSpaceOnUse"
          x1="42.1733"
          y1="8.4053"
          x2="42.835"
          y2="99.2968"
          gradientTransform="matrix(1 0 0 1 0 3.002)"
        >
			<stop
            offset="0"
            style="stop-color:#9D9D9C"
        />
			<stop
            offset="1"
            style="stop-color:#FDFDFD;stop-opacity:0"
        />
		</linearGradient
      >
		<polygon
          fill="url(#SVGID_10_)"
          points="68.096,22.703 59.611,22.703 59.605,31.191 68.096,31.191   "
      />
		
			<linearGradient
          id="SVGID_11_"
          gradientUnits="userSpaceOnUse"
          x1="42.1733"
          y1="8.4053"
          x2="42.835"
          y2="99.2968"
          gradientTransform="matrix(1 0 0 1 0 3.002)"
        >
			<stop
            offset="0"
            style="stop-color:#9D9D9C"
        />
			<stop
            offset="1"
            style="stop-color:#FDFDFD;stop-opacity:0"
        />
		</linearGradient
      >
		<rect
          x="16.938"
          y="34.465"
          fill="url(#SVGID_11_)"
          width="8.49"
          height="8.488"
      />
		
			<linearGradient
          id="SVGID_12_"
          gradientUnits="userSpaceOnUse"
          x1="42.1733"
          y1="8.4053"
          x2="42.835"
          y2="99.2968"
          gradientTransform="matrix(1 0 0 1 0 3.002)"
        >
			<stop
            offset="0"
            style="stop-color:#9D9D9C"
        />
			<stop
            offset="1"
            style="stop-color:#FDFDFD;stop-opacity:0"
        />
		</linearGradient
      >
		<rect
          x="31.164"
          y="34.465"
          fill="url(#SVGID_12_)"
          width="8.484"
          height="8.488"
      />
		
			<linearGradient
          id="SVGID_13_"
          gradientUnits="userSpaceOnUse"
          x1="42.1733"
          y1="8.4053"
          x2="42.835"
          y2="99.2968"
          gradientTransform="matrix(1 0 0 1 0 3.002)"
        >
			<stop
            offset="0"
            style="stop-color:#9D9D9C"
        />
			<stop
            offset="1"
            style="stop-color:#FDFDFD;stop-opacity:0"
        />
		</linearGradient
      >
		<rect
          x="45.385"
          y="34.465"
          fill="url(#SVGID_13_)"
          width="8.483"
          height="8.488"
      />
		
			<linearGradient
          id="SVGID_14_"
          gradientUnits="userSpaceOnUse"
          x1="42.1733"
          y1="8.4053"
          x2="42.835"
          y2="99.2968"
          gradientTransform="matrix(1 0 0 1 0 3.002)"
        >
			<stop
            offset="0"
            style="stop-color:#9D9D9C"
        />
			<stop
            offset="1"
            style="stop-color:#FDFDFD;stop-opacity:0"
        />
		</linearGradient
      >
		<rect
          x="16.943"
          y="88.305"
          fill="url(#SVGID_14_)"
          width="8.484"
          height="8.487"
      />
		
			<linearGradient
          id="SVGID_15_"
          gradientUnits="userSpaceOnUse"
          x1="42.1733"
          y1="8.4053"
          x2="42.835"
          y2="99.2968"
          gradientTransform="matrix(1 0 0 1 0 3.002)"
        >
			<stop
            offset="0"
            style="stop-color:#9D9D9C"
        />
			<stop
            offset="1"
            style="stop-color:#FDFDFD;stop-opacity:0"
        />
		</linearGradient
      >
		<rect
          x="31.164"
          y="88.303"
          fill="url(#SVGID_15_)"
          width="8.484"
          height="8.487"
      />
		
			<linearGradient
          id="SVGID_16_"
          gradientUnits="userSpaceOnUse"
          x1="42.1733"
          y1="8.4053"
          x2="42.835"
          y2="99.2968"
          gradientTransform="matrix(1 0 0 1 0 3.002)"
        >
			<stop
            offset="0"
            style="stop-color:#9D9D9C"
        />
			<stop
            offset="1"
            style="stop-color:#FDFDFD;stop-opacity:0"
        />
		</linearGradient
      >
		<rect
          x="45.385"
          y="88.055"
          fill="url(#SVGID_16_)"
          width="8.483"
          height="8.493"
      />
		
			<linearGradient
          id="SVGID_17_"
          gradientUnits="userSpaceOnUse"
          x1="42.1733"
          y1="8.4053"
          x2="42.835"
          y2="99.2968"
          gradientTransform="matrix(1 0 0 1 0 3.002)"
        >
			<stop
            offset="0"
            style="stop-color:#9D9D9C"
        />
			<stop
            offset="1"
            style="stop-color:#FDFDFD;stop-opacity:0"
        />
		</linearGradient
      >
		<rect
          x="59.611"
          y="88.059"
          fill="url(#SVGID_17_)"
          width="8.484"
          height="8.489"
      />
	</g
    >
	<g
      >
		<path
          fill="#F2F2F2"
          d="M34.018,18.576H15.464v16.579v47.567v14.881h18.554h16.997h18.554V35.155l0,0V18.576H51.015H34.018z     M25.428,96.792h-8.484v-8.487h8.484V96.792z M25.428,42.953h-8.49v-8.488h8.49V42.953z M25.428,31.191h-8.49l0.006-8.488h8.484    V31.191z M39.648,96.792l-8.484-0.003v-8.487l8.484,0.003V96.792z M39.648,42.953h-8.484v-8.488h8.484V42.953z M39.648,31.191    h-8.484v-8.488h8.484V31.191z M53.868,96.548h-8.483v-8.489l8.483-0.003V96.548z M53.868,42.953h-8.483v-8.488h8.483V42.953z     M59.611,22.703h8.484v8.488h-8.49L59.611,22.703z M59.611,88.059h8.484v8.489h-8.484V88.059z M53.868,31.191h-8.483v-8.488h8.483    V31.191z"
      />
		<path
          d="M53.182,7.022h-2.167H34.018h-2.167c-10.665,0-19.765,5.214-19.765,11.644v16.486v47.571v16.492    c0,6.434,9.1,11.643,19.765,11.643l2.167-0.003h16.997l2.167,0.003c10.672,0,19.771-5.209,19.771-11.643V82.723l0,0V18.666    C72.953,12.236,63.854,7.022,53.182,7.022z M58.045,9.85c0.871,0,1.574,0.708,1.574,1.576c0,0.873-0.703,1.58-1.574,1.58    s-1.58-0.708-1.58-1.58C56.465,10.558,57.174,9.85,58.045,9.85z M35.724,15.064c-1.071,0-1.938-0.869-1.938-1.939    s0.866-1.939,1.938-1.939H49.31c1.07,0,1.943,0.869,1.943,1.939s-0.873,1.939-1.943,1.939 M69.568,35.155L69.568,35.155v62.449    H51.015H34.018H15.464V82.723V35.155V18.576h18.554h16.997h18.554V35.155z"
      />
		<path
          stroke="#878787"
          stroke-width="0.1"
          stroke-miterlimit="10"
          d="M50.208,104.293c0,1.502-0.847,2.723-1.884,2.723H36.715    c-1.044,0-1.89-1.221-1.89-2.723l0,0c0-1.5,0.846-2.721,1.89-2.721h11.609C49.361,101.572,50.208,102.793,50.208,104.293    L50.208,104.293z"
      />
		<polygon
          fill="#FFED00"
          points="16.938,31.191 25.428,31.191 25.428,22.703 16.943,22.703   "
      />
		<rect
          x="31.164"
          y="22.703"
          fill="#95C11F"
          width="8.484"
          height="8.488"
      />
		<rect
          x="45.385"
          y="22.703"
          fill="#A3195B"
          width="8.483"
          height="8.488"
      />
		<polygon
          fill="#E71D73"
          points="68.096,22.703 59.611,22.703 59.605,31.191 68.096,31.191   "
      />
		<rect
          x="16.938"
          y="34.465"
          fill="#E6007E"
          width="8.49"
          height="8.488"
      />
		<rect
          x="31.164"
          y="34.465"
          fill="#29235C"
          width="8.484"
          height="8.488"
      />
		<rect
          x="45.385"
          y="34.465"
          fill="#BE1622"
          width="8.483"
          height="8.488"
      />
		<rect
          x="16.943"
          y="88.305"
          fill="#95C11F"
          width="8.484"
          height="8.487"
      />
		<rect
          x="31.164"
          y="88.303"
          fill="#009FE3"
          width="8.484"
          height="8.487"
      />
		<rect
          x="45.385"
          y="88.055"
          fill="#1D71B8"
          width="8.483"
          height="8.493"
      />
		<rect
          x="59.611"
          y="88.059"
          fill="#634E42"
          width="8.484"
          height="8.489"
      />
	</g
    >
</g
  >
<metadata
    ><rdf:RDF
      ><cc:Work
        ><dc:format
          >image/svg+xml</dc:format
        ><dc:type
            rdf:resource="http://purl.org/dc/dcmitype/StillImage"
        /><cc:license
            rdf:resource="http://creativecommons.org/licenses/publicdomain/"
        /><dc:publisher
          ><cc:Agent
              rdf:about="http://openclipart.org/"
            ><dc:title
              >Openclipart</dc:title
            ></cc:Agent
          ></dc:publisher
        ><dc:title
          >smartphone</dc:title
        ><dc:date
          >2014-05-12T06:23:56</dc:date
        ><dc:description
          >A smartphone.</dc:description
        ><dc:source
          >https://openclipart.org/detail/193433/smartphone-by-edoardoposa-193433</dc:source
        ><dc:creator
          ><cc:Agent
            ><dc:title
              >edoardoposa</dc:title
            ></cc:Agent
          ></dc:creator
        ><dc:subject
          ><rdf:Bag
            ><rdf:li
              >comunication</rdf:li
            ><rdf:li
              >icon</rdf:li
            ><rdf:li
              >mobile</rdf:li
            ><rdf:li
              >phoone</rdf:li
            ><rdf:li
              >smartphone</rdf:li
            ><rdf:li
              >telephone</rdf:li
            ></rdf:Bag
          ></dc:subject
        ></cc:Work
      ><cc:License
          rdf:about="http://creativecommons.org/licenses/publicdomain/"
        ><cc:permits
            rdf:resource="http://creativecommons.org/ns#Reproduction"
        /><cc:permits
            rdf:resource="http://creativecommons.org/ns#Distribution"
        /><cc:permits
            rdf:resource="http://creativecommons.org/ns#DerivativeWorks"
        /></cc:License
      ></rdf:RDF
    ></metadata
  ></svg
>
