<svg xmlns="http://www.w3.org/2000/svg"
     xmlns:xlink="http://www.w3.org/1999/xlink"
     viewBox="0 0 1000 1000">
  <rect x="25" y="25" width="950" height="950" rx="50" ry="50" fill="white" stroke="rgb(38, 64, 64)" stroke-width="50" />

  <line x1="175" y1="150" x2="75" y2="250" stroke="white" stroke-linecap="round" stroke-width="100" />
  <line x1="175" y1="350" x2="75" y2="250" stroke="white" stroke-linecap="round" stroke-width="100" />
  <line x1="225" y1="425" x2="325" y2="75" stroke="white" stroke-linecap="round" stroke-width="100" />
  <line x1="175" y1="150" x2="75" y2="250" stroke="rgb(38, 64, 64)" stroke-linecap="round" stroke-width="50" />
  <line x1="175" y1="350" x2="75" y2="250" stroke="rgb(38, 64, 64)" stroke-linecap="round" stroke-width="50" />
  <line x1="225" y1="425" x2="325" y2="75" stroke="rgb(38, 64, 64)" stroke-linecap="round" stroke-width="50" />

  <line x1="375" y1="150" x2="475" y2="250" stroke="rgb(38, 64, 64)" stroke-linecap="round" stroke-width="50" />
  <line x1="375" y1="350" x2="475" y2="250" stroke="rgb(38, 64, 64)" stroke-linecap="round" stroke-width="50" />

  <g transform="rotate(45, 500, 500) translate(-350, -150) scale(1.2)">
    <path d="M700 100 l100 0" fill="none" stroke="white" stroke-width="45" stroke-linecap="round" />
    <path d="M700 100 l0 500 l50 100 l50 -100 l0 -500" fill="none" stroke="white" stroke-width="45" stroke-linecap="round" />
    <path d="M700 100 l0 500 l50 100 l50 -100 l0 -500" fill="none" stroke="rgb(38, 64, 64)" stroke-width="15" stroke-linecap="round" />

    <path d="M700 100 l100 0" fill="none" stroke="rgb(38, 64, 64)" stroke-width="15" stroke-linecap="round" />
    <path d="M710 600 l80 0" fill="none" stroke="rgb(38, 64, 64)" stroke-width="25" stroke-linecap="round" />
    <rect x="700" y="100" width="100" height="500" fill="rgb(38, 64, 64)" />
    <path d="M725 125 l0 450" fill="none" stroke="white" stroke-width="15" stroke-linecap="round" />
    <circle cx="755" cy="678" r="12" fill="rgb(38, 64, 64)" />
  </g>

  <text x="500" y="850" fill="rgb(38, 64, 64)" text-anchor="middle" font-size="170" font-family="Verdana">
    Aufgabe
  </text>
</svg>
