<?xml version="1.0" encoding="UTF-8" standalone="no"?>
<!-- Created with Inkscape (http://www.inkscape.org/) -->

<svg
   xmlns:dc="http://purl.org/dc/elements/1.1/"
   xmlns:cc="http://creativecommons.org/ns#"
   xmlns:rdf="http://www.w3.org/1999/02/22-rdf-syntax-ns#"
   xmlns:svg="http://www.w3.org/2000/svg"
   xmlns="http://www.w3.org/2000/svg"
   xmlns:sodipodi="http://sodipodi.sourceforge.net/DTD/sodipodi-0.dtd"
   xmlns:inkscape="http://www.inkscape.org/namespaces/inkscape"
   width="52.940479mm"
   height="29.36875mm"
   viewBox="0 0 52.940479 29.36875"
   version="1.1"
   id="svg4786"
   inkscape:version="0.92.5 (2060ec1f9f, 2020-04-08)"
   sodipodi:docname="Webshop.svg">
  <defs
     id="defs4780" />
  <sodipodi:namedview
     id="base"
     pagecolor="#ffffff"
     bordercolor="#666666"
     borderopacity="1.0"
     inkscape:pageopacity="0.0"
     inkscape:pageshadow="2"
     inkscape:zoom="0.98994949"
     inkscape:cx="122.99999"
     inkscape:cy="93.326149"
     inkscape:document-units="mm"
     inkscape:current-layer="layer1"
     showgrid="false"
     inkscape:window-width="1852"
     inkscape:window-height="1016"
     inkscape:window-x="1988"
     inkscape:window-y="27"
     inkscape:window-maximized="1" />
  <metadata
     id="metadata4783">
    <rdf:RDF>
      <cc:Work
         rdf:about="">
        <dc:format>image/svg+xml</dc:format>
        <dc:type
           rdf:resource="http://purl.org/dc/dcmitype/StillImage" />
        <dc:title></dc:title>
      </cc:Work>
    </rdf:RDF>
  </metadata>
  <g
     inkscape:label="Ebene 1"
     inkscape:groupmode="layer"
     id="layer1"
     transform="translate(-63.242952,-251.68087)">
    <rect
       id="rect6108"
       pointer-events="all"
       height="5.2916665"
       width="46.698959"
       y="145.61339"
       x="51.650547"
       style="fill:none;stroke:none;stroke-width:0.26458332" />
    <g
       id="g7459">
      <g
         transform="translate(5.953125,-17.481399)"
         id="g7195">
        <rect
           id="rect6957"
           pointer-events="all"
           height="29.104166"
           width="52.675896"
           y="269.29456"
           x="57.422119"
           style="fill:#dae8fc;stroke:#6c8ebf;stroke-width:0.26458332" />
        <rect
           id="rect6959"
           pointer-events="all"
           height="29.104166"
           width="52.675896"
           y="269.29456"
           x="57.422119"
           style="fill:#ffffff;stroke:#666666;stroke-width:0.26458332" />
        <rect
           id="rect6961"
           pointer-events="all"
           height="21.343937"
           width="49.252186"
           y="275.11539"
           x="59.303307"
           style="fill:#f5f5f5;stroke:none;stroke-width:0.26458332" />
        <rect
           id="rect6963"
           pointer-events="all"
           height="13.932958"
           width="13.932958"
           y="276.52826"
           x="61.655453"
           style="fill:#dae8fc;stroke:#6c8ebf;stroke-width:0.26458332" />
        <rect
           id="rect6965"
           pointer-events="all"
           height="13.932958"
           width="13.932958"
           y="276.52826"
           x="76.964241"
           style="fill:#dae8fc;stroke:#6c8ebf;stroke-width:0.26458332" />
        <rect
           id="rect6967"
           pointer-events="all"
           height="1.9393958"
           width="41.388767"
           y="271.23395"
           x="59.303307"
           style="fill:#d5e8d4;stroke:#82b366;stroke-width:0.26458332" />
        <rect
           id="rect6969"
           pointer-events="all"
           height="1.9393958"
           width="1.8811876"
           y="271.23395"
           x="103.32468"
           style="fill:#d5e8d4;stroke:#82b366;stroke-width:0.26458332" />
        <rect
           id="rect6971"
           pointer-events="all"
           height="1.9393958"
           width="1.6933334"
           y="271.23395"
           x="106.52349"
           style="fill:#d5e8d4;stroke:#82b366;stroke-width:0.26458332" />
        <rect
           id="rect6973"
           pointer-events="all"
           height="13.932958"
           width="13.932958"
           y="276.52826"
           x="92.590538"
           style="fill:#dae8fc;stroke:#6c8ebf;stroke-width:0.26458332" />
        <rect
           id="rect6975"
           pointer-events="all"
           height="5.0244374"
           width="20.531666"
           y="290.72845"
           x="58.356098"
           style="fill:none;stroke:none;stroke-width:0.26458332" />
        <rect
           id="rect6983"
           pointer-events="all"
           height="5.2916665"
           width="20.531666"
           y="290.72845"
           x="73.49556"
           style="fill:none;stroke:none;stroke-width:0.26458332" />
        <rect
           id="rect6991"
           pointer-events="all"
           height="5.2916665"
           width="20.531666"
           y="290.59616"
           x="89.087448"
           style="fill:none;stroke:none;stroke-width:0.26458332" />
        <text
           id="text7199"
           y="293.28558"
           x="64.350449"
           style="font-style:normal;font-weight:normal;font-size:2.11666656px;line-height:1.25;font-family:sans-serif;letter-spacing:0px;word-spacing:0px;fill:#000000;fill-opacity:1;stroke:none;stroke-width:0.26458332"
           xml:space="preserve"><tspan
             style="stroke-width:0.26458332"
             y="293.28558"
             x="64.350449"
             id="tspan7197"
             sodipodi:role="line">Orange</tspan><tspan
             id="tspan7201"
             style="stroke-width:0.26458332"
             y="295.93143"
             x="64.350449"
             sodipodi:role="line">   1 €</tspan></text>
        <text
           id="text7199-3"
           y="293.27643"
           x="79.489723"
           style="font-style:normal;font-weight:normal;font-size:2.11666656px;line-height:1.25;font-family:sans-serif;letter-spacing:0px;word-spacing:0px;fill:#000000;fill-opacity:1;stroke:none;stroke-width:0.26458332"
           xml:space="preserve"><tspan
             style="stroke-width:0.26458332"
             y="293.27643"
             x="79.489723"
             id="tspan7197-6"
             sodipodi:role="line">Schoko</tspan><tspan
             id="tspan7201-7"
             style="stroke-width:0.26458332"
             y="295.92227"
             x="79.489723"
             sodipodi:role="line">   1 €</tspan></text>
        <text
           id="text7199-3-5"
           y="293.27643"
           x="92.930695"
           style="font-style:normal;font-weight:normal;font-size:2.11666656px;line-height:1.25;font-family:sans-serif;letter-spacing:0px;word-spacing:0px;fill:#000000;fill-opacity:1;stroke:none;stroke-width:0.26458332"
           xml:space="preserve"><tspan
             style="stroke-width:0.26458332"
             y="293.27643"
             x="92.930695"
             id="tspan7197-6-3"
             sodipodi:role="line">Waldmeister</tspan><tspan
             id="tspan7201-7-5"
             style="stroke-width:0.26458332"
             y="295.92227"
             x="92.930695"
             sodipodi:role="line">       1 €</tspan></text>
      </g>
      <g
         id="g4759"
         transform="matrix(0.0232578,0,0,-0.02245526,71.75975,273.58673)">
        <path
           d="m 194.376,451.673 v -14.01 c 0,-14.767 -3.375,-27.839 -10.409,-40.089 -5.149,-8.963 -5.149,-19.197 0,-28.159 7.035,-12.252 10.409,-25.323 10.409,-40.091 V 132.509 c 0,-20.909 -25.318,-30.682 -39.564,-16.115 -4.437,-25.35 -41.035,-25.35 -45.471,0 C 95.095,101.827 69.774,111.6 69.774,132.509 v 196.815 c 0,14.768 3.375,27.839 10.412,40.091 5.148,8.963 5.148,19.196 0,28.159 -7.038,12.25 -10.412,25.322 -10.412,40.089 v 14.01 z"
           style="fill:#f68413;fill-opacity:1;fill-rule:evenodd;stroke:none"
           id="path70"
           inkscape:connector-curvature="0" />
        <path
           d="m 90.659,497.802 9.88,7.532 c 6.277,4.786 9.64,11.578 9.64,19.471 v 25.545 h 43.795 v -25.545 c 0,-7.893 3.362,-14.685 9.639,-19.471 l 9.879,-7.532 c 13.601,-10.367 20.884,-25.082 20.884,-42.181 v -3.948 H 69.774 v 3.948 c 0,17.099 7.286,31.814 20.885,42.181"
           style="fill:#c3ddf4;fill-opacity:1;fill-rule:evenodd;stroke:none"
           id="path72"
           inkscape:connector-curvature="0" />
        <path
           d="m 110.179,533.247 v 17.103 h 19.145 l 21.121,-3.273 -7.239,-28.9 c -0.417,19.4 -33.027,19.4 -33.027,15.07"
           style="fill:#95b8e0;fill-opacity:1;fill-rule:evenodd;stroke:none"
           id="path74"
           inkscape:connector-curvature="0" />
        <path
           d="m 142.789,550.35 h 11.185 v -25.545 c 0,-7.893 3.362,-14.685 9.639,-19.471 l 9.879,-7.532 c 13.601,-10.367 20.884,-25.082 20.884,-42.181 v -3.948 h -31.819 v 3.948 c 0,17.099 -3.564,31.814 -10.219,42.181 l -4.832,7.532 c -3.072,4.786 -4.717,11.578 -4.717,19.471 z"
           style="fill:#95b8e0;fill-opacity:1;fill-rule:evenodd;stroke:none"
           id="path76"
           inkscape:connector-curvature="0" />
        <path
           d="m 152.619,109.636 c -4.039,-8.088 -12.152,-12.171 -20.307,-12.249 4.94,0.196 9.82,6.531 10.888,19.007 2.677,-5.594 6.152,-7.596 9.419,-6.758 m 41.757,342.037 v -14.01 c 0,-14.767 -3.375,-27.839 -10.409,-40.089 -5.149,-8.963 -5.149,-19.197 0,-28.159 7.035,-12.252 10.409,-25.323 10.409,-40.091 V 132.509 c 0,-19.491 -21.996,-29.3 -36.519,-18.745 2.767,3.969 4.7,10.488 4.7,18.745 v 196.815 c 0,14.768 -1.651,27.839 -5.093,40.091 -2.519,8.962 -2.519,19.196 0,28.159 3.442,12.25 5.093,25.322 5.093,40.089 v 14.01 z"
           style="fill:#ef6d17;fill-opacity:1;fill-rule:evenodd;stroke:none"
           id="path78"
           inkscape:connector-curvature="0" />
        <path
           d="m 132.076,437.475 c 34.316,0 62.302,6.378 62.302,14.198 0,7.82 -27.986,14.198 -62.302,14.198 -34.315,0 -62.3,-6.378 -62.3,-14.198 0,-7.82 27.985,-14.198 62.3,-14.198"
           style="fill:#f9a93a;fill-opacity:1;fill-rule:evenodd;stroke:none"
           id="path80"
           inkscape:connector-curvature="0" />
        <path
           d="m 162.251,464.097 c 19.157,-2.423 32.125,-7.077 32.125,-12.424 0,-5.319 -12.829,-9.952 -31.819,-12.384 v 12.384 3.948 c 0,2.897 -0.102,5.725 -0.306,8.476"
           style="fill:#f68413;fill-opacity:1;fill-rule:evenodd;stroke:none"
           id="path82"
           inkscape:connector-curvature="0" />
        <path
           d="m 112.62,274.199 v -92.774 c -12.325,-0.043 -23.251,1.677 -31.822,6.365 v 92.774 c 8.571,-4.688 19.497,-6.406 31.822,-6.365 m -31.822,58.017 c 8.329,-3.793 18.597,-6.165 31.822,-6.365 v -28.152 c -13.225,0.203 -23.493,2.572 -31.822,6.365 z"
           style="fill:#fce7c1;fill-opacity:1;fill-rule:evenodd;stroke:none"
           id="path84"
           inkscape:connector-curvature="0" />
        <path
           d="m 157.177,543.346 c 0,-3.158 -11.239,-5.72 -25.101,-5.72 -13.862,0 -25.1,2.562 -25.1,5.72 v 26.071 h 50.201 z"
           style="fill:#f68413;fill-opacity:1;fill-rule:evenodd;stroke:none"
           id="path86"
           inkscape:connector-curvature="0" />
        <path
           d="m 132.076,563.697 c 13.825,0 25.101,2.57 25.101,5.72 0,3.149 -11.276,5.719 -25.101,5.719 -13.823,0 -25.1,-2.57 -25.1,-5.719 0,-3.15 11.277,-5.72 25.1,-5.72"
           style="fill:#f9a93a;fill-opacity:1;fill-rule:evenodd;stroke:none"
           id="path88"
           inkscape:connector-curvature="0" />
      </g>
      <g
         id="g7300"
         transform="matrix(0.02325787,0,0,-0.02325787,82.549607,273.66489)">
        <path
           d="m 367.385,451.673 v -14.01 c 0,-14.767 -3.376,-27.839 -10.412,-40.089 -5.148,-8.963 -5.148,-19.197 0,-28.159 7.038,-12.252 10.412,-25.323 10.412,-40.091 V 132.509 c 0,-20.909 -25.321,-30.682 -39.565,-16.115 -4.437,-25.35 -41.036,-25.35 -45.472,0 -14.244,-14.567 -39.566,-4.794 -39.566,16.115 v 196.815 c 0,14.768 3.376,27.839 10.41,40.091 5.15,8.963 5.15,19.196 0,28.159 -7.034,12.25 -10.41,25.322 -10.41,40.089 v 14.01 z"
           style="fill:#3a2216;fill-opacity:1;fill-rule:evenodd;stroke:none"
           id="path90"
           inkscape:connector-curvature="0" />
        <path
           d="m 263.666,497.802 c 3.293,2.51 6.587,5.022 9.881,7.532 6.276,4.786 9.639,11.578 9.639,19.471 v 25.545 h 43.795 v -25.545 c 0,-7.893 3.363,-14.685 9.641,-19.471 3.292,-2.51 6.585,-5.022 9.879,-7.532 13.599,-10.367 20.884,-25.082 20.884,-42.181 v -3.948 H 242.782 v 3.948 c 0,17.099 7.285,31.814 20.884,42.181"
           style="fill:#c3ddf4;fill-opacity:1;fill-rule:evenodd;stroke:none"
           id="path92"
           inkscape:connector-curvature="0" />
        <path
           d="m 283.186,533.247 v 17.103 h 19.146 c 7.039,-1.091 14.08,-2.182 21.119,-3.273 -2.411,-9.633 -4.823,-19.266 -7.236,-28.9 -0.418,19.4 -33.029,19.4 -33.029,15.07"
           style="fill:#95b8e0;fill-opacity:1;fill-rule:evenodd;stroke:none"
           id="path94"
           inkscape:connector-curvature="0" />
        <path
           d="m 315.797,550.35 h 11.184 v -25.545 c 0,-7.893 3.363,-14.685 9.641,-19.471 3.292,-2.51 6.585,-5.022 9.879,-7.532 13.599,-10.367 20.884,-25.082 20.884,-42.181 v -3.948 h -31.82 v 3.948 c 0,17.099 -3.565,31.814 -10.218,42.181 -1.612,2.51 -3.221,5.022 -4.834,7.532 -3.072,4.786 -4.716,11.578 -4.716,19.471 z"
           style="fill:#95b8e0;fill-opacity:1;fill-rule:evenodd;stroke:none"
           id="path96"
           inkscape:connector-curvature="0" />
        <path
           d="m 325.625,109.636 c -4.036,-8.088 -12.15,-12.171 -20.305,-12.249 4.939,0.196 9.819,6.531 10.888,19.007 2.676,-5.594 6.151,-7.596 9.417,-6.758 m 41.76,342.037 v -14.01 c 0,-14.767 -3.376,-27.839 -10.412,-40.089 -5.148,-8.963 -5.148,-19.197 0,-28.159 7.038,-12.252 10.412,-25.323 10.412,-40.091 V 132.509 c 0,-19.491 -21.998,-29.3 -36.52,-18.745 2.767,3.969 4.7,10.488 4.7,18.745 v 196.815 c 0,14.768 -1.651,27.839 -5.095,40.091 -2.518,8.962 -2.518,19.196 0,28.159 3.442,12.25 5.095,25.322 5.095,40.089 v 14.01 z"
           style="fill:#261a13;fill-opacity:1;fill-rule:evenodd;stroke:none"
           id="path98"
           inkscape:connector-curvature="0" />
        <path
           d="m 305.083,465.871 c 34.409,0 62.302,-6.357 62.302,-14.198 0,-7.843 -27.893,-14.198 -62.302,-14.198 -34.408,0 -62.301,6.355 -62.301,14.198 0,7.841 27.893,14.198 62.301,14.198"
           style="fill:#603616;fill-opacity:1;fill-rule:evenodd;stroke:none"
           id="path100"
           inkscape:connector-curvature="0" />
        <path
           d="m 335.259,464.097 c 19.158,-2.423 32.126,-7.077 32.126,-12.424 0,-5.319 -12.831,-9.952 -31.82,-12.384 v 12.384 3.948 c 0,2.897 -0.103,5.725 -0.306,8.476"
           style="fill:#3a2216;fill-opacity:1;fill-rule:evenodd;stroke:none"
           id="path102"
           inkscape:connector-curvature="0" />
        <path
           d="m 285.627,274.199 v -92.774 c -12.324,-0.043 -23.248,1.677 -31.822,6.365 v 92.774 c 8.574,-4.688 19.498,-6.406 31.822,-6.365 m -31.822,58.017 c 8.33,-3.793 18.597,-6.165 31.822,-6.365 v -28.152 c -13.225,0.203 -23.492,2.572 -31.822,6.365 z"
           style="fill:#ac9882;fill-opacity:1;fill-rule:evenodd;stroke:none"
           id="path104"
           inkscape:connector-curvature="0" />
        <path
           d="m 330.184,543.346 c 0,-3.158 -11.238,-5.72 -25.1,-5.72 -13.863,0 -25.102,2.562 -25.102,5.72 v 26.071 h 50.202 z"
           style="fill:#3a2216;fill-opacity:1;fill-rule:evenodd;stroke:none"
           id="path106"
           inkscape:connector-curvature="0" />
        <path
           d="m 305.084,575.136 c 13.862,0 25.1,-2.56 25.1,-5.719 0,-3.159 -11.238,-5.72 -25.1,-5.72 -13.863,0 -25.102,2.561 -25.102,5.72 0,3.159 11.239,5.719 25.102,5.719"
           style="fill:#603616;fill-opacity:1;fill-rule:evenodd;stroke:none"
           id="path108"
           inkscape:connector-curvature="0" />
      </g>
      <g
         id="g7357"
         transform="matrix(0.02325768,0,0,-0.02325768,94.50051,273.66487)">
        <path
           d="m 540.393,451.673 v -14.01 c 0,-14.767 -3.375,-27.839 -10.412,-40.089 -5.147,-8.963 -5.147,-19.197 0,-28.159 7.037,-12.252 10.412,-25.323 10.412,-40.091 V 132.509 c 0,-20.909 -25.321,-30.682 -39.565,-16.115 -4.438,-25.35 -41.036,-25.35 -45.474,0 -14.245,-14.567 -39.565,-4.794 -39.565,16.115 v 196.815 c 0,14.768 3.376,27.839 10.412,40.091 5.148,8.963 5.148,19.196 0,28.159 -7.036,12.25 -10.412,25.322 -10.412,40.089 v 14.01 z"
           style="fill:#2f9a3f;fill-opacity:1;fill-rule:evenodd;stroke:none"
           id="path110"
           inkscape:connector-curvature="0" />
        <path
           d="m 436.673,497.802 9.881,7.532 c 6.277,4.786 9.64,11.578 9.64,19.471 v 25.545 h 43.794 v -25.545 c 0,-7.893 3.363,-14.685 9.641,-19.471 l 9.88,-7.532 c 13.597,-10.367 20.884,-25.082 20.884,-42.181 v -3.948 H 415.789 v 3.948 c 0,17.099 7.285,31.814 20.884,42.181"
           style="fill:#c3ddf4;fill-opacity:1;fill-rule:evenodd;stroke:none"
           id="path112"
           inkscape:connector-curvature="0" />
        <path
           d="m 456.194,533.247 v 17.103 h 19.145 l 21.121,-3.273 -7.237,-28.9 c -0.417,19.4 -33.029,19.4 -33.029,15.07"
           style="fill:#95b8e0;fill-opacity:1;fill-rule:evenodd;stroke:none"
           id="path114"
           inkscape:connector-curvature="0" />
        <path
           d="m 488.806,550.35 h 11.182 v -25.545 c 0,-7.893 3.363,-14.685 9.641,-19.471 l 9.88,-7.532 c 13.597,-10.367 20.884,-25.082 20.884,-42.181 v -3.948 h -31.821 v 3.948 c 0,17.099 -3.565,31.814 -10.218,42.181 l -4.833,7.532 c -3.071,4.786 -4.715,11.578 -4.715,19.471 z"
           style="fill:#95b8e0;fill-opacity:1;fill-rule:evenodd;stroke:none"
           id="path116"
           inkscape:connector-curvature="0" />
        <path
           d="m 498.634,109.636 c -4.038,-8.088 -12.153,-12.171 -20.307,-12.249 4.941,0.196 9.82,6.531 10.888,19.007 2.676,-5.594 6.151,-7.596 9.419,-6.758 m 41.759,342.037 v -14.01 c 0,-14.767 -3.375,-27.839 -10.412,-40.089 -5.147,-8.963 -5.147,-19.197 0,-28.159 7.037,-12.252 10.412,-25.323 10.412,-40.091 V 132.509 c 0,-19.491 -21.997,-29.3 -36.521,-18.745 2.767,3.969 4.7,10.488 4.7,18.745 v 196.815 c 0,14.768 -1.651,27.839 -5.093,40.091 -2.519,8.962 -2.519,19.196 0,28.159 3.442,12.25 5.093,25.322 5.093,40.089 v 14.01 z"
           style="fill:#267837;fill-opacity:1;fill-rule:evenodd;stroke:none"
           id="path118"
           inkscape:connector-curvature="0" />
        <path
           d="m 478.091,437.475 c 34.313,0 62.302,6.378 62.302,14.198 0,7.82 -27.989,14.198 -62.302,14.198 -34.315,0 -62.302,-6.378 -62.302,-14.198 0,-7.82 27.987,-14.198 62.302,-14.198"
           style="fill:#47bc53;fill-opacity:1;fill-rule:evenodd;stroke:none"
           id="path120"
           inkscape:connector-curvature="0" />
        <path
           d="m 508.268,464.097 c 19.156,-2.423 32.125,-7.077 32.125,-12.424 0,-5.319 -12.832,-9.952 -31.821,-12.384 v 12.384 3.948 c 0,2.897 -0.102,5.725 -0.304,8.476"
           style="fill:#2f9a3f;fill-opacity:1;fill-rule:evenodd;stroke:none"
           id="path122"
           inkscape:connector-curvature="0" />
        <path
           d="m 458.636,274.199 v -92.774 c -12.326,-0.043 -23.251,1.677 -31.823,6.365 v 92.774 c 8.572,-4.688 19.497,-6.406 31.823,-6.365 m -31.823,58.017 c 8.33,-3.793 18.596,-6.165 31.823,-6.365 v -28.152 c -13.227,0.203 -23.493,2.572 -31.823,6.365 z"
           style="fill:#b1e2b3;fill-opacity:1;fill-rule:evenodd;stroke:none"
           id="path124"
           inkscape:connector-curvature="0" />
        <path
           d="m 503.191,543.346 c 0,-3.158 -11.238,-5.72 -25.1,-5.72 -13.862,0 -25.101,2.562 -25.101,5.72 v 26.071 h 50.201 z"
           style="fill:#2f9a3f;fill-opacity:1;fill-rule:evenodd;stroke:none"
           id="path126"
           inkscape:connector-curvature="0" />
        <path
           d="m 478.091,563.697 c 13.825,0 25.1,2.57 25.1,5.72 0,3.149 -11.275,5.719 -25.1,5.719 -13.825,0 -25.101,-2.57 -25.101,-5.719 0,-3.15 11.276,-5.72 25.101,-5.72"
           style="fill:#47bc53;fill-opacity:1;fill-rule:evenodd;stroke:none"
           id="path128"
           inkscape:connector-curvature="0" />
      </g>
    </g>
  </g>
</svg>
