<svg xmlns="http://www.w3.org/2000/svg"
     xmlns:xlink="http://www.w3.org/1999/xlink"
     viewBox="0 0 1000 1000">
  <rect x="25" y="25" width="950" height="950" rx="50" ry="50" fill="white" stroke="rgb(38, 64, 64)" stroke-width="50" />

  <rect x="100" y="200" width="800" height="600" rx="5" ry="5" fill="white" stroke="rgb(38, 64, 64)" stroke-width="50" />

  <rect x="200" y="200" width="25" height="600" rx="5" ry="5" fill="rgb(38, 64, 64)" stroke="rgb(38, 64, 64)" stroke-width="50" />
  <rect x="400" y="200" width="25" height="600" rx="5" ry="5" fill="rgb(38, 64, 64)" stroke="rgb(38, 64, 64)" stroke-width="50" />
  <rect x="600" y="200" width="25" height="600" rx="5" ry="5" fill="rgb(38, 64, 64)" stroke="rgb(38, 64, 64)" stroke-width="50" />
  <rect x="800" y="200" width="25" height="600" rx="5" ry="5" fill="rgb(38, 64, 64)" stroke="rgb(38, 64, 64)" stroke-width="50" />

  <rect x="100" y="300" width="800" height="400" rx="5" ry="5" fill="white" stroke="rgb(38, 64, 64)" stroke-width="50" />

  <polyline points="175,400 350,500 175,600" fill="rgb(38, 64, 64)" />

  <text x="365" y="550" fill="rgb(38, 64, 64)" font-size="170" font-family="Verdana">
    Video
  </text>
</svg>
