<svg xmlns="http://www.w3.org/2000/svg"
     xmlns:xlink="http://www.w3.org/1999/xlink"
     viewBox="0 0 1000 1000">
  <rect x="25" y="25" width="950" height="950" rx="50" ry="50" fill="white" stroke="rgb(38, 64, 64)" stroke-width="50" />

  <rect x="450" y="645" width="100" height="150" fill="rgb(38, 64, 64)" />
  <ellipse cx="500" cy="820" rx="150" ry="30" fill="rgb(38, 64, 64)" />
  <rect x="125" y="175" width="750" height="450" rx="5" ry="5" fill="white" stroke="rgb(38, 64, 64)" stroke-width="50" />
  <text x="500" y="440" fill="rgb(38, 64, 64)" text-anchor="middle" font-size="170" font-family="Verdana">
    Thonny
  </text>
</svg>
