<?xml version="1.0" encoding="UTF-8"?>
<svg width="512px" height="512px" viewBox="0 0 512 512" version="1.1" xmlns="http://www.w3.org/2000/svg" xmlns:xlink="http://www.w3.org/1999/xlink">
    <!-- Generator: Sketch 56 (81588) - https://sketch.com -->
    <title>loupe</title>
    <desc>Created with Sketch.</desc>
    <g id="Page-1" stroke="none" stroke-width="1" fill="none" fill-rule="evenodd">
        <g id="loupe" fill="#777E89" fill-rule="nonzero">
            <path d="M225.474,0 C101.151,0 0,101.151 0,225.474 C0,349.804 101.151,450.948 225.474,450.948 C349.804,450.948 450.948,349.804 450.948,225.474 C450.948,101.151 349.804,0 225.474,0 Z M225.474,409.323 C124.101,409.323 41.626,326.848 41.626,225.475 C41.626,124.102 124.101,41.626 225.474,41.626 C326.847,41.626 409.322,124.101 409.322,225.474 C409.322,326.847 326.847,409.323 225.474,409.323 Z" id="Shape"></path>
            <path d="M505.902,476.472 L386.574,357.144 C378.443,349.013 365.275,349.013 357.144,357.144 C349.013,365.268 349.013,378.45 357.144,386.574 L476.472,505.902 C480.537,509.967 485.859,512 491.187,512 C496.508,512 501.836,509.967 505.902,505.902 C514.033,497.778 514.033,484.596 505.902,476.472 Z" id="Path"></path>
        </g>
    </g>
</svg>