<?xml version="1.0" encoding="UTF-8"?>
<svg width="167px" height="140px" viewBox="0 0 167 140" version="1.1" xmlns="http://www.w3.org/2000/svg" xmlns:xlink="http://www.w3.org/1999/xlink">
    <!-- Generator: Sketch 56 (81588) - https://sketch.com -->
    <title>Group</title>
    <desc>Created with Sketch.</desc>
    <g id="Page-1" stroke="none" stroke-width="1" fill="none" fill-rule="evenodd">
        <g id="Group" fill="#FFFFFF">
            <rect id="Rectangle" x="0" y="0" width="167" height="20" rx="10"></rect>
            <rect id="Rectangle" x="0" y="60" width="167" height="20" rx="10"></rect>
            <rect id="Rectangle" x="0" y="120" width="167" height="20" rx="10"></rect>
        </g>
    </g>
</svg>