<?xml version="1.0" encoding="UTF-8"?>
<svg width="174px" height="174px" viewBox="0 0 174 174" version="1.1" xmlns="http://www.w3.org/2000/svg" xmlns:xlink="http://www.w3.org/1999/xlink">
    <!-- Generator: Sketch 56 (81588) - https://sketch.com -->
    <title>global</title>
    <desc>Created with Sketch.</desc>
    <g id="Page-1" stroke="none" stroke-width="1" fill="none" fill-rule="evenodd">
        <g id="global" fill="#777E89" fill-rule="nonzero">
            <path d="M157.918582,36.7807995 C157.915668,36.7247094 157.909476,36.6686193 157.900005,36.6128934 C157.682548,36.3022126 157.41519,36.0348742 157.191176,35.7303852 C155.566625,33.5173764 153.846641,31.3874101 152.031587,29.340122 C151.534387,28.7806781 151.036823,28.2274259 150.527238,27.6803654 C148.658276,25.6789693 146.697887,23.7704495 144.646435,21.9555346 C144.267252,21.6197226 143.912838,21.2718912 143.533654,20.9422709 C138.477876,16.6113151 132.942017,12.8736759 127.034989,9.80329013 C126.798591,9.67909066 126.550173,9.57346648 126.307583,9.44890278 C123.676976,8.11221052 120.979711,6.91064437 118.225987,5.84966765 C117.604214,5.62603575 117.038535,5.41442316 116.448087,5.22794185 C113.998876,4.34543358 111.512147,3.57255592 108.988264,2.90930889 C108.242282,2.71044405 107.4963,2.50538744 106.737933,2.33128965 C104.251204,1.7532704 101.764839,1.31183416 99.2220161,0.951255046 C98.4512649,0.839439099 97.6928982,0.690108356 96.9155905,0.596867697 C90.3667549,-0.198955899 83.7457981,-0.198955899 77.1965982,0.596867697 C76.4196548,0.690108356 75.6612881,0.839439099 74.8901726,0.951255046 C72.3477135,1.31183416 69.8362156,1.7532704 67.3742555,2.33128965 C66.6158888,2.50538744 65.8699065,2.71044405 65.1239243,2.90930889 C62.5832864,3.5721917 60.0969217,4.34506935 57.6641016,5.22794185 C57.0423283,5.43919021 56.4766493,5.6508028 55.8862014,5.84966765 C53.1328421,6.91064437 50.4352128,8.1118463 47.8046054,9.44890278 C47.5620155,9.57310226 47.3135976,9.67872644 47.0771999,9.80329013 C41.1505019,12.8703979 35.5960665,16.6076729 30.5224401,20.9422709 C30.1432567,21.271527 29.7888423,21.6197226 29.4096589,21.9555346 C27.3374454,23.7788266 25.3770565,25.6873463 23.5288563,27.6803654 C23.0192717,28.2274259 22.5217074,28.7806781 22.0245073,29.340122 C20.2050827,31.3830394 18.4850982,33.5130057 16.864918,35.7300209 C16.641269,36.03451 16.3739101,36.3018484 16.1560891,36.6125292 C16.1276777,36.6667982 16.1025445,36.7228883 16.0814181,36.7804352 C-5.36047269,66.8276019 -5.36047269,107.172398 16.0814181,137.219201 C16.1025445,137.276748 16.1273135,137.332838 16.1560891,137.387107 C16.3735459,137.697787 16.6409048,137.965126 16.864918,138.269615 C18.4854625,140.482624 20.2050827,142.61259 22.0245073,144.659878 C22.5217074,145.219322 23.0192717,145.772574 23.5288563,146.319635 C25.4021897,148.321031 27.3622144,150.22955 29.4096589,152.044465 C29.7888423,152.380277 30.1432567,152.728109 30.5224401,153.057729 C35.5782183,157.388685 41.114077,161.126324 47.0211055,164.19671 C47.2575032,164.320909 47.5059211,164.426534 47.7485111,164.551097 C50.3791185,165.887789 53.0763835,167.089356 55.8301071,168.150332 C56.4518804,168.373964 57.0175593,168.585577 57.6080072,168.772058 C60.0572185,169.654566 62.5439475,170.427444 65.0678299,171.090691 C65.8138122,171.289556 66.5597944,171.494613 67.3181612,171.66871 C69.8048901,172.24673 72.2912549,172.688166 74.8340782,173.048745 C75.6048294,173.160561 76.3631962,173.309892 77.1405039,173.403132 C83.6893394,174.198956 90.3102963,174.198956 96.8594961,173.403132 C97.6364396,173.309892 98.3948063,173.160561 99.1659218,173.048745 C101.708381,172.688166 104.219879,172.24673 106.681839,171.66871 C107.440206,171.494613 108.186188,171.289556 108.93217,171.090691 C111.476815,170.427808 113.963544,169.654931 116.391993,168.772058 C117.013766,168.56081 117.579445,168.349197 118.169893,168.150332 C120.923252,167.089356 123.620882,165.888154 126.251489,164.551097 C126.494079,164.426898 126.742497,164.321274 126.978894,164.19671 C132.885923,161.12596 138.421782,157.388685 143.47756,153.057729 C143.856743,152.728109 144.211158,152.380277 144.590341,152.044465 C146.662555,150.22518 148.622944,148.317024 150.471144,146.319635 C150.980728,145.772574 151.478293,145.219322 151.975493,144.659878 C153.794917,142.61259 155.514902,140.482624 157.135082,138.269615 C157.358731,137.965126 157.62609,137.697787 157.843911,137.387107 C157.872322,137.332838 157.897455,137.276748 157.918582,137.219201 C179.360473,107.172762 179.360473,66.8279661 157.918582,36.7807995 Z M150.825558,48.5418703 C156.770833,58.3325037 160.360873,69.3698668 161.312656,80.7845631 L124.075829,80.7845631 C123.619789,73.3777582 122.454191,66.0321425 120.5947,58.8482411 C131.113122,56.8785322 141.294251,53.407503 150.825558,48.5418703 Z M102.846295,14.1233193 C103.194517,14.2041764 103.529991,14.3159924 103.878213,14.3968495 C106.103775,14.9191429 108.310761,15.5157374 110.467845,16.2616627 C110.79749,16.3734786 111.120579,16.5042341 111.444032,16.6222418 C113.582539,17.3681671 115.68972,18.1949495 117.75392,19.1087808 C118.114527,19.2766868 118.468941,19.4631681 118.829548,19.6310741 C120.806328,20.5718578 122.737577,21.589128 124.623295,22.6832489 L125.866478,23.4353659 C127.656762,24.5294868 129.397509,25.7000941 131.088353,26.9475521 C131.523631,27.2644247 131.958545,27.5692779 132.38763,27.9171093 C134.045328,29.1601967 135.632726,30.4925183 137.149459,31.9140741 C137.547219,32.2746532 137.957728,32.6290406 138.349296,33.0020032 C139.940701,34.5124291 141.457434,36.1099038 142.92463,37.7634686 C143.111125,37.9809087 143.310005,38.1797736 143.496501,38.3851944 C135.079067,42.3963639 126.161884,45.2606004 116.983169,46.9010532 C112.730925,35.2124624 107.113838,24.0665614 100.24847,13.694995 C101.111741,13.8501533 101.994681,13.9372022 102.846295,14.1233193 Z M62.3891416,80.7841989 C62.879421,74.0584879 64.0246203,67.3965156 65.8083484,60.8929796 C72.8518343,61.729596 79.9386659,62.1444441 87.0316897,62.136067 C94.13127,62.1338817 101.224658,61.7084712 108.273608,60.8616566 C110.054058,67.375755 111.193065,74.0482897 111.673873,80.7841989 L62.3891416,80.7841989 Z M111.673873,93.2165296 C111.183594,99.9422406 110.038395,106.604213 108.254667,113.107749 C101.211181,112.271132 94.1243492,111.856284 87.0313254,111.864661 C79.9321094,111.856649 72.8390856,112.271497 65.7894075,113.107749 C64.0107788,106.603849 62.872136,99.9418763 62.3887774,93.2165296 L111.673873,93.2165296 L111.673873,93.2165296 Z M87.0313254,16.4608917 C94.1057725,26.4868122 99.9242885,37.3424287 104.356836,48.7844417 C98.6020641,49.3956051 92.8188802,49.7026436 87.0313254,49.7044647 C81.2503271,49.6975445 75.4733355,49.3886849 69.7243911,48.7782499 C74.1624028,37.3438856 79.9739981,26.4919113 87.0313254,16.4608917 Z M31.1449419,37.7569126 C32.6059452,36.1033478 34.1288709,34.5058731 35.7202755,32.9954472 C36.1118433,32.6224846 36.5223521,32.2680972 36.9201122,31.9075181 C38.4536011,30.5110936 40.040999,29.178772 41.6819414,27.9105533 C42.1110269,27.580933 42.5459404,27.2888275 42.9812181,26.9409961 C44.6720627,25.6979088 46.4128094,24.5269372 48.203094,23.4288099 L49.4462764,22.6766929 C51.3319943,21.5745591 53.2632433,20.5569248 55.2400234,19.6245182 C55.6006301,19.4566121 55.9550445,19.2701308 56.3156512,19.1022248 C58.3794869,18.1698182 60.4870325,17.3430358 62.6255393,16.6156858 C62.9486283,16.4976781 63.2473126,16.3669226 63.6013628,16.2551067 C65.7584463,15.5339485 67.9530474,14.9373539 70.1909943,14.3902935 C70.5392164,14.3094364 70.8746899,14.1976204 71.2291043,14.122955 C72.0807189,13.9364737 72.9636588,13.8494248 73.8276578,13.6939023 C66.9593758,24.0672899 61.3404683,35.2153762 57.0864024,46.9061523 C47.907688,45.2656995 38.9901402,42.401463 30.5730707,38.3902935 C30.7595663,38.1732176 30.9584463,37.9743527 31.1449419,37.7569126 Z M23.237457,48.5418703 C32.7665791,53.4071387 42.9455217,56.878168 53.4621233,58.8482411 C51.6048169,66.0325068 50.4410408,73.3781224 49.9871864,80.7845631 L12.7503595,80.7845631 C13.7025068,69.3698668 17.2925465,58.3325037 23.237457,48.5418703 Z M23.237457,125.459222 C17.2921823,115.668589 13.7021426,104.631226 12.7503595,93.2165296 L49.9871864,93.2165296 C50.4432263,100.623334 51.6088236,107.96895 53.4683156,115.152852 C42.9498927,117.122196 32.7687646,120.593225 23.237457,125.459222 Z M71.2167199,159.877409 C70.8684977,159.796552 70.5330242,159.684736 70.184802,159.603879 C67.9592397,159.081586 65.7522541,158.484991 63.5951706,157.739066 C63.2655251,157.62725 62.9424361,157.496494 62.6189828,157.378487 C60.480476,156.632561 58.3732947,155.805779 56.3090947,154.891948 C55.9484881,154.724042 55.5940736,154.53756 55.233467,154.369654 C53.2566868,153.428871 51.3254378,152.4116 49.4397199,151.31748 L48.1965375,150.565363 C46.4062529,149.471242 44.6655062,148.300634 42.9746617,147.053176 C42.5393839,146.736304 42.1044704,146.431451 41.6753849,146.083619 C40.017687,144.840532 38.4302892,143.50821 36.9135557,142.086654 C36.5157956,141.726075 36.1052868,141.371688 35.713719,140.998725 C34.1223144,139.488299 32.605581,137.890825 31.1383854,136.23726 C30.9518898,136.01982 30.7530098,135.820955 30.5665142,135.615534 C38.9839479,131.604365 47.9011315,128.740128 57.0798459,127.099675 C61.3320906,138.788266 66.9491768,149.934167 73.8145448,160.305733 C72.9509101,160.150939 72.0683344,160.06389 71.2167199,159.877409 Z M87.0313254,157.540201 C79.9568783,147.514281 74.1383623,136.658664 69.7058144,125.216651 C81.2186374,123.97757 92.8312647,123.97757 104.344088,125.216651 L104.337896,125.222843 C99.9006123,136.656843 94.0890171,147.508817 87.0313254,157.540201 Z M142.918073,136.243816 C141.45707,137.897381 139.934144,139.494855 138.34274,141.005281 C137.951172,141.378244 137.540663,141.732631 137.142903,142.09321 C135.609414,143.494006 134.022016,144.826327 132.381074,146.090175 C131.951988,146.419431 131.517075,146.74286 131.081797,147.059732 C129.390952,148.30282 127.650206,149.473791 125.859921,150.571919 L124.616739,151.324036 C122.735028,152.422163 120.803779,153.439433 118.822992,154.37621 C118.462385,154.544116 118.107971,154.730598 117.747364,154.898504 C115.683528,155.83091 113.575983,156.657693 111.437476,157.385043 C111.114387,157.50305 110.815702,157.633806 110.461652,157.745622 C108.304569,158.46678 106.109968,159.063375 103.872021,159.610435 C103.523799,159.691292 103.188325,159.803108 102.833911,159.877773 C101.982296,160.064255 101.099356,160.151304 100.235357,160.306826 C107.100725,149.93526 112.718176,138.789359 116.970056,127.100768 C126.148771,128.741221 135.066318,131.605457 143.483388,135.616627 C143.303449,135.827511 143.104569,136.026376 142.918073,136.243816 Z M150.825558,125.459222 C141.296436,120.593954 131.117493,117.122925 120.600892,115.152852 C122.458198,107.968586 123.621974,100.62297 124.075829,93.2165296 L161.312656,93.2165296 C160.360508,104.630862 156.770469,115.668225 150.825558,125.459222 Z" id="Shape"></path>
        </g>
    </g>
</svg>