@startuml
skinparam monochrome true
hide circle
'skinparam linetype ortho
entity advisorEntity <<@Document>> {
  *_id : ObjectId <<generated>>
  --
  *name : text
  *slack_uuid : text
  *enabled : boolean
}

entity organizationEntity <<@Document>> {
  *_id : ObjectId <<generated>>
  --
  *name : text
  *slackId : text
  *email : text
  *uuidf : text
  *address : text
  *socialNetwork : text
  *logo : text
  *services: [text]
}


entity businessHoursEntity {
  *weekday : text
  *saturday : text
}



'organizationEntity "1" o-- "0..*" advisorEntity
organizationEntity "1" *-- "1" businessHoursEntity

@enduml
