@startuml
skinparam monochrome true

rectangle client-bot {
    actor Client as ub
    rectangle Chat as cb
    rectangle Bot as bb
    rectangle Slack as sb

    ub --> cb
    ub <-- cb

    cb --> bb
    cb <-- bb

    cb --[hidden]> sb
    sb --[hidden]> cb
}

rectangle client-advisor {
    actor Client
    rectangle Chat
    rectangle Bot
    rectangle Slack

    Client --> Chat
    Client <-- Chat

    Chat -[hidden]-> Bot
    Chat <-[hidden]- Bot

    Chat --> Slack
    Slack --> Chat
}

@enduml
