@startuml
skinparam monochrome true

node client
node hosting as "vixlum-hosting"
node ngrok as "ngrok"
node localServer as "vixlum-local-server"

component chatbotWidget as "chatbot-widget"
component staticWebSite as "static-web-site"

component ngrokComponent as "ngrok-service"

rectangle docker-rasa{
component chatbotBot as "chatbot-vixlum-rasa"
}

rectangle docker-actions{
component chatbotActions as "chatbot-vixlum-actions"
}

client - hosting: http
hosting - ngrok : http
ngrok - localServer: http
hosting -.> staticWebSite

staticWebSite -.> chatbotWidget
localServer -.> ngrokComponent
localServer --.> chatbotActions
localServer --.> chatbotBot

chatbotActions - chatbotBot: http
ngrokComponent -- chatbotBot

@enduml
