@startuml
'https://plantuml.com/sequence-diagram

skinparam monochrome true


participant Client
participant Chat
participant Bot
participant Slack
participant Advisor


group  client request human

Client -> Chat: send message (request human)
Chat -> Bot--++: request human
Bot -> Slack++: create channel and request wss
Slack -> Advisor: send message (join advisor)
Slack --> Bot--: return channel id and wss
Bot --> Chat--: return channel id and wss

end



@enduml
