%YAML 1.1
%TAG !u! tag:unity3d.com,2011:
--- !u!29 &1
OcclusionCullingSettings:
  m_ObjectHideFlags: 0
  serializedVersion: 2
  m_OcclusionBakeSettings:
    smallestOccluder: 5
    smallestHole: 0.25
    backfaceThreshold: 100
  m_SceneGUID: 00000000000000000000000000000000
  m_OcclusionCullingData: {fileID: 0}
--- !u!104 &2
RenderSettings:
  m_ObjectHideFlags: 0
  serializedVersion: 9
  m_Fog: 0
  m_FogColor: {r: 0.5, g: 0.5, b: 0.5, a: 1}
  m_FogMode: 3
  m_FogDensity: 0.01
  m_LinearFogStart: 0
  m_LinearFogEnd: 300
  m_AmbientSkyColor: {r: 0.212, g: 0.227, b: 0.259, a: 1}
  m_AmbientEquatorColor: {r: 0.114, g: 0.125, b: 0.133, a: 1}
  m_AmbientGroundColor: {r: 0.047, g: 0.043, b: 0.035, a: 1}
  m_AmbientIntensity: 1
  m_AmbientMode: 0
  m_SubtractiveShadowColor: {r: 0.42, g: 0.478, b: 0.627, a: 1}
  m_SkyboxMaterial: {fileID: 10304, guid: 0000000000000000f000000000000000, type: 0}
  m_HaloStrength: 0.5
  m_FlareStrength: 1
  m_FlareFadeSpeed: 3
  m_HaloTexture: {fileID: 0}
  m_SpotCookie: {fileID: 10001, guid: 0000000000000000e000000000000000, type: 0}
  m_DefaultReflectionMode: 0
  m_DefaultReflectionResolution: 128
  m_ReflectionBounces: 1
  m_ReflectionIntensity: 1
  m_CustomReflection: {fileID: 0}
  m_Sun: {fileID: 705507994}
  m_IndirectSpecularColor: {r: 0.44657898, g: 0.4964133, b: 0.5748178, a: 1}
  m_UseRadianceAmbientProbe: 0
--- !u!157 &3
LightmapSettings:
  m_ObjectHideFlags: 0
  serializedVersion: 12
  m_GIWorkflowMode: 1
  m_GISettings:
    serializedVersion: 2
    m_BounceScale: 1
    m_IndirectOutputScale: 1
    m_AlbedoBoost: 1
    m_EnvironmentLightingMode: 0
    m_EnableBakedLightmaps: 1
    m_EnableRealtimeLightmaps: 0
  m_LightmapEditorSettings:
    serializedVersion: 12
    m_Resolution: 2
    m_BakeResolution: 40
    m_AtlasSize: 1024
    m_AO: 0
    m_AOMaxDistance: 1
    m_CompAOExponent: 1
    m_CompAOExponentDirect: 0
    m_ExtractAmbientOcclusion: 0
    m_Padding: 2
    m_LightmapParameters: {fileID: 0}
    m_LightmapsBakeMode: 1
    m_TextureCompression: 1
    m_FinalGather: 0
    m_FinalGatherFiltering: 1
    m_FinalGatherRayCount: 256
    m_ReflectionCompression: 2
    m_MixedBakeMode: 2
    m_BakeBackend: 1
    m_PVRSampling: 1
    m_PVRDirectSampleCount: 32
    m_PVRSampleCount: 500
    m_PVRBounces: 2
    m_PVREnvironmentSampleCount: 500
    m_PVREnvironmentReferencePointCount: 2048
    m_PVRFilteringMode: 2
    m_PVRDenoiserTypeDirect: 0
    m_PVRDenoiserTypeIndirect: 0
    m_PVRDenoiserTypeAO: 0
    m_PVRFilterTypeDirect: 0
    m_PVRFilterTypeIndirect: 0
    m_PVRFilterTypeAO: 0
    m_PVREnvironmentMIS: 0
    m_PVRCulling: 1
    m_PVRFilteringGaussRadiusDirect: 1
    m_PVRFilteringGaussRadiusIndirect: 5
    m_PVRFilteringGaussRadiusAO: 2
    m_PVRFilteringAtrousPositionSigmaDirect: 0.5
    m_PVRFilteringAtrousPositionSigmaIndirect: 2
    m_PVRFilteringAtrousPositionSigmaAO: 1
    m_ExportTrainingData: 0
    m_TrainingDataDestination: TrainingData
    m_LightProbeSampleCountMultiplier: 4
  m_LightingDataAsset: {fileID: 0}
  m_LightingSettings: {fileID: 0}
--- !u!196 &4
NavMeshSettings:
  serializedVersion: 2
  m_ObjectHideFlags: 0
  m_BuildSettings:
    serializedVersion: 3
    agentTypeID: 0
    agentRadius: 0.5
    agentHeight: 2
    agentSlope: 45
    agentClimb: 0.4
    ledgeDropHeight: 0
    maxJumpAcrossDistance: 0
    minRegionArea: 2
    manualCellSize: 0
    cellSize: 0.16666667
    manualTileSize: 0
    tileSize: 256
    buildHeightMesh: 0
    maxJobWorkers: 0
    preserveTilesOutsideBounds: 0
    debug:
      m_Flags: 0
  m_NavMeshData: {fileID: 0}
--- !u!1001 &26081763
PrefabInstance:
  m_ObjectHideFlags: 0
  serializedVersion: 2
  m_Modification:
    serializedVersion: 3
    m_TransformParent: {fileID: 0}
    m_Modifications:
    - target: {fileID: 1705132085743413769, guid: 49701d0094406424bbfe5cab2b819618, type: 3}
      propertyPath: m_Name
      value: Wall (11)
      objectReference: {fileID: 0}
    - target: {fileID: 1736867905531120063, guid: 49701d0094406424bbfe5cab2b819618, type: 3}
      propertyPath: m_LocalScale.x
      value: 48.11842
      objectReference: {fileID: 0}
    - target: {fileID: 1736867905531120063, guid: 49701d0094406424bbfe5cab2b819618, type: 3}
      propertyPath: m_LocalScale.y
      value: 2.2346165
      objectReference: {fileID: 0}
    - target: {fileID: 1736867905531120063, guid: 49701d0094406424bbfe5cab2b819618, type: 3}
      propertyPath: m_LocalPosition.x
      value: 240.20001
      objectReference: {fileID: 0}
    - target: {fileID: 1736867905531120063, guid: 49701d0094406424bbfe5cab2b819618, type: 3}
      propertyPath: m_LocalPosition.y
      value: 29
      objectReference: {fileID: 0}
    - target: {fileID: 1736867905531120063, guid: 49701d0094406424bbfe5cab2b819618, type: 3}
      propertyPath: m_LocalPosition.z
      value: 0
      objectReference: {fileID: 0}
    - target: {fileID: 1736867905531120063, guid: 49701d0094406424bbfe5cab2b819618, type: 3}
      propertyPath: m_LocalRotation.w
      value: 0.72600305
      objectReference: {fileID: 0}
    - target: {fileID: 1736867905531120063, guid: 49701d0094406424bbfe5cab2b819618, type: 3}
      propertyPath: m_LocalRotation.x
      value: -0
      objectReference: {fileID: 0}
    - target: {fileID: 1736867905531120063, guid: 49701d0094406424bbfe5cab2b819618, type: 3}
      propertyPath: m_LocalRotation.y
      value: -0
      objectReference: {fileID: 0}
    - target: {fileID: 1736867905531120063, guid: 49701d0094406424bbfe5cab2b819618, type: 3}
      propertyPath: m_LocalRotation.z
      value: -0.6876914
      objectReference: {fileID: 0}
    - target: {fileID: 1736867905531120063, guid: 49701d0094406424bbfe5cab2b819618, type: 3}
      propertyPath: m_LocalEulerAnglesHint.x
      value: 0
      objectReference: {fileID: 0}
    - target: {fileID: 1736867905531120063, guid: 49701d0094406424bbfe5cab2b819618, type: 3}
      propertyPath: m_LocalEulerAnglesHint.y
      value: 0
      objectReference: {fileID: 0}
    - target: {fileID: 1736867905531120063, guid: 49701d0094406424bbfe5cab2b819618, type: 3}
      propertyPath: m_LocalEulerAnglesHint.z
      value: -86.895
      objectReference: {fileID: 0}
    - target: {fileID: 6539184298975600710, guid: 49701d0094406424bbfe5cab2b819618, type: 3}
      propertyPath: m_Material
      value: 
      objectReference: {fileID: 13400000, guid: d80b0a8adc78a8d48bd4fd8289f30cee, type: 2}
    m_RemovedComponents: []
    m_RemovedGameObjects: []
    m_AddedGameObjects: []
    m_AddedComponents: []
  m_SourcePrefab: {fileID: 100100000, guid: 49701d0094406424bbfe5cab2b819618, type: 3}
--- !u!1001 &52624079
PrefabInstance:
  m_ObjectHideFlags: 0
  serializedVersion: 2
  m_Modification:
    serializedVersion: 3
    m_TransformParent: {fileID: 0}
    m_Modifications:
    - target: {fileID: 1705132085743413769, guid: 49701d0094406424bbfe5cab2b819618, type: 3}
      propertyPath: m_Name
      value: Wall (5)
      objectReference: {fileID: 0}
    - target: {fileID: 1736867905531120063, guid: 49701d0094406424bbfe5cab2b819618, type: 3}
      propertyPath: m_LocalScale.x
      value: 48.11842
      objectReference: {fileID: 0}
    - target: {fileID: 1736867905531120063, guid: 49701d0094406424bbfe5cab2b819618, type: 3}
      propertyPath: m_LocalScale.y
      value: 2.2346165
      objectReference: {fileID: 0}
    - target: {fileID: 1736867905531120063, guid: 49701d0094406424bbfe5cab2b819618, type: 3}
      propertyPath: m_LocalPosition.x
      value: 32.3
      objectReference: {fileID: 0}
    - target: {fileID: 1736867905531120063, guid: 49701d0094406424bbfe5cab2b819618, type: 3}
      propertyPath: m_LocalPosition.y
      value: 29
      objectReference: {fileID: 0}
    - target: {fileID: 1736867905531120063, guid: 49701d0094406424bbfe5cab2b819618, type: 3}
      propertyPath: m_LocalPosition.z
      value: 0
      objectReference: {fileID: 0}
    - target: {fileID: 1736867905531120063, guid: 49701d0094406424bbfe5cab2b819618, type: 3}
      propertyPath: m_LocalRotation.w
      value: 0.72600305
      objectReference: {fileID: 0}
    - target: {fileID: 1736867905531120063, guid: 49701d0094406424bbfe5cab2b819618, type: 3}
      propertyPath: m_LocalRotation.x
      value: -0
      objectReference: {fileID: 0}
    - target: {fileID: 1736867905531120063, guid: 49701d0094406424bbfe5cab2b819618, type: 3}
      propertyPath: m_LocalRotation.y
      value: -0
      objectReference: {fileID: 0}
    - target: {fileID: 1736867905531120063, guid: 49701d0094406424bbfe5cab2b819618, type: 3}
      propertyPath: m_LocalRotation.z
      value: -0.6876914
      objectReference: {fileID: 0}
    - target: {fileID: 1736867905531120063, guid: 49701d0094406424bbfe5cab2b819618, type: 3}
      propertyPath: m_LocalEulerAnglesHint.x
      value: 0
      objectReference: {fileID: 0}
    - target: {fileID: 1736867905531120063, guid: 49701d0094406424bbfe5cab2b819618, type: 3}
      propertyPath: m_LocalEulerAnglesHint.y
      value: 0
      objectReference: {fileID: 0}
    - target: {fileID: 1736867905531120063, guid: 49701d0094406424bbfe5cab2b819618, type: 3}
      propertyPath: m_LocalEulerAnglesHint.z
      value: -86.895
      objectReference: {fileID: 0}
    - target: {fileID: 4334561915182112163, guid: 49701d0094406424bbfe5cab2b819618, type: 3}
      propertyPath: m_Materials.Array.data[0]
      value: 
      objectReference: {fileID: 2100000, guid: c8b0bd1e6dd3f214cb5bc0a55375b703, type: 2}
    - target: {fileID: 6539184298975600710, guid: 49701d0094406424bbfe5cab2b819618, type: 3}
      propertyPath: m_Material
      value: 
      objectReference: {fileID: 13400000, guid: d80b0a8adc78a8d48bd4fd8289f30cee, type: 2}
    m_RemovedComponents: []
    m_RemovedGameObjects: []
    m_AddedGameObjects: []
    m_AddedComponents: []
  m_SourcePrefab: {fileID: 100100000, guid: 49701d0094406424bbfe5cab2b819618, type: 3}
--- !u!1001 &87564175
PrefabInstance:
  m_ObjectHideFlags: 0
  serializedVersion: 2
  m_Modification:
    serializedVersion: 3
    m_TransformParent: {fileID: 0}
    m_Modifications:
    - target: {fileID: 1705132085743413769, guid: 49701d0094406424bbfe5cab2b819618, type: 3}
      propertyPath: m_Name
      value: Wall (1)
      objectReference: {fileID: 0}
    - target: {fileID: 1736867905531120063, guid: 49701d0094406424bbfe5cab2b819618, type: 3}
      propertyPath: m_LocalScale.x
      value: 48.11842
      objectReference: {fileID: 0}
    - target: {fileID: 1736867905531120063, guid: 49701d0094406424bbfe5cab2b819618, type: 3}
      propertyPath: m_LocalScale.y
      value: 2.2346165
      objectReference: {fileID: 0}
    - target: {fileID: 1736867905531120063, guid: 49701d0094406424bbfe5cab2b819618, type: 3}
      propertyPath: m_LocalPosition.x
      value: 34.9
      objectReference: {fileID: 0}
    - target: {fileID: 1736867905531120063, guid: 49701d0094406424bbfe5cab2b819618, type: 3}
      propertyPath: m_LocalPosition.y
      value: -34.8
      objectReference: {fileID: 0}
    - target: {fileID: 1736867905531120063, guid: 49701d0094406424bbfe5cab2b819618, type: 3}
      propertyPath: m_LocalPosition.z
      value: 0
      objectReference: {fileID: 0}
    - target: {fileID: 1736867905531120063, guid: 49701d0094406424bbfe5cab2b819618, type: 3}
      propertyPath: m_LocalRotation.w
      value: 0.9898052
      objectReference: {fileID: 0}
    - target: {fileID: 1736867905531120063, guid: 49701d0094406424bbfe5cab2b819618, type: 3}
      propertyPath: m_LocalRotation.x
      value: -0
      objectReference: {fileID: 0}
    - target: {fileID: 1736867905531120063, guid: 49701d0094406424bbfe5cab2b819618, type: 3}
      propertyPath: m_LocalRotation.y
      value: -0
      objectReference: {fileID: 0}
    - target: {fileID: 1736867905531120063, guid: 49701d0094406424bbfe5cab2b819618, type: 3}
      propertyPath: m_LocalRotation.z
      value: -0.1424278
      objectReference: {fileID: 0}
    - target: {fileID: 1736867905531120063, guid: 49701d0094406424bbfe5cab2b819618, type: 3}
      propertyPath: m_LocalEulerAnglesHint.x
      value: 0
      objectReference: {fileID: 0}
    - target: {fileID: 1736867905531120063, guid: 49701d0094406424bbfe5cab2b819618, type: 3}
      propertyPath: m_LocalEulerAnglesHint.y
      value: 0
      objectReference: {fileID: 0}
    - target: {fileID: 1736867905531120063, guid: 49701d0094406424bbfe5cab2b819618, type: 3}
      propertyPath: m_LocalEulerAnglesHint.z
      value: -16.377
      objectReference: {fileID: 0}
    - target: {fileID: 4334561915182112163, guid: 49701d0094406424bbfe5cab2b819618, type: 3}
      propertyPath: m_Materials.Array.data[0]
      value: 
      objectReference: {fileID: 2100000, guid: c8b0bd1e6dd3f214cb5bc0a55375b703, type: 2}
    - target: {fileID: 6539184298975600710, guid: 49701d0094406424bbfe5cab2b819618, type: 3}
      propertyPath: m_Material
      value: 
      objectReference: {fileID: 13400000, guid: d80b0a8adc78a8d48bd4fd8289f30cee, type: 2}
    m_RemovedComponents: []
    m_RemovedGameObjects: []
    m_AddedGameObjects: []
    m_AddedComponents: []
  m_SourcePrefab: {fileID: 100100000, guid: 49701d0094406424bbfe5cab2b819618, type: 3}
--- !u!1001 &276409995
PrefabInstance:
  m_ObjectHideFlags: 0
  serializedVersion: 2
  m_Modification:
    serializedVersion: 3
    m_TransformParent: {fileID: 0}
    m_Modifications:
    - target: {fileID: 1705132085743413769, guid: 49701d0094406424bbfe5cab2b819618, type: 3}
      propertyPath: m_Name
      value: Wall (2)
      objectReference: {fileID: 0}
    - target: {fileID: 1736867905531120063, guid: 49701d0094406424bbfe5cab2b819618, type: 3}
      propertyPath: m_LocalScale.x
      value: 48.11842
      objectReference: {fileID: 0}
    - target: {fileID: 1736867905531120063, guid: 49701d0094406424bbfe5cab2b819618, type: 3}
      propertyPath: m_LocalScale.y
      value: 2.2346165
      objectReference: {fileID: 0}
    - target: {fileID: 1736867905531120063, guid: 49701d0094406424bbfe5cab2b819618, type: 3}
      propertyPath: m_LocalPosition.x
      value: 93.57001
      objectReference: {fileID: 0}
    - target: {fileID: 1736867905531120063, guid: 49701d0094406424bbfe5cab2b819618, type: 3}
      propertyPath: m_LocalPosition.y
      value: -114.7
      objectReference: {fileID: 0}
    - target: {fileID: 1736867905531120063, guid: 49701d0094406424bbfe5cab2b819618, type: 3}
      propertyPath: m_LocalPosition.z
      value: 0
      objectReference: {fileID: 0}
    - target: {fileID: 1736867905531120063, guid: 49701d0094406424bbfe5cab2b819618, type: 3}
      propertyPath: m_LocalRotation.w
      value: 0.9898052
      objectReference: {fileID: 0}
    - target: {fileID: 1736867905531120063, guid: 49701d0094406424bbfe5cab2b819618, type: 3}
      propertyPath: m_LocalRotation.x
      value: -0
      objectReference: {fileID: 0}
    - target: {fileID: 1736867905531120063, guid: 49701d0094406424bbfe5cab2b819618, type: 3}
      propertyPath: m_LocalRotation.y
      value: -0
      objectReference: {fileID: 0}
    - target: {fileID: 1736867905531120063, guid: 49701d0094406424bbfe5cab2b819618, type: 3}
      propertyPath: m_LocalRotation.z
      value: -0.1424278
      objectReference: {fileID: 0}
    - target: {fileID: 1736867905531120063, guid: 49701d0094406424bbfe5cab2b819618, type: 3}
      propertyPath: m_LocalEulerAnglesHint.x
      value: 0
      objectReference: {fileID: 0}
    - target: {fileID: 1736867905531120063, guid: 49701d0094406424bbfe5cab2b819618, type: 3}
      propertyPath: m_LocalEulerAnglesHint.y
      value: 0
      objectReference: {fileID: 0}
    - target: {fileID: 1736867905531120063, guid: 49701d0094406424bbfe5cab2b819618, type: 3}
      propertyPath: m_LocalEulerAnglesHint.z
      value: -16.377
      objectReference: {fileID: 0}
    - target: {fileID: 6539184298975600710, guid: 49701d0094406424bbfe5cab2b819618, type: 3}
      propertyPath: m_Material
      value: 
      objectReference: {fileID: 13400000, guid: d80b0a8adc78a8d48bd4fd8289f30cee, type: 2}
    m_RemovedComponents: []
    m_RemovedGameObjects: []
    m_AddedGameObjects: []
    m_AddedComponents: []
  m_SourcePrefab: {fileID: 100100000, guid: 49701d0094406424bbfe5cab2b819618, type: 3}
--- !u!1001 &423250763
PrefabInstance:
  m_ObjectHideFlags: 0
  serializedVersion: 2
  m_Modification:
    serializedVersion: 3
    m_TransformParent: {fileID: 0}
    m_Modifications:
    - target: {fileID: 1705132085743413769, guid: 49701d0094406424bbfe5cab2b819618, type: 3}
      propertyPath: m_Name
      value: Wall (8)
      objectReference: {fileID: 0}
    - target: {fileID: 1736867905531120063, guid: 49701d0094406424bbfe5cab2b819618, type: 3}
      propertyPath: m_LocalScale.x
      value: 48.11842
      objectReference: {fileID: 0}
    - target: {fileID: 1736867905531120063, guid: 49701d0094406424bbfe5cab2b819618, type: 3}
      propertyPath: m_LocalScale.y
      value: 2.2346165
      objectReference: {fileID: 0}
    - target: {fileID: 1736867905531120063, guid: 49701d0094406424bbfe5cab2b819618, type: 3}
      propertyPath: m_LocalPosition.x
      value: 116.29999
      objectReference: {fileID: 0}
    - target: {fileID: 1736867905531120063, guid: 49701d0094406424bbfe5cab2b819618, type: 3}
      propertyPath: m_LocalPosition.y
      value: 34.6
      objectReference: {fileID: 0}
    - target: {fileID: 1736867905531120063, guid: 49701d0094406424bbfe5cab2b819618, type: 3}
      propertyPath: m_LocalPosition.z
      value: 0
      objectReference: {fileID: 0}
    - target: {fileID: 1736867905531120063, guid: 49701d0094406424bbfe5cab2b819618, type: 3}
      propertyPath: m_LocalRotation.w
      value: 0.72600305
      objectReference: {fileID: 0}
    - target: {fileID: 1736867905531120063, guid: 49701d0094406424bbfe5cab2b819618, type: 3}
      propertyPath: m_LocalRotation.x
      value: -0
      objectReference: {fileID: 0}
    - target: {fileID: 1736867905531120063, guid: 49701d0094406424bbfe5cab2b819618, type: 3}
      propertyPath: m_LocalRotation.y
      value: -0
      objectReference: {fileID: 0}
    - target: {fileID: 1736867905531120063, guid: 49701d0094406424bbfe5cab2b819618, type: 3}
      propertyPath: m_LocalRotation.z
      value: -0.6876914
      objectReference: {fileID: 0}
    - target: {fileID: 1736867905531120063, guid: 49701d0094406424bbfe5cab2b819618, type: 3}
      propertyPath: m_LocalEulerAnglesHint.x
      value: 0
      objectReference: {fileID: 0}
    - target: {fileID: 1736867905531120063, guid: 49701d0094406424bbfe5cab2b819618, type: 3}
      propertyPath: m_LocalEulerAnglesHint.y
      value: 0
      objectReference: {fileID: 0}
    - target: {fileID: 1736867905531120063, guid: 49701d0094406424bbfe5cab2b819618, type: 3}
      propertyPath: m_LocalEulerAnglesHint.z
      value: -86.895
      objectReference: {fileID: 0}
    - target: {fileID: 6539184298975600710, guid: 49701d0094406424bbfe5cab2b819618, type: 3}
      propertyPath: m_Material
      value: 
      objectReference: {fileID: 13400000, guid: d80b0a8adc78a8d48bd4fd8289f30cee, type: 2}
    m_RemovedComponents: []
    m_RemovedGameObjects: []
    m_AddedGameObjects: []
    m_AddedComponents: []
  m_SourcePrefab: {fileID: 100100000, guid: 49701d0094406424bbfe5cab2b819618, type: 3}
--- !u!1001 &538897330
PrefabInstance:
  m_ObjectHideFlags: 0
  serializedVersion: 2
  m_Modification:
    serializedVersion: 3
    m_TransformParent: {fileID: 0}
    m_Modifications:
    - target: {fileID: 1705132085743413769, guid: 49701d0094406424bbfe5cab2b819618, type: 3}
      propertyPath: m_Name
      value: Wall (3)
      objectReference: {fileID: 0}
    - target: {fileID: 1736867905531120063, guid: 49701d0094406424bbfe5cab2b819618, type: 3}
      propertyPath: m_LocalScale.x
      value: 48.11842
      objectReference: {fileID: 0}
    - target: {fileID: 1736867905531120063, guid: 49701d0094406424bbfe5cab2b819618, type: 3}
      propertyPath: m_LocalScale.y
      value: 2.2346165
      objectReference: {fileID: 0}
    - target: {fileID: 1736867905531120063, guid: 49701d0094406424bbfe5cab2b819618, type: 3}
      propertyPath: m_LocalPosition.x
      value: 71.8
      objectReference: {fileID: 0}
    - target: {fileID: 1736867905531120063, guid: 49701d0094406424bbfe5cab2b819618, type: 3}
      propertyPath: m_LocalPosition.y
      value: -78.9
      objectReference: {fileID: 0}
    - target: {fileID: 1736867905531120063, guid: 49701d0094406424bbfe5cab2b819618, type: 3}
      propertyPath: m_LocalPosition.z
      value: 0
      objectReference: {fileID: 0}
    - target: {fileID: 1736867905531120063, guid: 49701d0094406424bbfe5cab2b819618, type: 3}
      propertyPath: m_LocalRotation.w
      value: 0.9898052
      objectReference: {fileID: 0}
    - target: {fileID: 1736867905531120063, guid: 49701d0094406424bbfe5cab2b819618, type: 3}
      propertyPath: m_LocalRotation.x
      value: -0
      objectReference: {fileID: 0}
    - target: {fileID: 1736867905531120063, guid: 49701d0094406424bbfe5cab2b819618, type: 3}
      propertyPath: m_LocalRotation.y
      value: -0
      objectReference: {fileID: 0}
    - target: {fileID: 1736867905531120063, guid: 49701d0094406424bbfe5cab2b819618, type: 3}
      propertyPath: m_LocalRotation.z
      value: -0.1424278
      objectReference: {fileID: 0}
    - target: {fileID: 1736867905531120063, guid: 49701d0094406424bbfe5cab2b819618, type: 3}
      propertyPath: m_LocalEulerAnglesHint.x
      value: 0
      objectReference: {fileID: 0}
    - target: {fileID: 1736867905531120063, guid: 49701d0094406424bbfe5cab2b819618, type: 3}
      propertyPath: m_LocalEulerAnglesHint.y
      value: 0
      objectReference: {fileID: 0}
    - target: {fileID: 1736867905531120063, guid: 49701d0094406424bbfe5cab2b819618, type: 3}
      propertyPath: m_LocalEulerAnglesHint.z
      value: -16.377
      objectReference: {fileID: 0}
    - target: {fileID: 6539184298975600710, guid: 49701d0094406424bbfe5cab2b819618, type: 3}
      propertyPath: m_Material
      value: 
      objectReference: {fileID: 13400000, guid: d80b0a8adc78a8d48bd4fd8289f30cee, type: 2}
    m_RemovedComponents: []
    m_RemovedGameObjects: []
    m_AddedGameObjects: []
    m_AddedComponents: []
  m_SourcePrefab: {fileID: 100100000, guid: 49701d0094406424bbfe5cab2b819618, type: 3}
--- !u!1 &705507993
GameObject:
  m_ObjectHideFlags: 0
  m_CorrespondingSourceObject: {fileID: 0}
  m_PrefabInstance: {fileID: 0}
  m_PrefabAsset: {fileID: 0}
  serializedVersion: 6
  m_Component:
  - component: {fileID: 705507995}
  - component: {fileID: 705507994}
  m_Layer: 0
  m_Name: Directional Light
  m_TagString: Untagged
  m_Icon: {fileID: 0}
  m_NavMeshLayer: 0
  m_StaticEditorFlags: 0
  m_IsActive: 1
--- !u!108 &705507994
Light:
  m_ObjectHideFlags: 0
  m_CorrespondingSourceObject: {fileID: 0}
  m_PrefabInstance: {fileID: 0}
  m_PrefabAsset: {fileID: 0}
  m_GameObject: {fileID: 705507993}
  m_Enabled: 1
  serializedVersion: 10
  m_Type: 1
  m_Shape: 0
  m_Color: {r: 1, g: 0.95686275, b: 0.8392157, a: 1}
  m_Intensity: 1
  m_Range: 10
  m_SpotAngle: 30
  m_InnerSpotAngle: 21.80208
  m_CookieSize: 10
  m_Shadows:
    m_Type: 2
    m_Resolution: -1
    m_CustomResolution: -1
    m_Strength: 1
    m_Bias: 0.05
    m_NormalBias: 0.4
    m_NearPlane: 0.2
    m_CullingMatrixOverride:
      e00: 1
      e01: 0
      e02: 0
      e03: 0
      e10: 0
      e11: 1
      e12: 0
      e13: 0
      e20: 0
      e21: 0
      e22: 1
      e23: 0
      e30: 0
      e31: 0
      e32: 0
      e33: 1
    m_UseCullingMatrixOverride: 0
  m_Cookie: {fileID: 0}
  m_DrawHalo: 0
  m_Flare: {fileID: 0}
  m_RenderMode: 0
  m_CullingMask:
    serializedVersion: 2
    m_Bits: 4294967295
  m_RenderingLayerMask: 1
  m_Lightmapping: 1
  m_LightShadowCasterMode: 0
  m_AreaSize: {x: 1, y: 1}
  m_BounceIntensity: 1
  m_ColorTemperature: 6570
  m_UseColorTemperature: 0
  m_BoundingSphereOverride: {x: 0, y: 0, z: 0, w: 0}
  m_UseBoundingSphereOverride: 0
  m_UseViewFrustumForShadowCasterCull: 1
  m_ShadowRadius: 0
  m_ShadowAngle: 0
--- !u!4 &705507995
Transform:
  m_ObjectHideFlags: 0
  m_CorrespondingSourceObject: {fileID: 0}
  m_PrefabInstance: {fileID: 0}
  m_PrefabAsset: {fileID: 0}
  m_GameObject: {fileID: 705507993}
  serializedVersion: 2
  m_LocalRotation: {x: 0.40821788, y: -0.23456968, z: 0.10938163, w: 0.8754261}
  m_LocalPosition: {x: 0, y: 3, z: 0}
  m_LocalScale: {x: 1, y: 1, z: 1}
  m_ConstrainProportionsScale: 0
  m_Children: []
  m_Father: {fileID: 0}
  m_LocalEulerAnglesHint: {x: 50, y: -30, z: 0}
--- !u!1001 &807876214
PrefabInstance:
  m_ObjectHideFlags: 0
  serializedVersion: 2
  m_Modification:
    serializedVersion: 3
    m_TransformParent: {fileID: 0}
    m_Modifications:
    - target: {fileID: 1705132085743413769, guid: 49701d0094406424bbfe5cab2b819618, type: 3}
      propertyPath: m_Name
      value: Wall (4)
      objectReference: {fileID: 0}
    - target: {fileID: 1736867905531120063, guid: 49701d0094406424bbfe5cab2b819618, type: 3}
      propertyPath: m_LocalScale.x
      value: 48.11842
      objectReference: {fileID: 0}
    - target: {fileID: 1736867905531120063, guid: 49701d0094406424bbfe5cab2b819618, type: 3}
      propertyPath: m_LocalScale.y
      value: 2.2346165
      objectReference: {fileID: 0}
    - target: {fileID: 1736867905531120063, guid: 49701d0094406424bbfe5cab2b819618, type: 3}
      propertyPath: m_LocalPosition.x
      value: -10.3
      objectReference: {fileID: 0}
    - target: {fileID: 1736867905531120063, guid: 49701d0094406424bbfe5cab2b819618, type: 3}
      propertyPath: m_LocalPosition.y
      value: 34.6
      objectReference: {fileID: 0}
    - target: {fileID: 1736867905531120063, guid: 49701d0094406424bbfe5cab2b819618, type: 3}
      propertyPath: m_LocalPosition.z
      value: 0
      objectReference: {fileID: 0}
    - target: {fileID: 1736867905531120063, guid: 49701d0094406424bbfe5cab2b819618, type: 3}
      propertyPath: m_LocalRotation.w
      value: 0.72600305
      objectReference: {fileID: 0}
    - target: {fileID: 1736867905531120063, guid: 49701d0094406424bbfe5cab2b819618, type: 3}
      propertyPath: m_LocalRotation.x
      value: -0
      objectReference: {fileID: 0}
    - target: {fileID: 1736867905531120063, guid: 49701d0094406424bbfe5cab2b819618, type: 3}
      propertyPath: m_LocalRotation.y
      value: -0
      objectReference: {fileID: 0}
    - target: {fileID: 1736867905531120063, guid: 49701d0094406424bbfe5cab2b819618, type: 3}
      propertyPath: m_LocalRotation.z
      value: -0.6876914
      objectReference: {fileID: 0}
    - target: {fileID: 1736867905531120063, guid: 49701d0094406424bbfe5cab2b819618, type: 3}
      propertyPath: m_LocalEulerAnglesHint.x
      value: 0
      objectReference: {fileID: 0}
    - target: {fileID: 1736867905531120063, guid: 49701d0094406424bbfe5cab2b819618, type: 3}
      propertyPath: m_LocalEulerAnglesHint.y
      value: 0
      objectReference: {fileID: 0}
    - target: {fileID: 1736867905531120063, guid: 49701d0094406424bbfe5cab2b819618, type: 3}
      propertyPath: m_LocalEulerAnglesHint.z
      value: -86.895
      objectReference: {fileID: 0}
    - target: {fileID: 6539184298975600710, guid: 49701d0094406424bbfe5cab2b819618, type: 3}
      propertyPath: m_Material
      value: 
      objectReference: {fileID: 13400000, guid: d80b0a8adc78a8d48bd4fd8289f30cee, type: 2}
    m_RemovedComponents: []
    m_RemovedGameObjects: []
    m_AddedGameObjects: []
    m_AddedComponents: []
  m_SourcePrefab: {fileID: 100100000, guid: 49701d0094406424bbfe5cab2b819618, type: 3}
--- !u!1 &963194225
GameObject:
  m_ObjectHideFlags: 0
  m_CorrespondingSourceObject: {fileID: 0}
  m_PrefabInstance: {fileID: 0}
  m_PrefabAsset: {fileID: 0}
  serializedVersion: 6
  m_Component:
  - component: {fileID: 963194228}
  - component: {fileID: 963194227}
  - component: {fileID: 963194226}
  m_Layer: 0
  m_Name: Main Camera
  m_TagString: MainCamera
  m_Icon: {fileID: 0}
  m_NavMeshLayer: 0
  m_StaticEditorFlags: 0
  m_IsActive: 1
--- !u!81 &963194226
AudioListener:
  m_ObjectHideFlags: 0
  m_CorrespondingSourceObject: {fileID: 0}
  m_PrefabInstance: {fileID: 0}
  m_PrefabAsset: {fileID: 0}
  m_GameObject: {fileID: 963194225}
  m_Enabled: 1
--- !u!20 &963194227
Camera:
  m_ObjectHideFlags: 0
  m_CorrespondingSourceObject: {fileID: 0}
  m_PrefabInstance: {fileID: 0}
  m_PrefabAsset: {fileID: 0}
  m_GameObject: {fileID: 963194225}
  m_Enabled: 1
  serializedVersion: 2
  m_ClearFlags: 1
  m_BackGroundColor: {r: 0.19215687, g: 0.3019608, b: 0.4745098, a: 0}
  m_projectionMatrixMode: 1
  m_GateFitMode: 2
  m_FOVAxisMode: 0
  m_Iso: 200
  m_ShutterSpeed: 0.005
  m_Aperture: 16
  m_FocusDistance: 10
  m_FocalLength: 50
  m_BladeCount: 5
  m_Curvature: {x: 2, y: 11}
  m_BarrelClipping: 0.25
  m_Anamorphism: 0
  m_SensorSize: {x: 36, y: 24}
  m_LensShift: {x: 0, y: 0}
  m_NormalizedViewPortRect:
    serializedVersion: 2
    x: 0
    y: 0
    width: 1
    height: 1
  near clip plane: 0.3
  far clip plane: 1000
  field of view: 60
  orthographic: 0
  orthographic size: 5
  m_Depth: -1
  m_CullingMask:
    serializedVersion: 2
    m_Bits: 4294967295
  m_RenderingPath: -1
  m_TargetTexture: {fileID: 0}
  m_TargetDisplay: 0
  m_TargetEye: 3
  m_HDR: 1
  m_AllowMSAA: 1
  m_AllowDynamicResolution: 0
  m_ForceIntoRT: 0
  m_OcclusionCulling: 1
  m_StereoConvergence: 10
  m_StereoSeparation: 0.022
--- !u!4 &963194228
Transform:
  m_ObjectHideFlags: 0
  m_CorrespondingSourceObject: {fileID: 0}
  m_PrefabInstance: {fileID: 0}
  m_PrefabAsset: {fileID: 0}
  m_GameObject: {fileID: 963194225}
  serializedVersion: 2
  m_LocalRotation: {x: 0.2634451, y: -0, z: -0, w: 0.9646744}
  m_LocalPosition: {x: 9.5, y: 23.12, z: -57.4}
  m_LocalScale: {x: 1, y: 1, z: 1}
  m_ConstrainProportionsScale: 0
  m_Children: []
  m_Father: {fileID: 0}
  m_LocalEulerAnglesHint: {x: 30.549, y: 0, z: 0}
--- !u!1 &1409645930
GameObject:
  m_ObjectHideFlags: 0
  m_CorrespondingSourceObject: {fileID: 0}
  m_PrefabInstance: {fileID: 0}
  m_PrefabAsset: {fileID: 0}
  serializedVersion: 6
  m_Component:
  - component: {fileID: 1409645934}
  - component: {fileID: 1409645933}
  - component: {fileID: 1409645932}
  - component: {fileID: 1409645931}
  - component: {fileID: 1409645936}
  - component: {fileID: 1409645937}
  m_Layer: 0
  m_Name: Sphere
  m_TagString: Untagged
  m_Icon: {fileID: 0}
  m_NavMeshLayer: 0
  m_StaticEditorFlags: 0
  m_IsActive: 1
--- !u!135 &1409645931
SphereCollider:
  m_ObjectHideFlags: 0
  m_CorrespondingSourceObject: {fileID: 0}
  m_PrefabInstance: {fileID: 0}
  m_PrefabAsset: {fileID: 0}
  m_GameObject: {fileID: 1409645930}
  m_Material: {fileID: 0}
  m_IncludeLayers:
    serializedVersion: 2
    m_Bits: 0
  m_ExcludeLayers:
    serializedVersion: 2
    m_Bits: 0
  m_LayerOverridePriority: 0
  m_IsTrigger: 0
  m_ProvidesContacts: 0
  m_Enabled: 1
  serializedVersion: 3
  m_Radius: 0.5
  m_Center: {x: 0, y: 0, z: 0}
--- !u!23 &1409645932
MeshRenderer:
  m_ObjectHideFlags: 0
  m_CorrespondingSourceObject: {fileID: 0}
  m_PrefabInstance: {fileID: 0}
  m_PrefabAsset: {fileID: 0}
  m_GameObject: {fileID: 1409645930}
  m_Enabled: 1
  m_CastShadows: 1
  m_ReceiveShadows: 1
  m_DynamicOccludee: 1
  m_StaticShadowCaster: 0
  m_MotionVectors: 1
  m_LightProbeUsage: 1
  m_ReflectionProbeUsage: 1
  m_RayTracingMode: 2
  m_RayTraceProcedural: 0
  m_RenderingLayerMask: 1
  m_RendererPriority: 0
  m_Materials:
  - {fileID: 10303, guid: 0000000000000000f000000000000000, type: 0}
  m_StaticBatchInfo:
    firstSubMesh: 0
    subMeshCount: 0
  m_StaticBatchRoot: {fileID: 0}
  m_ProbeAnchor: {fileID: 0}
  m_LightProbeVolumeOverride: {fileID: 0}
  m_ScaleInLightmap: 1
  m_ReceiveGI: 1
  m_PreserveUVs: 0
  m_IgnoreNormalsForChartDetection: 0
  m_ImportantGI: 0
  m_StitchLightmapSeams: 1
  m_SelectedEditorRenderState: 3
  m_MinimumChartSize: 4
  m_AutoUVMaxDistance: 0.5
  m_AutoUVMaxAngle: 89
  m_LightmapParameters: {fileID: 0}
  m_SortingLayerID: 0
  m_SortingLayer: 0
  m_SortingOrder: 0
  m_AdditionalVertexStreams: {fileID: 0}
--- !u!33 &1409645933
MeshFilter:
  m_ObjectHideFlags: 0
  m_CorrespondingSourceObject: {fileID: 0}
  m_PrefabInstance: {fileID: 0}
  m_PrefabAsset: {fileID: 0}
  m_GameObject: {fileID: 1409645930}
  m_Mesh: {fileID: 10207, guid: 0000000000000000e000000000000000, type: 0}
--- !u!4 &1409645934
Transform:
  m_ObjectHideFlags: 0
  m_CorrespondingSourceObject: {fileID: 0}
  m_PrefabInstance: {fileID: 0}
  m_PrefabAsset: {fileID: 0}
  m_GameObject: {fileID: 1409645930}
  serializedVersion: 2
  m_LocalRotation: {x: 0, y: 0, z: 0, w: 1}
  m_LocalPosition: {x: 15.4, y: 15.7, z: -25.62}
  m_LocalScale: {x: 3.7312, y: 3.7312, z: 3.7312}
  m_ConstrainProportionsScale: 0
  m_Children: []
  m_Father: {fileID: 0}
  m_LocalEulerAnglesHint: {x: 0, y: 0, z: 0}
--- !u!114 &1409645936
MonoBehaviour:
  m_ObjectHideFlags: 0
  m_CorrespondingSourceObject: {fileID: 0}
  m_PrefabInstance: {fileID: 0}
  m_PrefabAsset: {fileID: 0}
  m_GameObject: {fileID: 1409645930}
  m_Enabled: 1
  m_EditorHideFlags: 0
  m_Script: {fileID: 11500000, guid: 93b4b24f650f91c4482c0526def9933e, type: 3}
  m_Name: 
  m_EditorClassIdentifier: 
--- !u!54 &1409645937
Rigidbody:
  m_ObjectHideFlags: 0
  m_CorrespondingSourceObject: {fileID: 0}
  m_PrefabInstance: {fileID: 0}
  m_PrefabAsset: {fileID: 0}
  m_GameObject: {fileID: 1409645930}
  serializedVersion: 4
  m_Mass: 1
  m_Drag: 0
  m_AngularDrag: 0.05
  m_CenterOfMass: {x: 0, y: 0, z: 0}
  m_InertiaTensor: {x: 1, y: 1, z: 1}
  m_InertiaRotation: {x: 0, y: 0, z: 0, w: 1}
  m_IncludeLayers:
    serializedVersion: 2
    m_Bits: 0
  m_ExcludeLayers:
    serializedVersion: 2
    m_Bits: 0
  m_ImplicitCom: 1
  m_ImplicitTensor: 1
  m_UseGravity: 1
  m_IsKinematic: 0
  m_Interpolate: 0
  m_Constraints: 0
  m_CollisionDetection: 0
--- !u!1001 &1577409524
PrefabInstance:
  m_ObjectHideFlags: 0
  serializedVersion: 2
  m_Modification:
    serializedVersion: 3
    m_TransformParent: {fileID: 0}
    m_Modifications:
    - target: {fileID: 1705132085743413769, guid: 49701d0094406424bbfe5cab2b819618, type: 3}
      propertyPath: m_Name
      value: Wall (9)
      objectReference: {fileID: 0}
    - target: {fileID: 1736867905531120063, guid: 49701d0094406424bbfe5cab2b819618, type: 3}
      propertyPath: m_LocalScale.x
      value: 48.11842
      objectReference: {fileID: 0}
    - target: {fileID: 1736867905531120063, guid: 49701d0094406424bbfe5cab2b819618, type: 3}
      propertyPath: m_LocalScale.y
      value: 2.2346165
      objectReference: {fileID: 0}
    - target: {fileID: 1736867905531120063, guid: 49701d0094406424bbfe5cab2b819618, type: 3}
      propertyPath: m_LocalPosition.x
      value: 158.9
      objectReference: {fileID: 0}
    - target: {fileID: 1736867905531120063, guid: 49701d0094406424bbfe5cab2b819618, type: 3}
      propertyPath: m_LocalPosition.y
      value: 29
      objectReference: {fileID: 0}
    - target: {fileID: 1736867905531120063, guid: 49701d0094406424bbfe5cab2b819618, type: 3}
      propertyPath: m_LocalPosition.z
      value: 0
      objectReference: {fileID: 0}
    - target: {fileID: 1736867905531120063, guid: 49701d0094406424bbfe5cab2b819618, type: 3}
      propertyPath: m_LocalRotation.w
      value: 0.72600305
      objectReference: {fileID: 0}
    - target: {fileID: 1736867905531120063, guid: 49701d0094406424bbfe5cab2b819618, type: 3}
      propertyPath: m_LocalRotation.x
      value: -0
      objectReference: {fileID: 0}
    - target: {fileID: 1736867905531120063, guid: 49701d0094406424bbfe5cab2b819618, type: 3}
      propertyPath: m_LocalRotation.y
      value: -0
      objectReference: {fileID: 0}
    - target: {fileID: 1736867905531120063, guid: 49701d0094406424bbfe5cab2b819618, type: 3}
      propertyPath: m_LocalRotation.z
      value: -0.6876914
      objectReference: {fileID: 0}
    - target: {fileID: 1736867905531120063, guid: 49701d0094406424bbfe5cab2b819618, type: 3}
      propertyPath: m_LocalEulerAnglesHint.x
      value: 0
      objectReference: {fileID: 0}
    - target: {fileID: 1736867905531120063, guid: 49701d0094406424bbfe5cab2b819618, type: 3}
      propertyPath: m_LocalEulerAnglesHint.y
      value: 0
      objectReference: {fileID: 0}
    - target: {fileID: 1736867905531120063, guid: 49701d0094406424bbfe5cab2b819618, type: 3}
      propertyPath: m_LocalEulerAnglesHint.z
      value: -86.895
      objectReference: {fileID: 0}
    - target: {fileID: 6539184298975600710, guid: 49701d0094406424bbfe5cab2b819618, type: 3}
      propertyPath: m_Material
      value: 
      objectReference: {fileID: 13400000, guid: d80b0a8adc78a8d48bd4fd8289f30cee, type: 2}
    m_RemovedComponents: []
    m_RemovedGameObjects: []
    m_AddedGameObjects: []
    m_AddedComponents: []
  m_SourcePrefab: {fileID: 100100000, guid: 49701d0094406424bbfe5cab2b819618, type: 3}
--- !u!1001 &1830054243
PrefabInstance:
  m_ObjectHideFlags: 0
  serializedVersion: 2
  m_Modification:
    serializedVersion: 3
    m_TransformParent: {fileID: 0}
    m_Modifications:
    - target: {fileID: 1705132085743413769, guid: 49701d0094406424bbfe5cab2b819618, type: 3}
      propertyPath: m_Name
      value: Wall (6)
      objectReference: {fileID: 0}
    - target: {fileID: 1736867905531120063, guid: 49701d0094406424bbfe5cab2b819618, type: 3}
      propertyPath: m_LocalScale.x
      value: 48.11842
      objectReference: {fileID: 0}
    - target: {fileID: 1736867905531120063, guid: 49701d0094406424bbfe5cab2b819618, type: 3}
      propertyPath: m_LocalScale.y
      value: 2.2346165
      objectReference: {fileID: 0}
    - target: {fileID: 1736867905531120063, guid: 49701d0094406424bbfe5cab2b819618, type: 3}
      propertyPath: m_LocalPosition.x
      value: 55.2
      objectReference: {fileID: 0}
    - target: {fileID: 1736867905531120063, guid: 49701d0094406424bbfe5cab2b819618, type: 3}
      propertyPath: m_LocalPosition.y
      value: 34.6
      objectReference: {fileID: 0}
    - target: {fileID: 1736867905531120063, guid: 49701d0094406424bbfe5cab2b819618, type: 3}
      propertyPath: m_LocalPosition.z
      value: 0
      objectReference: {fileID: 0}
    - target: {fileID: 1736867905531120063, guid: 49701d0094406424bbfe5cab2b819618, type: 3}
      propertyPath: m_LocalRotation.w
      value: 0.72600305
      objectReference: {fileID: 0}
    - target: {fileID: 1736867905531120063, guid: 49701d0094406424bbfe5cab2b819618, type: 3}
      propertyPath: m_LocalRotation.x
      value: -0
      objectReference: {fileID: 0}
    - target: {fileID: 1736867905531120063, guid: 49701d0094406424bbfe5cab2b819618, type: 3}
      propertyPath: m_LocalRotation.y
      value: -0
      objectReference: {fileID: 0}
    - target: {fileID: 1736867905531120063, guid: 49701d0094406424bbfe5cab2b819618, type: 3}
      propertyPath: m_LocalRotation.z
      value: -0.6876914
      objectReference: {fileID: 0}
    - target: {fileID: 1736867905531120063, guid: 49701d0094406424bbfe5cab2b819618, type: 3}
      propertyPath: m_LocalEulerAnglesHint.x
      value: 0
      objectReference: {fileID: 0}
    - target: {fileID: 1736867905531120063, guid: 49701d0094406424bbfe5cab2b819618, type: 3}
      propertyPath: m_LocalEulerAnglesHint.y
      value: 0
      objectReference: {fileID: 0}
    - target: {fileID: 1736867905531120063, guid: 49701d0094406424bbfe5cab2b819618, type: 3}
      propertyPath: m_LocalEulerAnglesHint.z
      value: -86.895
      objectReference: {fileID: 0}
    - target: {fileID: 4334561915182112163, guid: 49701d0094406424bbfe5cab2b819618, type: 3}
      propertyPath: m_Materials.Array.data[0]
      value: 
      objectReference: {fileID: 2100000, guid: c8b0bd1e6dd3f214cb5bc0a55375b703, type: 2}
    - target: {fileID: 6539184298975600710, guid: 49701d0094406424bbfe5cab2b819618, type: 3}
      propertyPath: m_Material
      value: 
      objectReference: {fileID: 13400000, guid: d80b0a8adc78a8d48bd4fd8289f30cee, type: 2}
    m_RemovedComponents: []
    m_RemovedGameObjects: []
    m_AddedGameObjects: []
    m_AddedComponents: []
  m_SourcePrefab: {fileID: 100100000, guid: 49701d0094406424bbfe5cab2b819618, type: 3}
--- !u!1001 &1997989547
PrefabInstance:
  m_ObjectHideFlags: 0
  serializedVersion: 2
  m_Modification:
    serializedVersion: 3
    m_TransformParent: {fileID: 0}
    m_Modifications:
    - target: {fileID: 1705132085743413769, guid: 49701d0094406424bbfe5cab2b819618, type: 3}
      propertyPath: m_Name
      value: Wall (10)
      objectReference: {fileID: 0}
    - target: {fileID: 1736867905531120063, guid: 49701d0094406424bbfe5cab2b819618, type: 3}
      propertyPath: m_LocalScale.x
      value: 48.11842
      objectReference: {fileID: 0}
    - target: {fileID: 1736867905531120063, guid: 49701d0094406424bbfe5cab2b819618, type: 3}
      propertyPath: m_LocalScale.y
      value: 2.2346165
      objectReference: {fileID: 0}
    - target: {fileID: 1736867905531120063, guid: 49701d0094406424bbfe5cab2b819618, type: 3}
      propertyPath: m_LocalPosition.x
      value: 197.6
      objectReference: {fileID: 0}
    - target: {fileID: 1736867905531120063, guid: 49701d0094406424bbfe5cab2b819618, type: 3}
      propertyPath: m_LocalPosition.y
      value: 34.6
      objectReference: {fileID: 0}
    - target: {fileID: 1736867905531120063, guid: 49701d0094406424bbfe5cab2b819618, type: 3}
      propertyPath: m_LocalPosition.z
      value: 0
      objectReference: {fileID: 0}
    - target: {fileID: 1736867905531120063, guid: 49701d0094406424bbfe5cab2b819618, type: 3}
      propertyPath: m_LocalRotation.w
      value: 0.72600305
      objectReference: {fileID: 0}
    - target: {fileID: 1736867905531120063, guid: 49701d0094406424bbfe5cab2b819618, type: 3}
      propertyPath: m_LocalRotation.x
      value: -0
      objectReference: {fileID: 0}
    - target: {fileID: 1736867905531120063, guid: 49701d0094406424bbfe5cab2b819618, type: 3}
      propertyPath: m_LocalRotation.y
      value: -0
      objectReference: {fileID: 0}
    - target: {fileID: 1736867905531120063, guid: 49701d0094406424bbfe5cab2b819618, type: 3}
      propertyPath: m_LocalRotation.z
      value: -0.6876914
      objectReference: {fileID: 0}
    - target: {fileID: 1736867905531120063, guid: 49701d0094406424bbfe5cab2b819618, type: 3}
      propertyPath: m_LocalEulerAnglesHint.x
      value: 0
      objectReference: {fileID: 0}
    - target: {fileID: 1736867905531120063, guid: 49701d0094406424bbfe5cab2b819618, type: 3}
      propertyPath: m_LocalEulerAnglesHint.y
      value: 0
      objectReference: {fileID: 0}
    - target: {fileID: 1736867905531120063, guid: 49701d0094406424bbfe5cab2b819618, type: 3}
      propertyPath: m_LocalEulerAnglesHint.z
      value: -86.895
      objectReference: {fileID: 0}
    - target: {fileID: 6539184298975600710, guid: 49701d0094406424bbfe5cab2b819618, type: 3}
      propertyPath: m_Material
      value: 
      objectReference: {fileID: 13400000, guid: d80b0a8adc78a8d48bd4fd8289f30cee, type: 2}
    m_RemovedComponents: []
    m_RemovedGameObjects: []
    m_AddedGameObjects: []
    m_AddedComponents: []
  m_SourcePrefab: {fileID: 100100000, guid: 49701d0094406424bbfe5cab2b819618, type: 3}
--- !u!1 &2052398750
GameObject:
  m_ObjectHideFlags: 0
  m_CorrespondingSourceObject: {fileID: 0}
  m_PrefabInstance: {fileID: 0}
  m_PrefabAsset: {fileID: 0}
  serializedVersion: 6
  m_Component:
  - component: {fileID: 2052398754}
  - component: {fileID: 2052398753}
  - component: {fileID: 2052398752}
  - component: {fileID: 2052398751}
  m_Layer: 0
  m_Name: Cube
  m_TagString: Untagged
  m_Icon: {fileID: 0}
  m_NavMeshLayer: 0
  m_StaticEditorFlags: 0
  m_IsActive: 1
--- !u!65 &2052398751
BoxCollider:
  m_ObjectHideFlags: 0
  m_CorrespondingSourceObject: {fileID: 0}
  m_PrefabInstance: {fileID: 0}
  m_PrefabAsset: {fileID: 0}
  m_GameObject: {fileID: 2052398750}
  m_Material: {fileID: 0}
  m_IncludeLayers:
    serializedVersion: 2
    m_Bits: 0
  m_ExcludeLayers:
    serializedVersion: 2
    m_Bits: 0
  m_LayerOverridePriority: 0
  m_IsTrigger: 0
  m_ProvidesContacts: 0
  m_Enabled: 1
  serializedVersion: 3
  m_Size: {x: 1, y: 1, z: 1}
  m_Center: {x: 0, y: 0, z: 0}
--- !u!23 &2052398752
MeshRenderer:
  m_ObjectHideFlags: 0
  m_CorrespondingSourceObject: {fileID: 0}
  m_PrefabInstance: {fileID: 0}
  m_PrefabAsset: {fileID: 0}
  m_GameObject: {fileID: 2052398750}
  m_Enabled: 1
  m_CastShadows: 1
  m_ReceiveShadows: 1
  m_DynamicOccludee: 1
  m_StaticShadowCaster: 0
  m_MotionVectors: 1
  m_LightProbeUsage: 1
  m_ReflectionProbeUsage: 1
  m_RayTracingMode: 2
  m_RayTraceProcedural: 0
  m_RenderingLayerMask: 1
  m_RendererPriority: 0
  m_Materials:
  - {fileID: 2100000, guid: c8b0bd1e6dd3f214cb5bc0a55375b703, type: 2}
  m_StaticBatchInfo:
    firstSubMesh: 0
    subMeshCount: 0
  m_StaticBatchRoot: {fileID: 0}
  m_ProbeAnchor: {fileID: 0}
  m_LightProbeVolumeOverride: {fileID: 0}
  m_ScaleInLightmap: 1
  m_ReceiveGI: 1
  m_PreserveUVs: 0
  m_IgnoreNormalsForChartDetection: 0
  m_ImportantGI: 0
  m_StitchLightmapSeams: 1
  m_SelectedEditorRenderState: 3
  m_MinimumChartSize: 4
  m_AutoUVMaxDistance: 0.5
  m_AutoUVMaxAngle: 89
  m_LightmapParameters: {fileID: 0}
  m_SortingLayerID: 0
  m_SortingLayer: 0
  m_SortingOrder: 0
  m_AdditionalVertexStreams: {fileID: 0}
--- !u!33 &2052398753
MeshFilter:
  m_ObjectHideFlags: 0
  m_CorrespondingSourceObject: {fileID: 0}
  m_PrefabInstance: {fileID: 0}
  m_PrefabAsset: {fileID: 0}
  m_GameObject: {fileID: 2052398750}
  m_Mesh: {fileID: 10202, guid: 0000000000000000e000000000000000, type: 0}
--- !u!4 &2052398754
Transform:
  m_ObjectHideFlags: 0
  m_CorrespondingSourceObject: {fileID: 0}
  m_PrefabInstance: {fileID: 0}
  m_PrefabAsset: {fileID: 0}
  m_GameObject: {fileID: 2052398750}
  serializedVersion: 2
  m_LocalRotation: {x: 0, y: 0, z: 0, w: 1}
  m_LocalPosition: {x: 0.761923, y: 62.085457, z: -192.53339}
  m_LocalScale: {x: 1, y: 1, z: 1}
  m_ConstrainProportionsScale: 0
  m_Children: []
  m_Father: {fileID: 0}
  m_LocalEulerAnglesHint: {x: 0, y: 0, z: 0}
--- !u!1001 &2096019019
PrefabInstance:
  m_ObjectHideFlags: 0
  serializedVersion: 2
  m_Modification:
    serializedVersion: 3
    m_TransformParent: {fileID: 0}
    m_Modifications:
    - target: {fileID: 1705132085743413769, guid: 49701d0094406424bbfe5cab2b819618, type: 3}
      propertyPath: m_Name
      value: Wall (7)
      objectReference: {fileID: 0}
    - target: {fileID: 1736867905531120063, guid: 49701d0094406424bbfe5cab2b819618, type: 3}
      propertyPath: m_LocalScale.x
      value: 48.11842
      objectReference: {fileID: 0}
    - target: {fileID: 1736867905531120063, guid: 49701d0094406424bbfe5cab2b819618, type: 3}
      propertyPath: m_LocalScale.y
      value: 2.2346165
      objectReference: {fileID: 0}
    - target: {fileID: 1736867905531120063, guid: 49701d0094406424bbfe5cab2b819618, type: 3}
      propertyPath: m_LocalPosition.x
      value: 97.8
      objectReference: {fileID: 0}
    - target: {fileID: 1736867905531120063, guid: 49701d0094406424bbfe5cab2b819618, type: 3}
      propertyPath: m_LocalPosition.y
      value: 29
      objectReference: {fileID: 0}
    - target: {fileID: 1736867905531120063, guid: 49701d0094406424bbfe5cab2b819618, type: 3}
      propertyPath: m_LocalPosition.z
      value: 0
      objectReference: {fileID: 0}
    - target: {fileID: 1736867905531120063, guid: 49701d0094406424bbfe5cab2b819618, type: 3}
      propertyPath: m_LocalRotation.w
      value: 0.72600305
      objectReference: {fileID: 0}
    - target: {fileID: 1736867905531120063, guid: 49701d0094406424bbfe5cab2b819618, type: 3}
      propertyPath: m_LocalRotation.x
      value: -0
      objectReference: {fileID: 0}
    - target: {fileID: 1736867905531120063, guid: 49701d0094406424bbfe5cab2b819618, type: 3}
      propertyPath: m_LocalRotation.y
      value: -0
      objectReference: {fileID: 0}
    - target: {fileID: 1736867905531120063, guid: 49701d0094406424bbfe5cab2b819618, type: 3}
      propertyPath: m_LocalRotation.z
      value: -0.6876914
      objectReference: {fileID: 0}
    - target: {fileID: 1736867905531120063, guid: 49701d0094406424bbfe5cab2b819618, type: 3}
      propertyPath: m_LocalEulerAnglesHint.x
      value: 0
      objectReference: {fileID: 0}
    - target: {fileID: 1736867905531120063, guid: 49701d0094406424bbfe5cab2b819618, type: 3}
      propertyPath: m_LocalEulerAnglesHint.y
      value: 0
      objectReference: {fileID: 0}
    - target: {fileID: 1736867905531120063, guid: 49701d0094406424bbfe5cab2b819618, type: 3}
      propertyPath: m_LocalEulerAnglesHint.z
      value: -86.895
      objectReference: {fileID: 0}
    - target: {fileID: 4334561915182112163, guid: 49701d0094406424bbfe5cab2b819618, type: 3}
      propertyPath: m_Materials.Array.data[0]
      value: 
      objectReference: {fileID: 2100000, guid: c8b0bd1e6dd3f214cb5bc0a55375b703, type: 2}
    - target: {fileID: 6539184298975600710, guid: 49701d0094406424bbfe5cab2b819618, type: 3}
      propertyPath: m_Material
      value: 
      objectReference: {fileID: 13400000, guid: d80b0a8adc78a8d48bd4fd8289f30cee, type: 2}
    m_RemovedComponents: []
    m_RemovedGameObjects: []
    m_AddedGameObjects: []
    m_AddedComponents: []
  m_SourcePrefab: {fileID: 100100000, guid: 49701d0094406424bbfe5cab2b819618, type: 3}
--- !u!1001 &593099280301303975
PrefabInstance:
  m_ObjectHideFlags: 0
  serializedVersion: 2
  m_Modification:
    serializedVersion: 3
    m_TransformParent: {fileID: 0}
    m_Modifications:
    - target: {fileID: 93879058531932294, guid: 49701d0094406424bbfe5cab2b819618, type: 3}
      propertyPath: m_IsTrigger
      value: 1
      objectReference: {fileID: 0}
    - target: {fileID: 1281694249223987908, guid: 49701d0094406424bbfe5cab2b819618, type: 3}
      propertyPath: m_Enabled
      value: 0
      objectReference: {fileID: 0}
    - target: {fileID: 1705132085743413769, guid: 49701d0094406424bbfe5cab2b819618, type: 3}
      propertyPath: m_Name
      value: Wall
      objectReference: {fileID: 0}
    - target: {fileID: 1736867905531120063, guid: 49701d0094406424bbfe5cab2b819618, type: 3}
      propertyPath: m_LocalScale.x
      value: 48.11842
      objectReference: {fileID: 0}
    - target: {fileID: 1736867905531120063, guid: 49701d0094406424bbfe5cab2b819618, type: 3}
      propertyPath: m_LocalScale.y
      value: 2.2346165
      objectReference: {fileID: 0}
    - target: {fileID: 1736867905531120063, guid: 49701d0094406424bbfe5cab2b819618, type: 3}
      propertyPath: m_LocalPosition.x
      value: 13.13
      objectReference: {fileID: 0}
    - target: {fileID: 1736867905531120063, guid: 49701d0094406424bbfe5cab2b819618, type: 3}
      propertyPath: m_LocalPosition.y
      value: 1
      objectReference: {fileID: 0}
    - target: {fileID: 1736867905531120063, guid: 49701d0094406424bbfe5cab2b819618, type: 3}
      propertyPath: m_LocalPosition.z
      value: 0
      objectReference: {fileID: 0}
    - target: {fileID: 1736867905531120063, guid: 49701d0094406424bbfe5cab2b819618, type: 3}
      propertyPath: m_LocalRotation.w
      value: 0.9898052
      objectReference: {fileID: 0}
    - target: {fileID: 1736867905531120063, guid: 49701d0094406424bbfe5cab2b819618, type: 3}
      propertyPath: m_LocalRotation.x
      value: -0
      objectReference: {fileID: 0}
    - target: {fileID: 1736867905531120063, guid: 49701d0094406424bbfe5cab2b819618, type: 3}
      propertyPath: m_LocalRotation.y
      value: -0
      objectReference: {fileID: 0}
    - target: {fileID: 1736867905531120063, guid: 49701d0094406424bbfe5cab2b819618, type: 3}
      propertyPath: m_LocalRotation.z
      value: -0.1424278
      objectReference: {fileID: 0}
    - target: {fileID: 1736867905531120063, guid: 49701d0094406424bbfe5cab2b819618, type: 3}
      propertyPath: m_LocalEulerAnglesHint.x
      value: 0
      objectReference: {fileID: 0}
    - target: {fileID: 1736867905531120063, guid: 49701d0094406424bbfe5cab2b819618, type: 3}
      propertyPath: m_LocalEulerAnglesHint.y
      value: 0
      objectReference: {fileID: 0}
    - target: {fileID: 1736867905531120063, guid: 49701d0094406424bbfe5cab2b819618, type: 3}
      propertyPath: m_LocalEulerAnglesHint.z
      value: -16.377
      objectReference: {fileID: 0}
    - target: {fileID: 4334561915182112163, guid: 49701d0094406424bbfe5cab2b819618, type: 3}
      propertyPath: m_Enabled
      value: 0
      objectReference: {fileID: 0}
    - target: {fileID: 6539184298975600710, guid: 49701d0094406424bbfe5cab2b819618, type: 3}
      propertyPath: m_Material
      value: 
      objectReference: {fileID: 13400000, guid: d80b0a8adc78a8d48bd4fd8289f30cee, type: 2}
    - target: {fileID: 6539184298975600710, guid: 49701d0094406424bbfe5cab2b819618, type: 3}
      propertyPath: m_IsTrigger
      value: 1
      objectReference: {fileID: 0}
    m_RemovedComponents: []
    m_RemovedGameObjects: []
    m_AddedGameObjects: []
    m_AddedComponents: []
  m_SourcePrefab: {fileID: 100100000, guid: 49701d0094406424bbfe5cab2b819618, type: 3}
--- !u!1660057539 &9223372036854775807
SceneRoots:
  m_ObjectHideFlags: 0
  m_Roots:
  - {fileID: 963194228}
  - {fileID: 705507995}
  - {fileID: 593099280301303975}
  - {fileID: 807876214}
  - {fileID: 1830054243}
  - {fileID: 423250763}
  - {fileID: 1997989547}
  - {fileID: 52624079}
  - {fileID: 2096019019}
  - {fileID: 1577409524}
  - {fileID: 26081763}
  - {fileID: 538897330}
  - {fileID: 87564175}
  - {fileID: 276409995}
  - {fileID: 1409645934}
  - {fileID: 2052398754}
