file/file33.txt 31 40 91 11 52 17 34 91 86 0
file/file26.txt 22 25 12 14 99 24 95 23 31 0
file/file31.txt 35 61 1 0 47 30 29 76 46 -1
file/file20.txt 16 83 41 96 85 47 5 44 7 0
file/file58.txt 31 70 40 52 2 59 48 56 100 -1
file/file55.txt 27 36 43 5 72 75 100 52 0 0
file/file85.txt 88 33 72 18 24 65 32 36 63 -1
file/file15.txt 96 54 59 66 67 81 71 15 85 -1
file/file35.txt 8 4 28 63 76 98 57 72 34 -1
file/file25.txt 27 73 64 64 2 44 32 25 56 0
file/file23.txt 40 31 47 99 75 77 26 47 42 -1
file/file13.txt 57 45 96 0 64 55 20 2 15 0
file/file85.txt 9 93 9 43 4 25 98 11 28 -1
file/file41.txt 60 96 32 89 24 60 37 88 12 0
file/file28.txt 57 92 66 43 84 91 67 95 60 -1
file/file4.txt 77 19 56 25 83 86 89 21 99 -1
file/file53.txt 30 35 64 36 69 73 0 7 45 0
file/file15.txt 39 63 29 21 94 56 45 97 82 -1
file/file75.txt 29 14 90 58 32 20 6 7 1 -1
file/file73.txt 8 53 73 75 99 34 22 33 29 -1
file/file97.txt 60 71 37 11 61 97 10 10 47 0
file/file81.txt 23 48 68 71 97 13 50 69 13 0
file/file34.txt 20 82 69 26 68 86 2 62 100 0
file/file71.txt 34 24 97 59 3 42 19 13 44 -1
file/file64.txt 34 41 27 18 92 51 76 4 85 -1
file/file37.txt 46 75 26 24 4 49 41 9 92 0
file/file12.txt 14 9 7 26 61 44 83 89 50 -1
file/file7.txt 41 45 92 3 100 2 17 8 99 -1
file/file37.txt 15 47 60 82 64 18 30 21 12 0
file/file17.txt 67 90 32 52 62 93 24 16 72 -1
file/file32.txt 86 56 76 50 76 70 75 61 100 0
file/file63.txt 20 33 40 27 82 41 69 32 77 -1
file/file88.txt 93 71 83 93 69 5 96 89 47 -1
file/file27.txt 8 58 11 70 74 33 24 94 10 -1
file/file86.txt 32 16 77 39 69 10 8 49 83 -1
file/file27.txt 21 21 27 9 48 32 42 28 57 -1
file/file54.txt 6 71 94 88 58 27 44 88 99 0
file/file26.txt 71 47 53 98 28 48 92 82 58 -1
file/file40.txt 28 66 86 89 44 35 14 49 93 0
file/file29.txt 77 64 46 29 97 25 78 54 75 -1
file/file16.txt 65 29 51 57 3 19 57 82 4 0
file/file72.txt 67 0 15 39 84 52 49 4 77 -1
file/file15.txt 0 23 85 76 10 39 90 17 74 -1
file/file90.txt 34 60 13 37 91 80 7 15 15 -1
file/file26.txt 89 43 59 0 38 61 35 62 18 0
file/file58.txt 16 94 28 46 91 31 50 26 96 0
file/file94.txt 72 55 57 84 84 55 45 72 55 -1
file/file95.txt 67 91 100 48 57 89 32 66 22 0
file/file45.txt 25 63 69 92 99 52 71 89 58 0
file/file22.txt 18 6 23 77 29 22 18 2 76 0
