file/file24.txt 78 48 64 28 67 63 90 58 20 -1
file/file65.txt 44 98 33 80 12 98 72 9 11 0
file/file19.txt 15 79 85 71 35 38 99 86 24 0
file/file51.txt 71 42 3 76 54 45 90 21 95 0
file/file88.txt 51 68 69 89 91 99 43 58 77 -1
file/file93.txt 29 14 95 27 77 67 67 8 90 -1
file/file54.txt 30 30 83 57 7 95 16 50 21 -1
file/file62.txt 52 13 96 83 6 56 21 11 83 0
file/file41.txt 61 10 96 50 33 17 7 65 20 -1
file/file94.txt 75 10 66 37 7 37 80 41 51 -1
file/file43.txt 29 39 66 28 47 64 26 63 36 -1
file/file64.txt 26 86 35 25 66 14 71 96 81 0
file/file3.txt 76 38 37 10 7 48 2 18 39 0
file/file51.txt 84 2 83 6 34 8 14 54 63 0
file/file4.txt 96 96 2 89 82 75 15 9 98 0
file/file97.txt 45 79 94 55 53 98 74 48 74 -1
file/file23.txt 78 73 52 59 92 33 96 9 57 0
file/file45.txt 61 23 64 78 79 56 26 52 91 0
file/file86.txt 36 45 60 8 16 12 22 49 11 0
file/file47.txt 25 80 36 57 52 7 86 41 47 -1
file/file37.txt 61 66 50 55 57 58 46 31 26 -1
file/file21.txt 91 34 76 70 27 40 9 23 73 0
file/file29.txt 100 0 82 87 84 86 97 17 33 -1
file/file43.txt 10 83 9 9 64 47 47 44 3 0
file/file73.txt 69 73 53 80 21 62 18 85 20 -1
file/file67.txt 49 63 42 39 73 16 86 40 86 -1
file/file16.txt 18 42 95 88 93 72 43 5 8 -1
file/file90.txt 52 74 41 79 9 57 86 35 71 0
file/file14.txt 64 38 5 62 18 66 99 50 86 -1
file/file96.txt 2 88 47 66 30 88 73 6 53 -1
file/file71.txt 96 66 44 74 16 76 98 0 81 0
file/file21.txt 34 2 83 48 82 9 69 19 94 -1
file/file99.txt 11 89 52 87 77 28 10 2 95 -1
file/file55.txt 25 46 69 40 14 93 1 28 15 0
file/file71.txt 13 39 71 41 82 77 83 56 95 0
file/file52.txt 10 89 57 55 41 11 68 86 45 -1
file/file48.txt 59 18 96 30 12 96 3 65 90 -1
file/file85.txt 16 45 24 48 25 40 16 2 28 0
file/file54.txt 88 63 39 79 50 7 60 69 62 -1
file/file62.txt 16 68 19 21 56 93 78 80 83 0
file/file54.txt 79 56 16 75 72 9 5 16 87 -1
file/file24.txt 48 98 28 94 84 48 88 45 57 0
file/file97.txt 10 75 93 10 20 62 13 21 97 0
file/file65.txt 62 44 86 59 29 11 71 16 33 0
file/file75.txt 18 98 85 62 73 70 69 63 83 0
file/file49.txt 8 92 43 89 19 83 68 48 62 0
file/file47.txt 30 35 17 29 6 14 80 18 11 0
file/file71.txt 11 83 55 55 88 51 7 69 72 -1
file/file68.txt 0 99 36 47 13 54 94 36 21 -1
file/file56.txt 27 6 29 98 33 6 83 72 19 -1
