file/file4.txt 98 73 45 29 28 94 3 20 10 0
file/file26.txt 44 72 71 91 76 23 1 99 2 -1
file/file85.txt 74 7 83 74 45 30 29 16 16 0
file/file88.txt 3 5 32 77 91 22 85 27 96 0
file/file75.txt 73 99 89 73 62 10 32 77 27 0
file/file3.txt 50 8 48 14 38 92 75 70 97 -1
file/file10.txt 59 93 99 79 39 42 13 45 22 -1
file/file47.txt 59 100 5 24 79 1 49 75 18 -1
file/file92.txt 19 11 92 97 67 50 69 10 87 -1
file/file62.txt 27 14 53 36 38 46 37 45 52 0
file/file44.txt 49 85 7 73 92 71 92 1 80 0
file/file14.txt 12 19 27 15 84 4 23 98 22 -1
file/file53.txt 12 98 56 100 30 19 55 96 19 0
file/file62.txt 92 31 99 46 57 39 74 93 25 0
file/file62.txt 26 37 19 30 75 39 24 67 65 -1
file/file59.txt 12 7 25 71 34 11 9 90 65 -1
file/file88.txt 4 93 87 28 98 90 55 79 67 0
file/file59.txt 28 94 28 56 80 64 80 11 76 0
file/file98.txt 36 84 96 29 44 4 39 69 19 -1
file/file22.txt 94 78 61 14 61 74 66 69 14 -1
file/file69.txt 47 12 82 68 36 4 14 30 37 -1
file/file93.txt 88 75 28 1 67 72 61 65 84 -1
file/file51.txt 56 82 59 68 36 52 39 60 29 0
file/file85.txt 83 70 18 86 52 85 98 88 50 0
file/file3.txt 89 18 93 59 73 15 35 10 0 -1
file/file32.txt 43 40 40 51 51 30 67 18 80 0
file/file14.txt 97 72 24 45 81 77 16 46 40 0
file/file36.txt 24 45 64 75 78 15 40 99 18 0
file/file85.txt 99 60 64 42 5 48 49 16 69 0
file/file33.txt 3 59 41 29 68 69 52 7 80 -1
file/file59.txt 36 15 51 86 48 9 5 89 25 -1
file/file14.txt 27 70 50 50 98 31 92 68 98 -1
file/file33.txt 62 27 33 7 35 67 63 90 97 0
file/file52.txt 78 44 82 53 19 57 93 90 13 0
file/file41.txt 46 58 59 96 67 16 97 26 8 -1
file/file42.txt 46 100 15 30 57 48 67 3 41 -1
file/file41.txt 11 44 25 76 23 43 72 47 9 0
file/file79.txt 49 21 35 18 83 45 39 70 10 -1
file/file88.txt 5 99 51 71 40 92 59 34 21 0
file/file12.txt 19 20 35 89 50 3 58 20 66 0
file/file14.txt 59 1 78 59 27 47 81 45 54 0
file/file30.txt 66 10 55 59 71 12 44 37 4 -1
file/file44.txt 69 11 48 25 42 2 50 46 92 -1
file/file47.txt 92 75 3 37 52 40 17 22 29 0
file/file44.txt 9 6 49 39 94 4 51 71 72 -1
file/file49.txt 58 35 23 93 65 84 91 57 56 0
file/file12.txt 7 88 46 18 68 29 44 41 81 -1
file/file44.txt 74 84 63 75 49 97 35 23 27 0
file/file87.txt 15 65 61 0 71 84 84 39 2 -1
file/file56.txt 45 85 79 22 91 43 54 7 50 0
