file/file2.txt 18 20 73 64 10 7 72 44 9 0
file/file13.txt 24 54 95 73 30 67 89 71 34 0
file/file80.txt 23 49 7 38 22 52 15 93 22 -1
file/file69.txt 68 68 25 34 30 37 43 78 12 -1
file/file97.txt 16 40 75 99 99 14 3 32 68 -1
file/file62.txt 36 62 19 5 89 79 50 20 100 -1
file/file57.txt 54 58 79 14 19 74 51 10 46 0
file/file36.txt 23 72 82 12 2 7 38 0 75 -1
file/file83.txt 92 43 41 4 31 31 89 68 19 -1
file/file26.txt 10 74 87 78 11 26 47 66 73 0
file/file14.txt 44 14 68 51 48 45 23 27 93 0
file/file16.txt 36 71 15 51 84 38 20 69 65 0
file/file30.txt 8 91 2 66 70 86 16 2 78 0
file/file74.txt 57 34 36 15 92 86 88 0 98 -1
file/file10.txt 74 53 0 2 57 37 49 78 78 0
file/file0.txt 53 21 38 43 68 28 54 57 67 0
file/file85.txt 90 26 84 33 35 56 100 40 98 -1
file/file30.txt 6 68 29 66 84 81 9 3 31 -1
file/file78.txt 53 57 86 25 19 93 92 88 6 0
file/file7.txt 25 54 94 38 25 20 8 31 82 0
file/file8.txt 40 79 49 82 57 12 76 66 70 -1
file/file70.txt 51 12 94 9 51 91 25 72 71 -1
file/file62.txt 64 3 37 51 7 42 58 26 41 -1
file/file82.txt 92 72 61 39 60 57 56 54 40 -1
file/file18.txt 96 88 27 57 65 36 41 1 13 -1
file/file33.txt 20 16 78 72 74 94 34 16 48 0
file/file95.txt 61 77 79 81 91 39 62 89 47 -1
file/file12.txt 91 16 37 2 100 24 78 46 68 0
file/file36.txt 86 96 92 89 98 51 32 50 46 0
file/file83.txt 26 24 42 71 91 73 36 16 17 0
file/file46.txt 13 16 53 92 87 18 84 11 65 -1
file/file99.txt 92 69 57 37 54 63 56 94 86 0
file/file96.txt 20 94 81 84 25 89 94 40 20 -1
file/file55.txt 11 82 22 35 32 33 87 4 53 -1
file/file11.txt 76 47 22 59 67 7 3 31 2 -1
file/file50.txt 45 68 39 98 65 36 43 17 20 0
file/file85.txt 69 40 7 11 49 78 90 34 85 0
file/file60.txt 85 65 12 25 91 57 89 36 96 0
file/file94.txt 82 75 100 10 45 51 72 61 89 -1
file/file52.txt 38 85 87 49 22 32 35 61 6 -1
file/file64.txt 39 68 96 68 45 63 75 68 58 0
file/file46.txt 51 7 82 18 36 81 73 30 61 0
file/file72.txt 63 4 64 48 56 53 14 51 35 -1
file/file77.txt 75 54 99 88 77 52 64 22 8 0
file/file16.txt 89 21 39 82 28 7 10 16 53 -1
file/file71.txt 67 34 8 24 97 75 38 80 45 0
file/file65.txt 98 72 30 61 43 30 24 93 10 -1
file/file59.txt 6 31 49 50 39 46 34 29 15 -1
file/file46.txt 19 3 80 69 98 25 59 83 6 -1
file/file36.txt 25 68 84 38 42 87 15 23 70 -1
