file/file67.txt 83 84 93 17 55 96 26 14 54 -1
file/file78.txt 32 32 20 2 10 31 44 45 96 -1
file/file37.txt 47 32 32 85 67 17 55 5 11 0
file/file11.txt 98 2 88 61 10 35 19 49 97 -1
file/file10.txt 48 99 51 2 48 34 94 38 61 -1
file/file43.txt 32 81 49 66 73 14 38 45 63 0
file/file22.txt 98 37 36 89 41 6 34 45 0 -1
file/file42.txt 42 55 30 96 72 92 45 20 16 0
file/file39.txt 44 3 59 74 69 35 21 59 28 -1
file/file86.txt 41 82 5 64 37 95 76 83 94 0
file/file39.txt 85 66 74 19 87 13 53 5 18 -1
file/file24.txt 10 25 70 38 24 52 43 14 11 -1
file/file48.txt 24 2 72 25 82 27 4 1 44 0
file/file94.txt 9 5 99 65 30 76 2 7 24 0
file/file97.txt 63 63 94 33 38 44 68 0 81 0
file/file61.txt 34 37 4 92 34 99 4 23 12 0
file/file88.txt 12 45 100 84 21 63 97 24 46 0
file/file35.txt 60 26 82 91 13 81 83 52 95 0
file/file90.txt 90 43 18 46 12 79 56 15 27 -1
file/file37.txt 22 88 74 43 36 89 96 88 79 -1
file/file100.txt 26 54 61 46 35 85 4 32 18 0
file/file66.txt 81 56 84 51 88 3 43 93 90 0
file/file48.txt 9 7 67 50 73 45 18 38 4 0
file/file44.txt 24 87 39 11 90 9 61 85 2 0
file/file98.txt 99 67 21 78 52 96 69 7 43 0
file/file83.txt 67 5 22 64 64 53 19 46 64 0
file/file11.txt 84 32 36 72 22 93 5 34 85 0
file/file73.txt 3 42 25 91 77 10 54 95 95 0
file/file89.txt 84 75 19 80 10 32 17 88 46 0
file/file26.txt 3 77 42 94 3 86 45 17 80 -1
file/file48.txt 39 83 24 95 57 81 60 15 7 -1
file/file45.txt 63 49 40 57 57 13 16 2 83 -1
file/file99.txt 76 69 24 72 92 66 77 91 15 0
file/file37.txt 18 52 89 8 70 4 26 39 6 0
file/file96.txt 72 9 81 23 33 79 58 19 23 -1
file/file11.txt 66 91 70 56 87 94 76 88 49 -1
file/file31.txt 85 46 50 75 94 52 93 70 71 0
file/file4.txt 2 14 18 52 100 12 66 90 21 -1
file/file5.txt 68 9 50 100 48 8 96 8 74 -1
file/file94.txt 77 57 81 93 0 95 37 3 12 0
file/file79.txt 82 98 15 59 17 10 83 8 7 0
file/file43.txt 88 13 77 59 63 95 22 71 54 -1
file/file40.txt 12 8 17 23 2 30 41 45 39 0
file/file37.txt 84 89 76 55 0 50 13 83 71 0
file/file43.txt 98 81 3 49 69 99 68 64 100 -1
file/file20.txt 84 37 94 29 67 12 71 62 50 0
file/file79.txt 33 35 22 92 27 85 7 100 43 -1
file/file87.txt 38 61 81 71 18 39 98 36 41 -1
file/file13.txt 87 75 97 39 55 97 63 96 75 0
file/file65.txt 7 88 84 79 73 62 17 19 80 -1
