file/file6.txt 45 34 93 58 51 25 31 64 14 -1
file/file9.txt 93 50 41 55 28 33 8 75 73 -1
file/file77.txt 77 12 13 98 66 69 35 29 92 0
file/file65.txt 51 26 62 41 28 0 96 2 58 0
file/file50.txt 53 8 56 87 60 90 54 60 97 -1
file/file16.txt 19 8 93 34 30 96 73 35 41 -1
file/file71.txt 94 17 94 10 31 74 8 25 47 0
file/file52.txt 58 48 60 62 40 63 7 35 49 0
file/file61.txt 43 100 26 47 56 2 73 72 37 0
file/file8.txt 62 36 79 4 17 75 79 21 78 -1
file/file32.txt 38 89 92 71 60 51 37 12 40 -1
file/file30.txt 41 51 58 28 15 100 61 95 72 -1
file/file30.txt 24 16 57 53 84 97 21 87 25 -1
file/file40.txt 88 9 90 97 91 63 80 19 35 0
file/file55.txt 48 7 11 66 99 9 44 77 66 -1
file/file85.txt 92 91 69 30 30 25 63 45 15 0
file/file100.txt 81 37 76 18 1 21 83 21 72 0
file/file100.txt 55 61 91 24 80 33 27 73 60 0
file/file74.txt 37 23 31 92 88 14 4 92 97 -1
file/file21.txt 75 36 0 68 21 50 49 53 19 0
file/file65.txt 74 61 7 71 44 55 3 16 70 0
file/file98.txt 58 38 72 92 4 12 74 57 33 -1
file/file82.txt 7 77 92 14 45 20 17 20 47 -1
file/file98.txt 38 10 48 12 67 32 70 69 24 0
file/file64.txt 21 46 62 1 93 5 41 7 41 -1
file/file67.txt 74 84 83 33 17 35 87 47 92 -1
file/file72.txt 56 79 66 24 27 33 53 93 68 -1
file/file2.txt 24 16 78 65 23 85 35 26 97 -1
file/file52.txt 79 35 78 35 80 54 28 91 32 -1
file/file76.txt 53 14 90 55 70 76 19 100 59 0
file/file91.txt 60 24 20 33 70 86 67 73 74 -1
file/file40.txt 77 4 24 66 78 57 71 96 93 -1
file/file13.txt 30 15 60 42 15 12 6 32 86 -1
file/file18.txt 44 93 87 50 84 80 33 2 36 0
file/file39.txt 90 39 33 35 11 86 63 36 33 0
file/file30.txt 7 96 30 62 34 99 95 82 72 0
file/file42.txt 89 28 46 99 82 86 74 46 37 -1
file/file94.txt 21 79 96 87 85 11 10 60 95 -1
file/file65.txt 28 46 57 66 52 10 51 95 87 -1
file/file95.txt 21 22 69 93 86 30 15 25 44 -1
file/file3.txt 10 28 62 26 34 92 66 14 23 0
file/file80.txt 23 0 56 80 36 61 33 79 2 -1
file/file13.txt 78 47 98 13 74 25 24 64 70 0
file/file98.txt 75 8 18 44 36 1 96 73 99 0
file/file54.txt 93 18 32 64 47 67 59 20 71 -1
file/file63.txt 10 33 59 59 27 1 95 67 82 0
file/file67.txt 30 99 45 14 21 44 85 55 83 0
file/file0.txt 25 91 61 91 36 62 17 65 33 0
file/file83.txt 37 89 88 9 34 22 3 40 50 0
file/file86.txt 17 20 80 99 27 77 84 76 52 -1
