file/file63.txt 79 28 3 60 42 53 100 43 2 0
file/file77.txt 26 44 6 54 4 96 89 14 52 -1
file/file32.txt 0 94 23 83 62 16 25 63 100 0
file/file95.txt 6 78 36 95 85 61 20 7 62 -1
file/file11.txt 60 37 65 68 1 24 70 42 92 -1
file/file32.txt 2 86 79 1 18 77 33 45 37 -1
file/file99.txt 39 34 26 81 96 26 60 63 48 0
file/file27.txt 95 49 10 87 28 5 5 83 2 -1
file/file24.txt 38 51 77 6 44 96 24 99 18 -1
file/file12.txt 43 97 15 18 34 36 11 75 53 -1
file/file67.txt 56 24 46 11 34 86 13 94 74 -1
file/file41.txt 69 99 78 37 41 18 2 5 22 0
file/file66.txt 27 20 99 15 16 25 64 98 23 -1
file/file2.txt 56 76 56 45 13 79 31 74 9 0
file/file87.txt 9 32 20 69 37 50 14 78 48 -1
file/file58.txt 9 8 17 37 42 33 1 12 51 -1
file/file61.txt 37 60 74 46 2 90 34 19 92 0
file/file28.txt 72 66 54 54 90 59 9 89 37 0
file/file55.txt 28 54 28 33 70 36 27 92 7 -1
file/file21.txt 34 39 70 32 21 8 100 98 81 0
file/file21.txt 12 11 27 73 80 4 43 1 42 0
file/file3.txt 59 26 36 6 68 30 38 39 0 -1
file/file14.txt 61 8 77 29 41 83 19 9 45 0
file/file43.txt 56 83 56 40 31 33 21 23 49 -1
file/file71.txt 67 31 24 35 14 68 7 93 0 -1
file/file97.txt 57 95 95 53 51 80 28 60 47 0
file/file42.txt 83 73 96 12 19 11 7 12 32 0
file/file90.txt 14 39 66 76 32 2 34 15 22 0
file/file41.txt 41 30 99 57 51 32 27 7 31 0
file/file82.txt 68 16 75 94 34 76 27 46 74 0
file/file92.txt 31 70 79 27 54 99 39 3 45 -1
file/file24.txt 1 2 73 12 58 68 77 76 35 -1
file/file29.txt 99 98 35 41 35 69 47 84 26 0
file/file96.txt 91 26 1 55 96 18 62 24 62 -1
file/file78.txt 47 33 81 67 34 88 9 5 41 -1
file/file78.txt 69 85 40 57 17 45 84 48 51 0
file/file83.txt 58 73 37 99 41 73 70 97 46 0
file/file96.txt 50 41 29 71 86 58 95 94 26 -1
file/file22.txt 81 23 87 9 90 27 41 47 16 0
file/file58.txt 8 86 29 45 71 99 61 81 59 -1
file/file57.txt 68 12 91 50 94 82 11 51 0 -1
file/file18.txt 78 47 17 72 5 40 80 70 38 0
file/file46.txt 29 95 83 55 8 72 65 60 39 0
file/file12.txt 83 95 42 99 16 57 87 60 35 0
file/file78.txt 70 91 35 64 73 92 62 53 21 -1
file/file32.txt 5 27 62 82 62 32 71 65 70 0
file/file2.txt 23 91 10 30 24 4 50 26 59 0
file/file42.txt 85 49 13 8 28 97 9 96 4 0
file/file13.txt 53 30 96 31 7 48 39 36 64 0
file/file98.txt 88 10 22 6 58 12 99 100 15 -1
