file/file71.txt 76 11 47 53 20 24 91 76 15 0
file/file100.txt 90 3 62 41 5 10 50 65 51 -1
file/file51.txt 39 67 59 23 41 16 75 19 98 -1
file/file38.txt 57 5 57 46 87 72 53 32 9 -1
file/file92.txt 73 31 51 74 0 41 10 31 67 0
file/file27.txt 9 90 12 54 84 22 39 52 62 -1
file/file85.txt 100 54 14 94 19 19 79 42 1 -1
file/file42.txt 5 92 39 82 37 63 20 47 17 -1
file/file87.txt 38 35 57 25 50 21 46 98 89 0
file/file60.txt 75 50 55 79 73 74 24 11 94 0
file/file1.txt 50 47 77 4 17 7 60 81 88 0
file/file80.txt 17 63 74 12 78 67 78 76 99 0
file/file98.txt 84 7 77 8 36 17 62 56 24 -1
file/file48.txt 53 52 0 65 42 3 21 34 79 0
file/file40.txt 82 47 0 78 37 52 89 19 59 0
file/file62.txt 32 89 8 25 17 67 95 43 50 -1
file/file25.txt 26 11 18 14 47 24 96 86 53 0
file/file44.txt 12 10 94 58 70 6 29 93 34 0
file/file71.txt 48 51 67 81 98 55 24 34 20 0
file/file76.txt 13 67 60 38 11 37 59 56 72 -1
file/file1.txt 74 39 40 61 36 68 36 16 59 0
file/file74.txt 37 65 31 20 2 25 47 21 30 0
file/file96.txt 13 53 54 80 10 24 60 89 63 -1
file/file28.txt 81 99 38 38 56 9 16 9 43 -1
file/file50.txt 78 25 93 53 13 75 6 5 30 0
file/file60.txt 68 25 94 50 10 39 92 93 58 -1
file/file48.txt 79 60 83 28 36 84 73 23 64 0
file/file69.txt 68 28 68 32 63 22 95 31 14 -1
file/file73.txt 29 98 48 42 70 71 86 10 57 -1
file/file100.txt 58 52 10 54 6 4 36 17 68 -1
file/file22.txt 51 87 12 17 43 59 20 41 58 0
file/file83.txt 80 65 2 32 64 92 16 58 51 0
file/file68.txt 19 48 35 32 7 72 25 88 64 -1
file/file2.txt 44 24 2 53 68 33 80 14 76 -1
file/file71.txt 56 56 58 6 42 78 64 30 38 0
file/file48.txt 56 12 23 49 63 46 35 2 10 0
file/file69.txt 14 6 39 38 8 49 44 87 64 0
file/file64.txt 24 60 74 1 58 90 77 92 10 -1
file/file53.txt 93 85 5 100 43 58 59 25 7 -1
file/file23.txt 100 34 22 94 20 9 50 3 68 0
file/file46.txt 84 6 26 87 31 13 98 95 96 0
file/file81.txt 74 12 87 34 47 55 93 26 23 0
file/file27.txt 40 13 73 11 84 63 34 18 79 -1
file/file28.txt 82 45 72 40 56 89 85 62 96 0
file/file51.txt 82 4 26 30 45 49 79 0 36 -1
file/file9.txt 16 62 74 78 79 25 78 53 35 0
file/file40.txt 48 48 25 5 20 9 45 27 8 -1
file/file90.txt 70 66 70 55 21 81 73 4 70 0
file/file6.txt 55 64 5 44 22 78 14 27 54 0
file/file91.txt 68 88 19 43 46 31 6 40 25 0
