{
  "type": "doc",
  "content": [
    {
      "type": "orderedList",
      "attrs": {
        "start": 1
      },
      "content": [
        {
          "type": "listItem",
          "content": [
            {
              "type": "paragraph",
              "content": [
                {
                  "type": "text",
                  "text": "Attendees:",
                  "marks": [
                    {
                      "type": "bold",
                      "attrs": {}
                    }
                  ]
                },
                {
                  "type": "text",
                  "text": " "
                },
                {
                  "type": "text",
                  "text": "Name, Name, …",
                  "marks": [
                    {
                      "type": "italic",
                      "attrs": {}
                    }
                  ]
                }
              ]
            }
          ]
        },
        {
          "type": "listItem",
          "content": [
            {
              "type": "paragraph",
              "content": [
                {
                  "type": "text",
                  "text": "Goal:",
                  "marks": [
                    {
                      "type": "bold",
                      "attrs": {}
                    }
                  ]
                },
                {
                  "type": "text",
                  "text": " "
                },
                {
                  "type": "text",
                  "text": "Type the goal of this Meeting here",
                  "marks": [
                    {
                      "type": "italic",
                      "attrs": {}
                    }
                  ]
                }
              ]
            }
          ]
        },
        {
          "type": "listItem",
          "content": [
            {
              "type": "paragraph",
              "content": [
                {
                  "type": "text",
                  "text": "Topics",
                  "marks": [
                    {
                      "type": "bold",
                      "attrs": {}
                    }
                  ]
                }
              ]
            },
            {
              "type": "orderedList",
              "attrs": {
                "start": 1
              },
              "content": [
                {
                  "type": "listItem",
                  "content": [
                    {
                      "type": "paragraph",
                      "content": [
                        {
                          "type": "text",
                          "text": "Topic 1"
                        }
                      ]
                    }
                  ]
                },
                {
                  "type": "listItem",
                  "content": [
                    {
                      "type": "paragraph",
                      "content": [
                        {
                          "type": "text",
                          "text": "Topic 2"
                        }
                      ]
                    }
                  ]
                }
              ]
            }
          ]
        },
        {
          "type": "listItem",
          "content": [
            {
              "type": "paragraph",
              "content": [
                {
                  "type": "text",
                  "text": "Additional Information",
                  "marks": [
                    {
                      "type": "bold",
                      "attrs": {}
                    }
                  ]
                }
              ]
            },
            {
              "type": "orderedList",
              "attrs": {
                "start": 1
              },
              "content": [
                {
                  "type": "listItem",
                  "content": [
                    {
                      "type": "paragraph",
                      "content": [
                        {
                          "type": "text",
                          "text": "Time box infos here",
                          "marks": [
                            {
                              "type": "italic",
                              "attrs": {}
                            }
                          ]
                        }
                      ]
                    }
                  ]
                },
                {
                  "type": "listItem",
                  "content": [
                    {
                      "type": "paragraph",
                      "content": [
                        {
                          "type": "text",
                          "text": "Reading list: "
                        },
                        {
                          "type": "text",
                          "text": "Link",
                          "marks": [
                            {
                              "type": "italic",
                              "attrs": {}
                            }
                          ]
                        }
                      ]
                    }
                  ]
                },
                {
                  "type": "listItem",
                  "content": [
                    {
                      "type": "paragraph",
                      "content": [
                        {
                          "type": "text",
                          "text": "Comments",
                          "marks": [
                            {
                              "type": "italic",
                              "attrs": {}
                            }
                          ]
                        }
                      ]
                    }
                  ]
                }
              ]
            }
          ]
        }
      ]
    }
  ]
}