,Target,day,hour,MJD,RA_Obs,Dec_Obs
4457,Mrk421,20210417,21:44:27,59321.90586805555,166.617,38.2089
4458,Mrk421,20210417,22:07:19,59321.921747685185,165.599,38.2089
4459,Mrk421,20210417,22:30:31,59321.93785879629,166.108,38.61
4460,M87,20210417,23:18:36,59321.97125,187.299,12.3897
4461,M87,20210417,23:33:00,59321.98125,187.299,12.3897
4462,M87,20210417,23:51:50,59321.9943287037,187.708,12.79
4463,M87,20210418,00:12:53,59322.00894675926,187.708,11.99
4464,M87,20210418,00:35:14,59322.02446759259,188.118,12.3897
4465,M87,20210418,00:57:13,59322.03973379629,187.299,12.3897
4467,OP313,20210418,01:36:42,59322.06715277778,197.621,32.7456
4468,OP313,20210418,01:57:45,59322.081770833334,197.621,31.9456
4473,Mrk501,20210418,04:18:45,59322.1796875,253.987,39.7588
4474,Mrk501,20210418,04:31:48,59322.18875,253.987,39.7588
4475,Mrk501,20210418,04:54:46,59322.20469907407,252.946,39.7588
4476,Mrk501,20210418,05:17:14,59322.220300925925,253.467,40.16
4479,Mrk421,20210419,00:51:42,59323.03590277778,166.617,38.2089
4480,Mrk501,20210419,01:19:17,59323.05505787037,253.467,39.36
4481,Mrk501,20210419,01:43:45,59323.07204861111,253.987,39.7588
4482,Mrk501,20210419,01:51:42,59323.077569444446,253.987,39.7588
4483,Mrk501,20210419,02:05:07,59323.08688657408,252.946,39.7588
4484,Mrk501,20210419,02:22:38,59323.09905092593,253.467,40.16
4486,GalCent,20210419,04:08:20,59323.1724537037,266.194,-28.5473
4487,GalCent,20210419,04:31:07,59323.18827546296,266.641,-29.4678
4488,GalCent,20210419,04:53:36,59323.203888888886,266.984,-28.9457
4490,M87,20210420,00:20:00,59324.01388888889,187.708,12.79
4491,M87,20210420,00:40:21,59324.028020833335,187.708,11.99
4492,M87,20210420,01:01:08,59324.0424537037,188.118,12.3897
4493,M87,20210420,01:24:01,59324.058344907404,187.299,12.3897
4494,M87,20210420,01:47:18,59324.07451388889,187.708,12.79
4495,M87,20210420,02:03:50,59324.08599537037,187.708,11.99
4496,Mrk501,20210420,02:26:47,59324.10193287037,253.467,40.16
4497,Mrk501,20210420,02:46:44,59324.11578703704,253.467,39.36
4498,Mrk501,20210420,03:08:32,59324.13092592593,253.987,39.7588
4500,GalCent,20210420,03:44:06,59324.155625,266.194,-28.5473
4501,GalCent,20210420,04:11:50,59324.17488425926,266.641,-29.4678
4502,GalCent,20210420,04:34:18,59324.19048611111,266.984,-28.9457
4503,GalCent,20210420,04:56:09,59324.205659722225,265.849,-29.0675
4505,M87,20210421,01:40:52,59325.0700462963,187.708,12.79
4506,M87,20210421,02:09:31,59325.08994212963,187.708,11.99
4507,M87,20210421,02:28:23,59325.10304398148,188.118,12.3897
4508,M87,20210421,02:40:12,59325.11125,188.118,12.3897
4509,M87,20210421,02:50:35,59325.11846064815,188.118,12.3897
4511,GalCent,20210421,03:20:51,59325.13947916667,266.641,-29.4678
4512,GalCent,20210421,03:24:38,59325.14210648148,266.641,-29.4678
4513,GalCent,20210421,03:33:20,59325.148148148146,266.641,-29.4678
4514,PG1553+113,20210421,03:48:43,59325.15883101852,239.345,11.1944
4515,PG1553+113,20210421,04:01:06,59325.16743055556,238.53,11.1944
4516,PG1553+113,20210421,04:19:48,59325.18041666667,238.938,10.7947
4517,GalCent,20210421,04:39:02,59325.193773148145,266.984,-28.9457
4518,GalCent,20210421,04:48:35,59325.20040509259,266.984,-28.9457
4519,GalCent,20210421,05:00:25,59325.20862268518,265.849,-29.0675
4568,Mrk421,20210430,22:08:34,59334.92261574074,166.617,38.2089
4569,Mrk421,20210430,22:31:21,59334.9384375,165.599,38.2089
4570,Mrk421,20210430,22:53:37,59334.95390046296,166.108,38.61
4571,Mrk421,20210430,23:17:16,59334.97032407407,166.108,37.81
4572,Mrk421,20210430,23:39:53,59334.986030092594,166.617,38.2089
4585,Mrk501,20210504,01:49:04,59338.075740740744,253.987,39.7588
4586,Mrk501,20210504,01:53:41,59338.07894675926,253.987,39.7588
4587,Mrk501,20210504,02:10:41,59338.09075231481,253.987,39.7588
4588,Mrk501,20210504,02:30:28,59338.10449074074,252.946,39.7588
4589,Mrk501,20210504,02:53:14,59338.120300925926,253.467,40.16
4590,Mrk501,20210504,03:07:15,59338.13003472222,253.467,39.36
4592,DarkPatch27,20210504,21:30:36,59338.89625,209.071,24.375
4593,DarkPatch27,20210504,21:38:09,59338.90149305556,209.071,24.375
4594,M87,20210504,22:57:13,59338.956400462965,187.299,12.3897
4595,M87,20210504,23:13:34,59338.96775462963,187.708,12.79
4597,Mrk501,20210504,23:48:41,59338.9921412037,253.987,39.7588
4598,Mrk501,20210505,00:12:55,59339.00896990741,252.946,39.7588
4599,Mrk501,20210505,00:37:38,59339.02613425926,253.467,40.16
4600,Mrk501,20210505,01:00:10,59339.04178240741,253.467,39.36
4601,Mrk501,20210505,01:22:17,59339.0571412037,253.987,39.7588
4602,Mrk501,20210505,01:40:18,59339.069652777776,252.946,39.7588
4603,GalCent,20210505,02:05:27,59339.087118055555,266.984,-28.9457
4604,GalCent,20210505,02:22:28,59339.09893518518,265.849,-29.0675
4605,GalCent,20210505,02:37:23,59339.109293981484,266.194,-28.5473
4606,GalCent,20210505,02:53:10,59339.120254629626,266.641,-29.4678
4607,GalCent,20210505,03:07:31,59339.130219907405,266.984,-28.9457
4612,Mrk421,20210505,22:18:57,59339.92982638889,166.617,38.2089
4613,Mrk421,20210505,22:37:34,59339.94275462963,165.599,38.2089
4614,Mrk421,20210505,22:54:55,59339.95480324074,166.108,38.61
4615,GalCent,20210506,03:19:32,59340.13856481481,266.194,-28.5473
4616,GalCent,20210506,03:36:08,59340.150092592594,266.641,-29.4678
4625,Mrk501,20210507,01:06:48,59341.04638888889,253.987,39.7588
4626,Mrk501,20210507,01:30:11,59341.062627314815,252.946,39.7588
4627,Mrk501,20210507,01:52:22,59341.07803240741,253.467,40.16
4628,Mrk501,20210507,02:14:55,59341.09369212963,253.467,39.36
4629,GalCent,20210507,02:45:46,59341.115115740744,266.984,-28.9457
4630,GalCent,20210507,03:18:37,59341.13792824074,266.194,-28.5473
4631,GalCent,20210507,03:34:38,59341.149050925924,266.641,-29.4678
4632,4FGLJ1723.5-0501e,20210507,04:44:48,59341.19777777778,260.962,-5.85389
4637,M87,20210507,22:51:18,59341.95229166667,187.299,12.3897
4638,GalCent,20210508,02:50:09,59342.118159722224,266.984,-28.9457
4639,GalCent,20210508,03:01:53,59342.12630787037,265.849,-29.0675
4640,GalCent,20210508,03:23:25,59342.14126157408,266.194,-28.5473
4641,GalCent,20210508,03:46:33,59342.157326388886,266.641,-29.4678
4642,Mrk501,20210508,04:04:19,59342.16966435185,253.987,39.7588
4643,Mrk501,20210508,04:13:02,59342.175717592596,252.946,39.7588
4644,Mrk501,20210508,04:29:44,59342.187314814815,253.467,40.16
4645,Mrk501,20210508,04:46:13,59342.19876157407,253.467,39.36
4649,Mrk421,20210508,21:49:48,59342.909583333334,165.599,38.2089
4652,PG1553+113,20210508,23:04:07,59342.96119212963,238.938,11.5947
4653,PG1553+113,20210508,23:26:01,59342.97640046296,238.938,10.7947
4654,PG1553+113,20210508,23:49:43,59342.99285879629,239.345,11.1944
4656,Mrk501,20210509,01:04:11,59343.04457175926,253.987,39.7588
4657,Mrk501,20210509,01:22:07,59343.057025462964,252.946,39.7588
4660,GalCent,20210509,02:46:57,59343.1159375,266.641,-29.4678
4662,GalCent,20210509,03:19:44,59343.138703703706,265.849,-29.0675
4663,GalCent,20210509,03:42:43,59343.15466435185,266.194,-28.5473
4667,Mrk421,20210509,21:55:38,59343.91363425926,166.617,38.2089
4668,Mrk421,20210509,22:21:03,59343.931284722225,165.599,38.2089
4669,Mrk421,20210509,22:46:31,59343.948969907404,166.108,38.61
4670,Mrk421,20210509,23:12:06,59343.96673611111,166.108,37.81
4671,Mrk421,20210509,23:37:14,59343.984189814815,166.617,38.2089
4672,Mrk501,20210510,00:04:59,59344.00346064815,253.467,40.16
4673,Mrk501,20210510,00:29:37,59344.02056712963,253.467,39.36
4674,Mrk501,20210510,00:52:24,59344.03638888889,253.987,39.7588
4675,Mrk501,20210510,01:15:36,59344.0525,252.946,39.7588
4676,Mrk501,20210510,01:38:39,59344.068506944444,253.467,40.16
4677,Mrk501,20210510,02:02:09,59344.08482638889,253.467,39.36
4678,GalCent,20210510,02:35:34,59344.10803240741,266.984,-28.9457
4679,GalCent,20210510,03:06:36,59344.129583333335,266.194,-28.5473
4680,GalCent,20210510,03:22:37,59344.140706018516,266.641,-29.4678
4681,GalCent,20210510,03:38:38,59344.1518287037,266.984,-28.9457
4682,4FGLJ1723.5-0501e,20210510,03:56:36,59344.164305555554,260.26,-5.1535
4683,4FGLJ1723.5-0501e,20210510,04:13:43,59344.17619212963,260.962,-4.45389
4684,4FGLJ1723.5-0501e,20210510,04:34:11,59344.190405092595,260.962,-5.85389
4699,DarkPatch35,20210511,23:04:19,59345.961331018516,221.75,31.2
4700,PKS1406-076,20210511,23:30:37,59345.97959490741,212.235,-8.274
4701,PKS1406-076,20210511,23:44:27,59345.98920138889,212.639,-7.87381
4702,PKS1406-076,20210512,00:05:24,59346.00375,211.831,-7.87381
4715,GalCent,20210512,02:29:20,59346.1037037037,266.984,-28.9457
4716,GalCent,20210512,02:52:37,59346.11987268519,266.984,-28.9457
4717,GalCent,20210512,03:24:49,59346.142233796294,266.984,-28.9457
4718,GRB210511B,20210512,03:37:59,59346.15137731482,316.179,62.09
4719,GRB210511B,20210512,03:57:00,59346.16458333333,316.179,61.29
4720,GRB210511B,20210512,04:19:12,59346.18,317.023,61.6874
4721,GRB210511B,20210512,04:38:14,59346.19321759259,315.336,61.6874
4724,1ES1215+303,20210512,21:47:15,59346.9078125,184.467,30.5167
4725,1ES1215+303,20210512,22:14:34,59346.926782407405,184.467,30.5167
4726,1ES1215+303,20210512,22:41:28,59346.94546296296,184.467,29.7167
4727,GalCent,20210513,02:20:37,59347.097650462965,265.849,-29.0675
4729,GalCent,20210513,02:55:19,59347.12174768518,266.641,-29.4678
4730,GalCent,20210513,03:09:44,59347.13175925926,266.984,-28.9457
4731,GalCent,20210513,03:26:39,59347.14350694444,265.849,-29.0675
4732,V1405Cas,20210513,03:48:47,59347.15887731482,352.029,61.1849
4733,V1405Cas,20210513,04:05:23,59347.17040509259,350.369,61.1849
4734,V1405Cas,20210513,04:21:58,59347.181921296295,351.199,61.5874
4735,V1405Cas,20210513,04:38:49,59347.19362268518,351.199,60.7874
4738,FRB20200120E,20210513,23:59:37,59347.9997337963,149.425,68.8158
4740,FRB20200120E,20210514,00:39:39,59348.02753472222,149.425,68.8158
4741,FRB20200120E,20210514,01:10:59,59348.04929398148,149.425,68.8158
4742,FRB20200120E,20210514,01:42:49,59348.07140046296,149.425,68.8158
4743,V1405Cas,20210514,03:49:22,59348.15928240741,352.029,61.1849
4744,V1405Cas,20210514,04:06:44,59348.17134259259,350.369,61.1849
4745,V1405Cas,20210514,04:23:34,59348.18303240741,351.199,61.5874
4777,TXS1700+685,20210515,02:46:18,59349.11548611111,256.13,68.4984
4778,TXS1700+685,20210515,03:09:33,59349.131631944445,253.947,68.4984
4779,Calipso,20210515,03:44:27,59349.15586805555,280.5,30.0
4780,V1405Cas,20210515,03:55:41,59349.163668981484,352.029,61.1849
4781,V1405Cas,20210515,04:11:53,59349.17491898148,350.369,61.1849
4782,V1405Cas,20210515,04:31:31,59349.18855324074,351.199,61.5874
4783,V1405Cas,20210515,04:46:42,59349.19909722222,351.199,60.7874
4786,TXS1700+685,20210516,02:15:06,59350.093819444446,256.13,68.4984
4787,TXS1700+685,20210516,02:26:34,59350.10178240741,253.947,68.4984
4788,TXS1700+685,20210516,02:42:55,59350.11313657407,255.039,68.9019
4789,TXS1700+685,20210516,02:59:40,59350.124768518515,255.039,68.1019
4790,V1405Cas,20210516,03:18:07,59350.13758101852,352.029,61.1849
4791,V1405Cas,20210516,03:42:56,59350.154814814814,350.369,61.1849
4792,V1405Cas,20210516,04:05:49,59350.17070601852,351.199,61.5874
4793,V1405Cas,20210516,04:44:19,59350.19744212963,351.199,60.7874
4802,4FGLJ1723.5-0501e,20210517,04:46:45,59351.19913194444,260.26,-5.1535
4819,PKS1510-089,20210519,02:45:10,59353.114699074074,228.212,-9.1
4820,TXS1700+685,20210519,03:04:58,59353.12844907407,255.039,68.5019
4822,4FGLJ1723.5-0501e,20210519,03:25:42,59353.142847222225,261.665,-5.1535
4840,1ES1959+650,20210531,01:38:34,59365.068449074075,299.044,65.1453
4841,1ES1959+650,20210531,01:58:27,59365.08225694444,299.996,65.5483
4843,1ES1959+650,20210531,02:29:51,59365.1040625,299.996,64.7483
4844,1ES1959+650,20210531,02:40:24,59365.11138888889,300.948,65.1453
4846,LHAASOJ2108+5157,20210531,03:26:53,59365.14366898148,318.123,51.946
4847,LHAASOJ2108+5157,20210531,03:51:16,59365.16060185185,316.177,51.946
4848,LHAASOJ2108+5157,20210531,04:13:28,59365.17601851852,317.15,52.55
4849,LHAASOJ2108+5157,20210531,04:31:39,59365.18864583333,317.15,51.35
4852,Mrk421,20210531,22:51:40,59365.9525462963,166.617,38.2089
4853,Mrk421,20210531,23:10:37,59365.96570601852,165.599,38.2089
4854,TXS1700+685,20210531,23:25:37,59365.976122685184,255.039,68.1019
4855,TXS1700+685,20210531,23:32:55,59365.98119212963,255.039,68.1019
4856,TXS1700+685,20210531,23:47:25,59365.991261574076,256.13,68.4984
4865,DarkPatch05,20210601,02:50:28,59366.11837962963,256.242,38.338
4868,Mrk421,20210601,23:07:02,59366.963217592594,166.617,38.2089
4869,Mrk421,20210601,23:41:09,59366.986909722225,165.599,38.2089
4870,GalCent,20210602,00:15:33,59367.01079861111,266.641,-29.4678
4871,GalCent,20210602,00:21:00,59367.01458333333,266.641,-29.4678
4872,GalCent,20210602,00:34:45,59367.02413194445,266.194,-28.5473
4873,GalCent,20210602,00:37:00,59367.02569444444,266.194,-28.5473
4874,GalCent,20210602,00:54:31,59367.0378587963,266.194,-28.5473
4875,GalCent,20210602,01:13:06,59367.05076388889,266.641,-29.4678
4876,GalCent,20210602,01:34:08,59367.06537037037,266.984,-28.9457
4877,GalCent,20210602,01:54:01,59367.07917824074,265.849,-29.0675
4885,GalCent,20210603,00:47:42,59368.033125,266.641,-29.4678
4886,Cyg-X3,20210603,00:55:50,59368.038773148146,307.777,40.6462
4887,Cyg-X3,20210603,01:11:20,59368.04953703703,307.777,40.6462
4889,Cyg-X3,20210603,01:25:15,59368.05920138889,307.777,40.6462
4890,Cyg-X3,20210603,01:38:05,59368.06811342593,308.518,40.705
4891,Cyg-X3,20210603,02:01:53,59368.084641203706,308.518,40.705
4892,Cyg-X3,20210603,02:20:30,59368.09756944444,307.777,40.6462
4894,Cyg-X3,20210603,02:50:20,59368.11828703704,307.777,40.6462
4895,LHAASOJ2108+5157,20210603,03:03:46,59368.12761574074,317.961,51.9472
4897,LHAASOJ2108+5157,20210603,03:38:50,59368.151967592596,317.15,52.45
4898,LHAASOJ2108+5157,20210603,03:58:58,59368.16594907407,317.15,51.45
4899,LHAASOJ2108+5157,20210603,04:19:22,59368.18011574074,317.961,51.9472
4902,PG1553+113,20210604,22:54:20,59369.95439814815,239.345,11.1944
4903,PG1553+113,20210604,23:11:56,59369.96662037037,238.53,11.1944
4904,PG1553+113,20210604,23:29:32,59369.978842592594,238.938,11.5947
4905,PG1553+113,20210604,23:44:47,59369.989432870374,238.938,10.7947
4906,GalCent,20210605,00:04:59,59370.00346064815,266.984,-28.9457
4907,GalCent,20210605,00:27:52,59370.01935185185,265.849,-29.0675
4908,GalCent,20210605,00:46:53,59370.03255787037,266.194,-28.5473
4909,GalCent,20210605,00:52:50,59370.03668981481,266.194,-28.5473
4910,GalCent,20210605,01:08:36,59370.047638888886,266.641,-29.4678
4911,GalCent,20210605,01:33:39,59370.065034722225,266.984,-28.9457
4912,GalCent,20210605,01:49:57,59370.07635416667,265.849,-29.0675
4913,LHAASOJ2108+5157,20210605,02:18:59,59370.0965162037,317.961,51.9472
4914,LHAASOJ2108+5157,20210605,02:42:17,59370.11269675926,316.339,51.9472
4915,LHAASOJ2108+5157,20210605,03:04:19,59370.12799768519,317.15,52.45
4916,LHAASOJ2108+5157,20210605,03:26:46,59370.143587962964,317.15,51.45
4917,LHAASOJ2108+5157,20210605,03:49:18,59370.15923611111,317.961,51.9472
4918,LHAASOJ2108+5157,20210605,04:12:21,59370.17524305556,316.339,51.9472
4923,gcw3,20210605,23:46:51,59370.99086805555,266.417,-29.0078
4924,GCW4,20210606,00:10:25,59371.0072337963,266.417,-29.0078
4925,GalacticCenter,20210606,00:30:42,59371.021319444444,266.417,-29.0078
4926,GalacticCenter,20210606,00:46:37,59371.032372685186,266.417,-29.0078
4927,GalacticCenterW2,20210606,01:00:57,59371.04232638889,266.417,-29.0078
4928,GalacticCenter,20210606,01:22:39,59371.05739583333,266.417,-29.0078
4929,GalacticCenter,20210606,01:42:16,59371.071018518516,266.417,-29.0078
4930,PG1553+113,20210606,02:06:04,59371.087546296294,238.938,11.1947
4931,PG1553+113,20210606,02:25:27,59371.101006944446,238.938,11.1947
4932,PG1553+113,20210606,02:45:00,59371.114583333336,238.938,11.1947
4933,Mrk501,20210606,03:06:49,59371.1297337963,253.467,39.76
4934,Mrk501,20210606,03:24:33,59371.14204861111,253.467,39.76
4935,LHAASOJ2108,20210606,03:50:12,59371.15986111111,317.15,51.95
4936,LHAASOJ2108,20210606,04:09:59,59371.17359953704,317.15,51.95
4939,mkn421/w4,20210606,21:59:28,59371.916296296295,166.108,38.21
4940,pg1553w1,20210606,22:28:47,59371.93665509259,238.938,11.1947
4941,pg1553/w2,20210606,22:54:16,59371.954351851855,238.938,11.1947
4942,pg1553/w3,20210606,23:20:45,59371.97274305556,238.938,11.1947
4943,pg1553/w4,20210606,23:46:19,59371.99049768518,238.938,11.1947
4944,Mrk501,20210607,00:26:39,59372.01850694444,253.467,39.76
4945,Mrk501,20210607,00:52:59,59372.03679398148,253.467,39.76
4946,Mrk501,20210607,01:16:47,59372.05332175926,253.467,39.76
4948,LhaasoJ2108+5157,20210607,02:08:39,59372.08934027778,317.15,51.95
4949,LhaasoJ2108+5157,20210607,02:26:21,59372.101631944446,317.15,51.95
4951,LhaasoJ2108+5157,20210607,03:06:12,59372.12930555556,317.15,51.95
4952,LhaasoJ2108+5157,20210607,03:33:46,59372.14844907408,317.15,51.95
4953,LhassoJ2108+5157,20210607,03:46:51,59372.157534722224,317.15,51.95
4954,LhassoJ2108+5157,20210607,03:58:05,59372.16533564815,317.15,51.95
4955,LhassoJ2108+5157,20210607,04:21:07,59372.18133101852,317.15,51.95
4962,Mrk421,20210608,21:47:13,59373.907789351855,165.599,38.2089
4963,TXS1700+685,20210608,22:18:25,59373.929456018515,255.039,68.9019
4964,TXS1700+685,20210608,22:32:28,59373.93921296296,255.039,68.1019
4965,TXS1700+685,20210608,22:53:37,59373.95390046296,256.13,68.4984
4966,GalCent,20210608,23:17:20,59373.97037037037,266.194,-28.5473
4967,GalCent,20210608,23:39:27,59373.98572916666,266.641,-29.4678
4968,GalCent,20210608,23:59:48,59373.99986111111,266.984,-28.9457
4969,Cyg-X3,20210609,00:22:57,59374.0159375,308.518,40.705
4970,Cyg-X3,20210609,00:44:40,59374.031018518515,308.518,40.705
4971,Cyg-X3,20210609,01:05:57,59374.045798611114,307.777,40.6462
4972,LHAASOJ2108+5157,20210609,01:26:49,59374.06028935185,317.15,52.45
4973,LHAASOJ2108+5157,20210609,01:48:37,59374.07542824074,317.15,51.45
4974,LHAASOJ2108+5157,20210609,02:11:55,59374.0916087963,317.961,51.9472
4975,LHAASOJ2108+5157,20210609,02:24:34,59374.10039351852,316.339,51.9472
4976,LHAASOJ2108+5157,20210609,02:32:19,59374.105775462966,317.15,52.45
4977,Mrk501,20210609,03:01:18,59374.12590277778,253.987,39.7588
4978,Mrk501,20210609,03:22:20,59374.14050925926,252.946,39.7588
4979,Mrk501,20210609,03:31:59,59374.147210648145,252.946,39.7588
4980,LHAASOJ2108+5157,20210609,03:45:15,59374.15642361111,317.15,51.45
4981,LHAASOJ2108+5157,20210609,04:04:11,59374.16957175926,317.961,51.9472
4982,LHAASOJ2108+5157,20210609,04:20:56,59374.1812037037,316.339,51.9472
4985,M87,20210609,21:39:48,59374.90263888889,187.708,12.79
4986,M87,20210609,21:45:46,59374.90678240741,187.708,12.79
4987,PG1553+113,20210609,22:11:14,59374.924467592595,239.345,11.1944
4988,PG1553+113,20210609,22:33:21,59374.93982638889,238.53,11.1944
4989,PG1553+113,20210609,22:55:08,59374.9549537037,238.938,11.5947
4990,GalCent,20210610,00:31:46,59375.02206018518,266.641,-29.4678
4991,GalCent,20210610,00:43:25,59375.03015046296,266.641,-29.4678
4992,GalCent,20210610,00:59:21,59375.04121527778,266.984,-28.9457
4993,GalCent,20210610,01:18:12,59375.05430555555,265.849,-29.0675
4994,LHAASOJ2108+5157,20210610,01:32:27,59375.06420138889,317.15,51.45
4995,LHAASOJ2108+5157,20210610,01:52:19,59375.077997685185,317.961,51.9472
4996,LHAASOJ2108+5157,20210610,02:12:56,59375.092314814814,316.339,51.9472
4997,LHAASOJ2108+5157,20210610,02:34:17,59375.107141203705,317.15,52.45
4998,LHAASOJ2108+5157,20210610,02:56:24,59375.1225,317.15,51.45
4999,LHAASOJ2108+5157,20210610,03:16:21,59375.136354166665,317.961,51.9472
5001,LHAASOJ2108+5157,20210610,03:59:22,59375.16622685185,317.15,52.45
5002,LHAASOJ2108+5157,20210610,04:20:07,59375.18063657408,317.15,51.45
5062,GalCent,20210629,23:20:44,59394.97273148148,266.641,-29.4678
5063,GalCent,20210629,23:33:05,59394.981307870374,266.984,-28.9457
5064,GalCent,20210629,23:50:51,59394.99364583333,265.849,-29.0675
5065,GalCent,20210630,00:14:28,59395.010046296295,266.194,-28.5473
5071,LHAASOJ2108+5157,20210630,23:54:55,59395.996469907404,317.15,52.45
5072,LHAASOJ2108+5157,20210701,00:14:26,59396.01002314815,317.15,51.45
5079,LHAASOJ2108+5157,20210701,23:02:57,59396.960381944446,317.961,51.9472
5080,LHAASOJ2108+5157,20210701,23:35:19,59396.9828587963,316.339,51.9472
5081,LHAASOJ2108+5157,20210701,23:51:49,59396.99431712963,317.15,52.45
5082,LHAASOJ2108+5157,20210702,00:20:15,59397.0140625,317.15,51.45
5083,LHAASOJ2108+5157,20210702,00:33:24,59397.023194444446,317.961,51.9472
5084,LHAASOJ2108+5157,20210702,00:56:27,59397.03920138889,316.339,51.9472
5088,LHAASOJ2108+5157,20210703,00:09:39,59398.00670138889,317.961,51.9472
5089,LHAASOJ2108+5157,20210703,00:31:41,59398.022002314814,316.339,51.9472
5090,LHAASOJ2108+5157,20210703,00:52:28,59398.03643518518,317.15,52.45
5091,LHAASOJ2108+5157,20210703,01:11:54,59398.04993055556,317.15,51.45
5092,LHAASOJ2108+5157,20210703,01:31:01,59398.063206018516,317.961,51.9472
5093,LHAASOJ2108+5157,20210703,01:40:30,59398.06979166667,316.339,51.9472
5094,Mrk501,20210703,02:02:43,59398.08521990741,253.987,39.7588
5095,Mrk501,20210703,02:16:49,59398.09501157407,252.946,39.7588
5096,Mrk501,20210703,02:30:18,59398.104375,253.467,40.16
5097,Mrk501,20210703,02:46:05,59398.115335648145,253.467,39.36
5100,LHAASOJ2108+5157,20210703,23:31:06,59398.97993055556,317.961,51.9472
5101,LHAASOJ2108+5157,20210704,00:00:52,59399.000601851854,316.339,51.9472
5102,LHAASOJ2108+5157,20210704,00:13:21,59399.00927083333,317.15,52.45
5103,LHAASOJ2108+5157,20210704,00:34:23,59399.023877314816,317.15,51.45
5104,LHAASOJ2108+5157,20210704,00:55:40,59399.03865740741,317.961,51.9472
5105,LHAASOJ2108+5157,20210704,01:16:26,59399.053078703706,316.339,51.9472
5106,LHAASOJ2108+5157,20210704,01:31:56,59399.06384259259,317.15,52.45
5107,LHAASOJ2108+5157,20210704,01:54:24,59399.07944444445,317.15,51.45
5108,LHAASOJ2108+5157,20210704,02:16:01,59399.094456018516,317.961,51.9472
5109,GRB210704,20210704,21:32:43,59399.89771990741,164.503,58.8577
5110,GRB210704,20210704,21:48:52,59399.90893518519,162.957,58.8577
5111,GRB210704,20210704,22:05:48,59399.920694444445,163.73,59.26
5112,GRB210704,20210704,22:22:38,59399.93238425926,163.73,58.46
5115,LHAASOJ2108+5157,20210704,23:10:41,59399.96575231481,316.339,51.9472
5116,LHAASOJ2108+5157,20210704,23:32:08,59399.98064814815,317.15,52.45
5117,LHAASOJ2108+5157,20210704,23:53:29,59399.995474537034,317.15,52.45
5118,LHAASOJ2108+5157,20210705,00:16:57,59400.011770833335,317.15,51.45
5119,LHAASOJ2108+5157,20210705,00:39:35,59400.02748842593,317.961,51.9472
5120,LHAASOJ2108+5157,20210705,01:02:51,59400.043645833335,316.339,51.9472
5121,LHAASOJ2108+5157,20210705,01:24:34,59400.05872685185,316.339,51.9472
5131,GRB210704,20210705,21:59:08,59400.91606481482,159.825,57.3068
5132,GRB210704,20210705,22:15:24,59400.92736111111,158.343,57.3068
5134,Mrk501,20210705,22:52:30,59400.953125,253.987,39.7588
5135,LHAASOJ2108+5157,20210705,23:08:26,59400.96418981482,317.15,52.45
5136,LHAASOJ2108+5157,20210705,23:28:03,59400.9778125,317.15,51.45
5137,LHAASOJ2108+5157,20210705,23:47:40,59400.991435185184,317.961,51.9472
5138,LHAASOJ2108+5157,20210706,00:07:56,59401.00550925926,316.339,51.9472
5139,LHAASOJ2108+5157,20210706,00:29:50,59401.02071759259,317.15,52.45
5140,LHAASOJ2108+5157,20210706,00:49:36,59401.03444444444,317.15,51.45
5141,LHAASOJ2108+5157,20210706,01:10:19,59401.04883101852,317.961,51.9472
5142,LHAASOJ2108+5157,20210706,01:31:41,59401.06366898148,316.339,51.9472
5251,BLLac,20210713,00:06:07,59408.00424768519,330.68,42.6778
5252,BLLac,20210713,00:24:48,59408.017222222225,330.68,41.8778
5253,SGR1935+2154,20210713,00:49:00,59408.03402777778,294.16,21.8961
5254,SGR1935+2154,20210713,01:13:23,59408.05096064815,293.298,21.8961
5255,SGR1935+2154,20210713,01:37:15,59408.06753472222,293.729,22.2967
5256,SGR1935+2154,20210713,02:01:24,59408.08430555555,293.729,21.4967
5257,SGR1935+2154,20210713,02:24:46,59408.10053240741,294.16,21.8961
5258,SGR1935+2154,20210713,02:48:45,59408.1171875,293.298,21.8961
5270,LHAASOJ2108+5157,20210716,02:47:36,59411.11638888889,317.961,51.9472
5271,LHAASOJ2108+5157,20210716,03:11:04,59411.132685185185,316.339,51.9472
5272,LHAASOJ2108+5157,20210716,03:28:15,59411.14461805556,316.339,51.9472
5273,BLLac,20210716,03:54:20,59411.16273148148,331.221,42.2765
5274,BLLac,20210716,04:13:37,59411.17612268519,330.14,42.2765
5275,BLLac,20210716,04:32:14,59411.189050925925,330.68,42.6778
5276,BLLac,20210716,04:53:01,59411.20348379629,330.68,41.8778
5277,Mrk501,20210716,23:03:16,59411.96060185185,253.987,39.7588
5281,SGR1935+2154,20210717,01:53:47,59412.0790162037,294.16,21.8961
5282,BLLac,20210717,02:09:13,59412.089733796296,330.68,42.6778
5283,BLLac,20210717,02:29:25,59412.10376157407,330.68,41.8778
5284,SGR1935+2154,20210717,02:46:40,59412.11574074074,293.298,21.8961
5285,SGR1935+2154,20210717,03:10:07,59412.13202546296,293.729,22.2967
5286,SGR1935+2154,20210717,03:33:36,59412.14833333333,293.729,21.4967
5287,LHAASOJ2108+5157,20210717,03:51:02,59412.16043981481,317.15,52.45
5288,LHAASOJ2108+5157,20210717,04:16:06,59412.17784722222,317.15,51.45
5289,LHAASOJ2108+5157,20210717,04:44:08,59412.19731481482,317.961,51.9472
5294,SGR1935+2154,20210717,23:50:50,59412.99363425926,294.16,21.8961
5295,SGR1935+2154,20210718,00:14:42,59413.01020833333,293.298,21.8961
5296,SGR1935+2154,20210718,00:38:29,59413.026724537034,293.729,22.2967
5299,SGR1935+2154,20210718,01:03:56,59413.04439814815,293.729,22.2967
5300,SGR1935+2154,20210718,01:28:04,59413.06115740741,293.729,21.4967
5301,SGR1935+2154,20210718,01:53:48,59413.07902777778,294.16,21.8961
5302,BLLac,20210718,02:20:21,59413.09746527778,330.14,42.2765
5303,BLLac,20210718,02:42:34,59413.11289351852,330.68,42.6778
5304,BLLac,20210718,02:53:53,59413.12075231481,330.68,42.6778
5316,LHAASOJ2108+5157,20210718,04:07:45,59413.17204861111,317.961,51.9472
5318,LHAASOJ2108+5157,20210718,04:21:51,59413.18184027778,317.961,51.9472
5320,SGR1935+2154,20210719,00:11:05,59414.00769675926,294.16,21.8961
5321,SGR1935+2154,20210719,00:35:32,59414.024675925924,293.298,21.8961
5322,SGR1935+2154,20210719,00:59:56,59414.04162037037,293.729,22.2967
5325,SGR1935+2154,20210719,01:35:54,59414.06659722222,293.729,21.4967
5326,SGR1935+2154,20210719,01:44:17,59414.07241898148,293.729,21.4967
5327,SGR1935+2154,20210719,02:09:01,59414.089594907404,294.16,21.8961
5328,SGR1935+2154,20210719,02:33:34,59414.10664351852,293.298,21.8961
5329,SGR1935+2154,20210719,02:57:12,59414.12305555555,293.729,22.2967
5330,SGR1935+2154,20210719,03:21:00,59414.13958333333,293.729,21.4967
5335,BLLac,20210719,04:20:57,59414.18121527778,331.221,42.2765
5336,BLLac,20210719,04:39:48,59414.19430555555,330.14,42.2765
5373,GalCent,20210728,22:48:36,59423.95041666667,266.984,-28.9457
5374,GalCent,20210728,23:14:05,59423.96811342592,265.849,-29.0675
5386,Mrk501,20210729,23:26:26,59424.976689814815,253.987,39.7588
5394,LHAASOJ2108+5157,20210730,01:22:29,59425.057280092595,317.961,51.9472
5395,LHAASOJ2108+5157,20210730,01:46:01,59425.07362268519,316.339,51.9472
5397,LHAASOJ2108+5157,20210730,02:14:56,59425.0937037037,317.15,52.45
5399,LHAASOJ2108+5157,20210730,02:26:41,59425.10186342592,317.15,52.45
5400,LHAASOJ2108+5157,20210730,02:38:13,59425.109872685185,317.15,52.45
5401,LHAASOJ2108+5157,20210730,03:02:41,59425.126863425925,317.15,51.45
5402,LHAASOJ2108+5157,20210730,03:26:04,59425.14310185185,317.961,51.9472
5403,LHAASOJ2108+5157,20210730,03:50:21,59425.15996527778,316.339,51.9472
5404,LHAASOJ2108+5157,20210730,04:14:09,59425.17649305556,317.15,52.45
5405,LHAASOJ2108+5157,20210730,04:38:02,59425.193078703705,317.15,51.45
5408,Vega,20210730,21:50:43,59425.910219907404,279.416,38.7989
5409,Vega,20210730,21:57:22,59425.91483796296,279.416,38.7989
5410,Vega,20210730,22:01:33,59425.91774305556,279.416,38.7989
5411,LHAASOJ2108+5157,20210730,23:41:04,59425.98685185185,316.339,51.9472
5412,LHAASOJ2108+5157,20210731,00:04:32,59426.00314814815,317.15,52.45
5413,LHAASOJ2108+5157,20210731,00:36:35,59426.025405092594,317.15,52.45
5414,LHAASOJ2108+5157,20210731,01:00:47,59426.04221064815,317.15,51.45
5436,GalCent,20210801,21:40:59,59427.90346064815,266.984,-28.9457
5437,GalCent,20210801,22:05:37,59427.92056712963,266.194,-28.5473
5438,Mrk501,20210801,23:20:08,59427.97231481481,253.467,39.36
5439,Mrk501,20210801,23:53:35,59427.99554398148,253.987,39.7588
5440,LHAASOJ2108+5157,20210802,00:18:57,59428.01315972222,317.961,51.9472
5441,LHAASOJ2108+5157,20210802,00:43:46,59428.03039351852,316.339,51.9472
5442,LHAASOJ2108+5157,20210802,01:07:27,59428.04684027778,317.15,52.45
5443,BLLac,20210802,22:52:50,59428.953356481485,330.68,41.8778
5444,BLLac,20210802,23:07:05,59428.96325231482,331.221,42.2765
5447,BLLac,20210802,23:43:24,59428.98847222222,330.14,42.2765
5448,BLLac,20210803,00:07:17,59429.005057870374,330.68,42.6778
5449,BLLac,20210803,00:32:36,59429.02263888889,330.68,41.8778
5450,BLLac,20210803,00:57:14,59429.03974537037,331.221,42.2765
5453,grb_alert_T02021-08-02T20:08:06.49_649627691,20210803,22:13:32,59429.92606481481,230.261,29.901
5454,BLLac,20210803,22:28:29,59429.93644675926,330.68,41.8778
5455,BLLac,20210803,22:46:54,59429.94923611111,331.221,42.2765
5456,BLLac,20210803,23:06:51,59429.96309027778,330.14,42.2765
5457,BLLac,20210803,23:31:05,59429.97991898148,330.68,42.6778
5458,BLLac,20210803,23:55:14,59429.99668981481,330.68,41.8778
5459,BLLac,20210804,00:18:37,59430.01292824074,331.221,42.2765
5460,BLLac,20210804,00:27:31,59430.019108796296,331.221,42.2765
5461,LHAASOJ2108+5157,20210804,00:41:11,59430.028599537036,317.961,51.9472
5462,LHAASOJ2108+5157,20210804,01:04:24,59430.04472222222,316.339,51.9472
5463,LHAASOJ2108+5157,20210804,01:28:32,59430.06148148148,317.15,52.45
5464,LHAASOJ2108+5157,20210804,01:52:13,59430.07792824074,317.15,51.45
5465,LHAASOJ2108+5157,20210804,02:15:42,59430.09423611111,317.961,51.9472
5466,BLLac,20210804,02:45:46,59430.115115740744,330.14,42.2765
5473,LHAASOJ2108+5157,20210804,23:07:01,59430.96320601852,317.961,51.9472
5474,LHAASOJ2108+5157,20210804,23:30:44,59430.979675925926,316.339,51.9472
5475,LHAASOJ2108+5157,20210804,23:54:28,59430.996157407404,317.15,52.45
5476,LHAASOJ2108+5157,20210805,00:18:28,59431.012824074074,317.15,51.45
5477,LHAASOJ2108+5157,20210805,00:43:05,59431.02991898148,317.961,51.9472
5478,LHAASOJ2108+5157,20210805,01:14:19,59431.0516087963,316.339,51.9472
5479,LHAASOJ2108+5157,20210805,01:38:56,59431.068703703706,317.15,52.45
5480,LHAASOJ2108+5157,20210805,02:01:13,59431.084178240744,317.15,52.45
5481,BLLac,20210805,02:29:11,59431.10359953704,330.68,42.6778
5482,BLLac,20210805,02:48:08,59431.11675925926,330.68,41.8778
5486,BLLac,20210805,22:05:54,59431.92076388889,330.14,42.2765
5487,BLLac,20210805,22:30:06,59431.937569444446,330.68,42.6778
5488,BLLac,20210805,22:33:49,59431.940150462964,330.68,42.6778
5489,Mrk501,20210805,22:51:14,59431.95224537037,252.946,39.7588
5490,Mrk501,20210805,23:12:21,59431.96690972222,253.467,40.16
5491,LHAASOJ2108+5157,20210805,23:34:09,59431.98204861111,317.961,51.9472
5492,LHAASOJ2108+5157,20210805,23:58:26,59431.99891203704,316.339,51.9472
5493,LHAASOJ2108+5157,20210806,00:22:14,59432.015439814815,317.15,52.45
5494,LHAASOJ2108+5157,20210806,00:46:06,59432.032013888886,317.15,51.45
5497,LHAASOJ2108+5157,20210806,01:19:03,59432.05489583333,317.961,51.9472
5498,LHAASOJ2108+5157,20210806,01:46:38,59432.07405092593,316.339,51.9472
5499,LHAASOJ2108+5157,20210806,02:10:39,59432.090729166666,317.15,52.45
5500,LHAASOJ2108+5157,20210806,02:34:28,59432.10726851852,317.15,51.45
5503,GalCent,20210806,21:46:10,59432.907060185185,266.984,-28.9457
5504,GalCent,20210806,21:59:55,59432.916608796295,265.849,-29.0675
5505,LHAASOJ2108+5157,20210806,22:24:53,59432.93394675926,317.961,51.9472
5506,LHAASOJ2108+5157,20210806,22:48:30,59432.95034722222,316.339,51.9472
5507,LHAASOJ2108+5157,20210806,23:12:08,59432.96675925926,317.15,52.45
5508,LHAASOJ2108+5157,20210806,23:26:01,59432.97640046296,317.15,52.45
5509,LHAASOJ2108+5157,20210806,23:38:55,59432.98535879629,317.15,51.45
5510,LHAASOJ2108+5157,20210807,00:03:04,59433.00212962963,317.961,51.9472
5511,LHAASOJ2108+5157,20210807,00:27:37,59433.01917824074,316.339,51.9472
5512,LHAASOJ2108+5157,20210807,00:55:07,59433.03827546296,317.15,52.45
5513,LHAASOJ2108+5157,20210807,01:19:56,59433.05550925926,317.15,51.45
5514,LHAASOJ2108+5157,20210807,01:48:24,59433.075277777774,317.961,51.9472
5515,LHAASOJ2108+5157,20210807,02:12:42,59433.092152777775,316.339,51.9472
5516,LHAASOJ2108+5157,20210807,02:36:24,59433.108611111114,317.15,52.45
5517,LHAASOJ2108+5157,20210807,02:54:39,59433.12128472222,317.15,51.45
5520,1ES1959+650,20210807,21:30:47,59433.89637731481,300.948,65.1453
5521,1ES1959+650,20210807,21:54:26,59433.91280092593,299.044,65.1453
5522,1ES1959+650,20210807,22:13:47,59433.92623842593,299.996,65.5483
5523,1ES1959+650,20210807,22:27:37,59433.935844907406,299.996,64.7483
5524,1ES1959+650,20210807,22:47:17,59433.94950231481,300.948,65.1453
5525,1ES1959+650,20210807,23:06:33,59433.96288194445,299.044,65.1453
5526,1ES1959+650,20210807,23:25:56,59433.97634259259,299.996,65.5483
5527,1ES1959+650,20210807,23:46:13,59433.990428240744,299.996,64.7483
5528,1ES1959+650,20210808,00:08:30,59434.005902777775,300.948,65.1453
5529,1ES1959+650,20210808,00:27:43,59434.01924768519,299.044,65.1453
5530,1ES1959+650,20210808,00:46:58,59434.03261574074,299.996,65.5483
5531,1ES1959+650,20210808,01:06:29,59434.046168981484,299.996,64.7483
5532,1ES1959+650,20210808,01:26:37,59434.06015046296,300.948,65.1453
5533,1ES1959+650,20210808,01:54:02,59434.079189814816,299.044,65.1453
5534,1ES1959+650,20210808,02:06:51,59434.08809027778,299.996,64.7483
5535,1ES1959+650,20210808,02:14:09,59434.09315972222,299.996,64.7483
5537,1ES1959+650,20210808,02:34:02,59434.10696759259,300.948,65.1453
5540,1ES1959+650,20210808,02:59:56,59434.1249537037,299.996,65.5483
5542,1ES1959+650,20210808,03:29:53,59434.14575231481,299.996,64.7483
5543,grb210807A,20210808,03:55:17,59434.16339120371,77.443,58.2475
5544,grb210807A,20210808,04:13:54,59434.17631944444,75.9228,58.2475
5545,grb210807A,20210808,04:29:59,59434.18748842592,76.6829,58.6498
5546,BLLac,20210808,04:47:10,59434.199421296296,331.221,42.2765
5547,BLLac,20210808,05:03:51,59434.211006944446,330.14,42.2765
5548,Vega,20210808,21:13:11,59434.88415509259,279.416,38.7989
5549,Vega,20210808,21:17:18,59434.88701388889,279.416,38.7989
5550,Mrk501,20210808,23:03:26,59434.96071759259,253.467,39.36
5551,Mrk501,20210808,23:23:49,59434.97487268518,253.987,39.7588
5552,BLLac,20210808,23:44:40,59434.98935185185,331.221,42.2765
5553,BLLac,20210809,00:08:59,59435.00623842593,330.14,42.2765
5554,BLLac,20210809,00:34:58,59435.02428240741,330.68,42.6778
5555,BLLac,20210809,00:49:13,59435.03417824074,330.14,42.2765
5556,BLLac,20210809,01:05:55,59435.04577546296,330.68,42.6778
5557,BLLac,20210809,01:22:45,59435.05746527778,330.68,41.8778
5558,BLLac,20210809,01:39:22,59435.06900462963,331.221,42.2765
5559,BLLac,20210809,01:56:02,59435.0805787037,330.14,42.2765
5576,LHAASOJ2108+5157,20210809,04:18:48,59435.17972222222,317.961,51.9472
5577,LHAASOJ2108+5157,20210809,04:44:35,59435.19762731482,316.339,51.9472
5578,Vega,20210809,21:10:08,59435.88203703704,279.416,38.7989
5579,Vega,20210809,21:14:42,59435.88520833333,279.416,38.7989
5580,Nova_RS_Oph,20210809,21:43:08,59435.904953703706,267.958,-6.70761
5581,Nova_RS_Oph,20210809,22:06:57,59435.92149305555,267.152,-6.70761
5582,Nova_RS_Oph,20210809,22:30:39,59435.937951388885,267.958,-6.70761
5583,Nova_RS_Oph,20210809,22:52:38,59435.95321759259,267.152,-6.70761
5584,Nova_RS_Oph,20210809,23:13:09,59435.967465277776,267.555,-6.30778
5587,LHAASOJ2108+5157,20210809,23:56:33,59435.99760416667,317.15,51.45
5590,LHAASOJ2108+5157,20210810,00:22:49,59436.01584490741,317.961,51.9472
5591,LHAASOJ2108+5157,20210810,00:50:40,59436.03518518519,316.339,51.9472
5592,BLLac,20210810,00:57:35,59436.039988425924,331.221,42.2765
5593,BLLac,20210810,01:21:04,59436.056296296294,330.14,42.2765
5594,BLLac,20210810,01:44:02,59436.07224537037,330.68,42.6778
5595,BLLac,20210810,02:07:58,59436.08886574074,330.68,41.8778
5596,DarkPatch02,20210810,02:37:49,59436.10959490741,326.421,31.719
5597,DarkPatch02,20210810,02:41:49,59436.11237268519,326.421,31.719
5598,DarkPatch02,20210810,02:45:57,59436.11524305555,326.421,31.719
5599,DarkPatch02,20210810,02:50:13,59436.11820601852,326.421,31.719
5600,DarkPatch02,20210810,02:54:29,59436.12116898148,326.421,31.719
5601,DarkPatch02,20210810,02:58:36,59436.124027777776,326.421,31.719
5602,DarkPatch02,20210810,03:02:52,59436.12699074074,326.421,31.719
5604,DarkPatch02,20210810,03:21:19,59436.13980324074,326.421,31.719
5605,DarkPatch02,20210810,03:25:34,59436.14275462963,326.421,31.719
5606,DarkPatch02,20210810,03:29:47,59436.145682870374,326.421,31.719
5607,DarkPatch02,20210810,03:34:03,59436.14864583333,326.421,31.719
5608,DarkPatch02,20210810,03:38:10,59436.151504629626,326.421,31.719
5609,DarkPatch02,20210810,03:42:31,59436.15452546296,326.421,31.719
5610,DarkPatch02,20210810,03:46:53,59436.15755787037,326.421,31.719
5611,DarkPatch02,20210810,03:51:19,59436.16063657407,326.421,31.719
5613,DarkPatch02,20210810,04:12:46,59436.175532407404,326.421,31.719
5614,DarkPatch02,20210810,04:17:32,59436.17884259259,326.421,31.719
5615,DarkPatch02,20210810,04:21:49,59436.18181712963,326.421,31.719
5616,DarkPatch02,20210810,04:24:55,59436.183969907404,326.421,31.719
5617,DarkPatch02,20210810,04:28:06,59436.18618055555,326.421,31.719
5618,DarkPatch02,20210810,04:31:23,59436.18846064815,326.421,31.719
5619,DarkPatch02,20210810,04:34:39,59436.190729166665,326.421,31.719
5620,DarkPatch02,20210810,04:37:51,59436.19295138889,326.421,31.719
5621,DarkPatch02,20210810,04:40:57,59436.19510416667,326.421,31.719
5622,DarkPatch02,20210810,04:44:48,59436.19777777778,326.421,31.719
5623,DarkPatch02,20210810,04:48:00,59436.2,326.421,31.719
5624,DarkPatch02,20210810,04:51:11,59436.202210648145,326.421,31.719
5625,DarkPatch02,20210810,04:54:28,59436.20449074074,326.421,31.719
5626,DarkPatch02,20210810,04:57:40,59436.206712962965,326.421,31.719
5627,DarkPatch02,20210810,05:00:50,59436.20891203704,326.421,31.719
5630,Nova_RS_Oph,20210810,21:37:47,59436.901238425926,267.958,-6.70761
5631,Nova_RS_Oph,20210810,22:01:25,59436.917650462965,267.152,-6.70761
5632,Nova_RS_Oph,20210810,22:21:36,59436.931666666664,267.555,-6.30778
5633,Nova_RS_Oph,20210810,22:42:03,59436.945868055554,267.555,-7.10778
5634,Nova_RS_Oph,20210810,23:01:35,59436.95943287037,267.958,-6.70761
5635,Nova_RS_Oph,20210810,23:21:47,59436.97346064815,267.152,-6.70761
5636,Nova_RS_Oph,20210810,23:43:14,59436.98835648148,267.555,-6.30778
5637,Nova_RS_Oph,20210811,00:05:01,59437.003483796296,267.555,-7.10778
5638,Nova_RS_Oph,20210811,00:24:35,59437.01707175926,267.958,-6.70761
5639,Nova_RS_Oph,20210811,00:46:11,59437.03207175926,267.152,-6.70761
5680,LHAASOJ2108+5157,20210811,23:40:32,59437.98648148148,317.961,51.9472
5681,LHAASOJ2108+5157,20210812,00:04:55,59438.00341435185,316.339,51.9472
5682,LHAASOJ2108+5157,20210812,00:28:38,59438.01988425926,317.15,52.45
5683,LHAASOJ2108+5157,20210812,00:59:24,59438.04125,317.15,51.45
5684,LHAASOJ2108+5157,20210812,01:23:24,59438.057916666665,317.961,51.9472
5685,LHAASOJ2108+5157,20210812,01:47:06,59438.074375,316.339,51.9472
5686,LHAASOJ2108+5157,20210812,02:10:33,59438.09065972222,317.15,52.45
5687,LHAASOJ2108+5157,20210812,02:34:37,59438.10737268518,317.15,51.45
5688,BLLac,20210812,02:59:50,59438.12488425926,331.221,42.2765
5689,BLLac,20210812,03:23:43,59438.14146990741,330.14,42.2765
5690,BLLac,20210812,03:48:32,59438.1587037037,330.68,42.6778
5691,Crab,20210812,04:18:25,59438.179456018515,83.4296,33.3158
5692,Crab,20210812,04:27:49,59438.1859837963,83.4296,33.3158
5693,Crab,20210812,05:02:34,59438.21011574074,82.6474,32.8569
5696,Nova_RS_Oph,20210812,21:40:02,59438.90280092593,267.555,-7.10778
5697,Nova_RS_Oph,20210812,21:54:16,59438.91268518518,267.958,-6.70761
5698,Nova_RS_Oph,20210812,22:17:35,59438.928877314815,267.152,-6.70761
5699,Nova_RS_Oph,20210812,22:36:36,59438.942083333335,267.555,-6.30778
5700,Nova_RS_Oph,20210812,22:56:03,59438.95559027778,267.555,-7.10778
5701,Nova_RS_Oph,20210812,23:15:43,59438.969247685185,267.958,-6.70761
5702,Nova_RS_Oph,20210812,23:35:30,59438.982986111114,267.152,-6.70761
5703,Nova_RS_Oph,20210812,23:57:02,59438.99793981481,267.555,-6.30778
5704,Nova_RS_Oph,20210813,00:17:04,59439.01185185185,267.555,-7.10778
5705,BLLac,20210813,00:38:56,59439.027037037034,331.221,42.2765
5706,BLLac,20210813,00:56:58,59439.039560185185,330.14,42.2765
5707,LHAASOJ2108+5157,20210813,01:14:59,59439.05207175926,317.15,52.45
5708,LHAASOJ2108+5157,20210813,01:36:57,59439.06732638889,317.15,51.45
5709,LHAASOJ2108+5157,20210813,01:56:59,59439.081238425926,317.961,51.9472
5710,LHAASOJ2108+5157,20210813,02:20:58,59439.09789351852,316.339,51.9472
5711,LHAASOJ2108+5157,20210813,02:44:25,59439.11417824074,317.15,52.45
5712,LHAASOJ2108+5157,20210813,03:08:08,59439.13064814815,317.15,51.45
5713,LHAASOJ2108+5157,20210813,03:32:56,59439.14787037037,317.961,51.9472
5714,Crab,20210813,04:00:36,59439.167083333334,83.4296,33.3158
5715,Crab,20210813,04:24:25,59439.18362268519,82.6474,32.8569
5716,Crab,20210813,04:48:38,59439.20043981481,83.4296,33.3158
5719,Nova_RS_Oph,20210813,22:11:53,59439.92491898148,267.555,-6.30778
5720,Nova_RS_Oph,20210813,22:23:43,59439.93313657407,267.555,-7.10778
5722,Nova_RS_Oph,20210813,22:53:56,59439.95412037037,267.958,-6.70761
5723,Nova_RS_Oph,20210813,23:05:11,59439.96193287037,267.152,-6.70761
5724,Nova_RS_Oph,20210813,23:27:43,59439.97758101852,267.555,-6.30778
5725,Nova_RS_Oph,20210813,23:48:06,59439.991736111115,267.555,-7.10778
5726,Nova_RS_Oph,20210814,00:07:02,59440.00488425926,267.958,-6.70761
5727,LHAASOJ2108+5157,20210814,00:35:47,59440.02484953704,317.961,51.9472
5728,LHAASOJ2108+5157,20210814,00:59:02,59440.04099537037,316.339,51.9472
5730,LHAASOJ2108+5157,20210814,01:37:47,59440.06790509259,317.961,51.9472
5731,LHAASOJ2108+5157,20210814,01:57:08,59440.081342592595,316.339,51.9472
5732,BLLac,20210814,02:17:00,59440.095138888886,331.221,42.2765
5733,BLLac,20210814,02:40:57,59440.11177083333,330.14,42.2765
5734,BLLac,20210814,03:04:14,59440.12793981482,330.68,42.6778
5735,BLLac,20210814,03:28:37,59440.14487268519,330.68,41.8778
5736,BLLac,20210814,03:53:15,59440.16197916667,331.221,42.2765
5737,Crab,20210814,04:17:31,59440.17883101852,83.9871,22.2435
5738,Crab,20210814,04:39:42,59440.194236111114,83.9871,22.2435
5740,Vega,20210814,21:01:38,59440.87613425926,279.416,38.7989
5741,Vega,20210814,21:15:49,59440.885983796295,279.416,38.7989
5742,Nova_RS_Oph,20210814,21:38:43,59440.90188657407,267.152,-6.70761
5743,Nova_RS_Oph,20210814,21:44:16,59440.90574074074,267.152,-6.70761
5744,Nova_RS_Oph,20210814,22:00:46,59440.91719907407,267.555,-6.30778
5745,Nova_RS_Oph,20210814,22:20:38,59440.93099537037,267.555,-7.10778
5746,Nova_RS_Oph,20210814,22:41:05,59440.94519675926,267.958,-6.70761
5747,Nova_RS_Oph,20210814,23:02:58,59440.960393518515,267.152,-6.70761
5748,Nova_RS_Oph,20210814,23:23:59,59440.97498842593,267.555,-6.30778
5749,BLLac,20210815,00:26:45,59441.01857638889,330.68,42.6778
5750,BLLac,20210815,00:44:06,59441.030625,330.68,41.8778
5751,LHAASOJ2108+5157,20210815,01:35:36,59441.06638888889,317.15,51.45
5752,LHAASOJ2108+5157,20210815,01:49:37,59441.07612268518,317.961,51.9472
5753,LHAASOJ2108+5157,20210815,02:13:04,59441.09240740741,316.339,51.9472
5754,LHAASOJ2108+5157,20210815,02:36:11,59441.108460648145,317.15,52.45
5755,LHAASOJ2108+5157,20210815,03:00:09,59441.12510416667,317.15,51.45
5756,LHAASOJ2108+5157,20210815,03:23:28,59441.14129629629,317.961,51.9472
5757,LHAASOJ2108+5157,20210815,03:47:26,59441.15793981482,316.339,51.9472
5758,Crab,20210815,04:26:45,59441.18524305556,83.9871,22.2435
5759,Crab,20210815,04:50:35,59441.20179398148,83.2802,21.7847
5763,Nova_RS_Oph,20210815,22:55:57,59441.95552083333,267.958,-6.70761
5764,Nova_RS_Oph,20210815,23:20:24,59441.9725,267.152,-6.70761
5765,Nova_RS_Oph,20210815,23:45:58,59441.99025462963,267.555,-6.30778
5766,Nova_RS_Oph,20210816,00:10:07,59442.00702546296,267.555,-7.10778
5767,LHAASOJ2108+5157,20210816,00:35:20,59442.02453703704,317.961,51.9472
5768,LHAASOJ2108+5157,20210816,00:58:48,59442.04083333333,316.339,51.9472
5769,LHAASOJ2108+5157,20210816,01:23:02,59442.057662037034,317.15,52.45
5770,LHAASOJ2108+5157,20210816,01:46:54,59442.07423611111,317.15,51.45
5771,LHAASOJ2108+5157,20210816,02:09:57,59442.09024305556,317.961,51.9472
5772,LHAASOJ2108+5157,20210816,02:34:11,59442.10707175926,316.339,51.9472
5773,LHAASOJ2108+5157,20210816,02:58:15,59442.12378472222,317.15,52.45
5774,LHAASOJ2108+5157,20210816,03:31:39,59442.14697916667,317.15,51.45
5775,Crab,20210816,04:22:07,59442.182025462964,83.9871,22.2435
5776,Crab,20210816,04:45:15,59442.19809027778,83.9871,22.2435
5777,Crab,20210816,05:09:57,59442.21524305556,83.2802,21.7847
5780,BLLac,20210817,01:48:38,59443.07543981481,331.221,42.2765
5781,BLLac,20210817,02:27:17,59443.10228009259,330.14,42.2765
5783,LHAASOJ2108+5157,20210817,03:33:56,59443.148564814815,317.961,51.9472
5784,LHAASOJ2108+5157,20210817,04:00:19,59443.16688657407,316.339,51.9472
5785,LHAASOJ2108+5157,20210817,04:26:56,59443.18537037037,317.15,52.45
5786,LHAASOJ2108+5157,20210817,04:53:36,59443.203888888886,317.15,51.45
5793,LHAASOJ2108+5157,20210818,03:27:25,59444.14403935185,317.961,51.9472
5794,LHAASOJ2108+5157,20210818,03:30:11,59444.14596064815,317.961,51.9472
5795,LHAASOJ2108+5157,20210818,03:35:28,59444.14962962963,317.961,51.9472
5798,Crab,20210818,04:11:48,59444.17486111111,83.9871,22.2435
5799,Crab,20210818,04:36:21,59444.19190972222,83.2802,21.7847
5800,Crab,20210818,04:59:38,59444.208078703705,83.9871,22.2435
5884,LHAASOJ2108+5157,20210829,01:22:13,59455.05709490741,317.961,51.9472
5885,LHAASOJ2108+5157,20210829,01:38:19,59455.06827546296,317.961,51.9472
5886,LHAASOJ2108+5157,20210829,02:18:41,59455.09630787037,317.961,51.9472
5888,Vega,20210829,20:49:51,59455.867951388886,279.416,38.7989
5889,Vega,20210829,21:01:35,59455.87609953704,279.416,38.7989
5891,Nova_RS_Oph,20210829,22:43:28,59455.946851851855,267.555,-7.10778
5892,Nova_RS_Oph,20210829,23:04:24,59455.961388888885,267.958,-6.70761
5893,Nova_RS_Oph,20210829,23:24:06,59455.975069444445,267.152,-6.70761
5894,LHAASOJ2108+5157,20210830,04:24:35,59456.18373842593,317.961,51.9472
5895,LHAASOJ2108+5157,20210830,04:46:28,59456.19893518519,316.339,51.9472
5896,LHAASOJ2108+5157,20210830,05:05:08,59456.21189814815,317.15,52.45
5912,Nova_RS_Oph,20210830,21:42:24,59456.904444444444,267.555,-7.10778
5913,Nova_RS_Oph,20210830,21:59:50,59456.916550925926,267.958,-6.70761
5914,Nova_RS_Oph,20210830,22:24:18,59456.933541666665,267.152,-6.70761
5915,Nova_RS_Oph,20210830,22:47:31,59456.94966435185,267.555,-6.30778
5916,Nova_RS_Oph,20210830,23:02:26,59456.960023148145,267.555,-7.10778
5917,Nova_RS_Oph,20210830,23:26:40,59456.976851851854,267.958,-6.70761
5918,LHAASOJ2108+5157,20210831,01:12:47,59457.05054398148,317.15,51.45
5919,LHAASOJ2108+5157,20210831,01:37:35,59457.067766203705,317.961,51.9472
5921,LHAASOJ2108+5157,20210831,02:39:31,59457.11077546296,317.15,52.45
5922,LHAASOJ2108+5157,20210831,03:03:01,59457.12709490741,317.15,51.45
5923,LHAASOJ2108+5157,20210831,03:26:36,59457.143472222226,317.15,51.45
5924,LHAASOJ2108+5157,20210831,04:45:27,59457.198229166665,317.15,51.45
5942,Nova_RS_Oph,20210901,23:25:09,59458.975798611114,267.958,-6.70761
5943,Nova_RS_Oph,20210901,23:37:10,59458.984143518515,267.152,-6.70761
5944,Nova_RS_Oph,20210901,23:47:08,59458.991064814814,267.555,-6.30778
5945,Nova_RS_Oph,20210901,23:56:32,59458.99759259259,267.555,-7.10778
5947,LHAASOJ2108+5157,20210902,01:05:30,59459.045486111114,317.961,51.9472
5948,LHAASOJ2108+5157,20210902,01:19:42,59459.055347222224,316.339,51.9472
5949,LHAASOJ2108+5157,20210902,01:33:15,59459.06475694444,317.15,52.45
5950,LHAASOJ2108+5157,20210902,01:48:28,59459.075324074074,317.15,51.45
5952,LHAASOJ2108+5157,20210902,02:48:25,59459.116956018515,317.961,51.9472
5953,LHAASOJ2108+5157,20210902,03:05:33,59459.128854166665,316.339,51.9472
5955,Crab,20210902,04:10:25,59459.17390046296,83.9871,22.2435
5956,Crab,20210902,04:34:46,59459.19081018519,83.2802,21.7847
5957,Crab,20210902,04:58:32,59459.20731481481,83.9871,22.2435
5958,Crab,20210902,05:12:38,59459.21710648148,83.2802,21.7847
5970,Nova_RS_Oph,20210902,21:46:56,59459.90759259259,267.958,-6.70761
5971,Nova_RS_Oph,20210902,22:11:48,59459.92486111111,267.152,-6.70761
5972,Nova_RS_Oph,20210902,22:37:37,59459.94278935185,267.555,-6.30778
5973,Nova_RS_Oph,20210902,23:01:49,59459.95959490741,267.555,-7.10778
5980,LHAASOJ2108+5157,20210903,00:01:11,59460.00082175926,317.961,51.9472
5981,LHAASOJ2108+5157,20210903,00:15:33,59460.01079861111,316.339,51.9472
5982,LHAASOJ2108+5157,20210903,00:35:10,59460.02442129629,317.15,52.45
5983,LHAASOJ2108+5157,20210903,00:55:55,59460.038831018515,317.15,51.45
5984,LHAASOJ2108+5157,20210903,01:16:28,59460.05310185185,317.961,51.9472
5985,LHAASOJ2108+5157,20210903,01:35:57,59460.06663194444,316.339,51.9472
5986,LHAASOJ2108+5157,20210903,01:56:38,59460.08099537037,317.15,52.45
5987,LHAASOJ2108+5157,20210903,02:17:10,59460.09525462963,317.15,51.45
5988,LHAASOJ2108+5157,20210903,02:37:15,59460.10920138889,317.961,51.9472
5989,LHAASOJ2108+5157,20210903,02:56:13,59460.12237268518,316.339,51.9472
5990,LHAASOJ2108+5157,20210903,03:15:07,59460.13549768519,317.15,52.45
5991,LHAASOJ2108+5157,20210903,03:36:16,59460.150185185186,317.15,51.45
5992,Crab,20210903,03:57:10,59460.16469907408,83.9871,22.2435
5993,Crab,20210903,04:18:29,59460.179502314815,83.2802,21.7847
5994,Crab,20210903,04:39:59,59460.19443287037,83.9871,22.2435
5995,Crab,20210903,05:01:48,59460.20958333334,83.2802,21.7847
5998,LHAASOJ2108+5157,20210903,22:47:36,59460.94972222222,317.15,52.45
5999,LHAASOJ2108+5157,20210903,23:07:27,59460.96350694444,317.15,51.45
6000,LHAASOJ2108+5157,20210903,23:25:43,59460.97619212963,317.961,51.9472
6001,LHAASOJ2108+5157,20210903,23:44:19,59460.9891087963,316.339,51.9472
6002,LHAASOJ2108+5157,20210904,00:03:25,59461.00237268519,317.15,52.45
6003,LHAASOJ2108+5157,20210904,00:28:49,59461.02001157407,317.15,51.45
6004,LHAASOJ2108+5157,20210904,00:47:49,59461.03320601852,317.961,51.9472
6005,LHAASOJ2108+5157,20210904,01:11:43,59461.04980324074,316.339,51.9472
6006,LHAASOJ2108+5157,20210904,01:32:08,59461.06398148148,317.15,52.45
6007,LHAASOJ2108+5157,20210904,01:52:56,59461.07842592592,317.15,51.45
6008,LHAASOJ2108+5157,20210904,02:11:44,59461.09148148148,317.961,51.9472
6009,LHAASOJ2108+5157,20210904,02:30:32,59461.104537037034,316.339,51.9472
6010,LHAASOJ2108+5157,20210904,02:49:25,59461.11765046296,317.15,52.45
6020,LHAASOJ2108+5157,20210904,20:58:04,59461.87365740741,317.961,51.9472
6021,LHAASOJ2108+5157,20210904,21:22:07,59461.8903587963,316.339,51.9472
6022,LHAASOJ2108+5157,20210904,21:50:47,59461.910266203704,317.15,51.45
6023,LHAASOJ2108+5157,20210904,22:06:42,59461.921319444446,317.961,51.9472
6024,LHAASOJ2108+5157,20210904,22:27:29,59461.935752314814,316.339,51.9472
6025,LHAASOJ2108+5157,20210904,22:47:25,59461.949594907404,317.15,52.45
6026,LHAASOJ2108+5157,20210904,23:09:18,59461.964791666665,317.15,51.45
6034,LHAASOJ2108+5157,20210905,01:20:19,59462.05577546296,316.339,51.9472
6035,LHAASOJ2108+5157,20210905,01:29:59,59462.06248842592,317.15,52.45
6036,LHAASOJ2108+5157,20210905,01:48:28,59462.075324074074,317.15,51.45
6037,LHAASOJ2108+5157,20210905,02:09:07,59462.08966435185,317.961,51.9472
6038,LHAASOJ2108+5157,20210905,02:30:37,59462.10459490741,316.339,51.9472
6039,Crab,20210905,02:52:36,59462.11986111111,83.2802,21.7847
6040,Crab,20210905,03:16:23,59462.13637731481,83.9871,22.2435
6041,Crab,20210905,03:40:19,59462.15299768518,83.2802,21.7847
6042,Crab,20210905,04:04:50,59462.170023148145,83.9871,22.2435
6043,Crab,20210905,04:29:11,59462.18693287037,83.2802,21.7847
6044,Crab,20210905,04:53:16,59462.20365740741,83.9871,22.2435
6045,Crab,20210905,05:17:26,59462.22043981482,83.2802,21.7847
6057,LHAASOJ2108+5157,20210905,22:59:43,59462.958136574074,317.15,51.45
6058,LHAASOJ2108+5157,20210905,23:07:07,59462.963275462964,317.961,51.9472
6059,LHAASOJ2108+5157,20210905,23:25:17,59462.97589120371,316.339,51.9472
6060,LHAASOJ2108+5157,20210905,23:45:48,59462.99013888889,317.15,52.45
6061,LHAASOJ2108+5157,20210906,00:07:35,59463.005266203705,317.15,51.45
6062,LHAASOJ2108+5157,20210906,00:27:42,59463.01923611111,317.961,51.9472
6063,LHAASOJ2108+5157,20210906,00:49:18,59463.03423611111,316.339,51.9472
6064,LHAASOJ2108+5157,20210906,01:08:23,59463.047488425924,317.15,52.45
6065,LHAASOJ2108+5157,20210906,01:28:41,59463.061585648145,317.15,51.45
6066,LHAASOJ2108+5157,20210906,02:22:59,59463.09929398148,317.961,51.9472
6068,Crab,20210906,03:17:39,59463.13725694444,83.9871,22.2435
6069,Crab,20210906,03:41:33,59463.15385416667,83.2802,21.7847
6070,Crab,20210906,04:06:45,59463.17135416667,83.9871,22.2435
6071,Crab,20210906,04:30:20,59463.187731481485,83.2802,21.7847
6072,Crab,20210906,04:53:55,59463.20410879629,83.9871,22.2435
6073,Crab,20210906,05:18:31,59463.22119212963,83.2802,21.7847
6076,Mrk501,20210906,20:53:53,59463.87075231481,253.467,40.16
6077,Mrk501,20210906,21:12:54,59463.88395833333,253.467,39.36
6078,Mrk501,20210906,21:31:20,59463.89675925926,253.987,39.7588
6079,LHAASOJ2108+5157,20210906,21:46:51,59463.907534722224,317.961,51.9472
6080,LHAASOJ2108+5157,20210906,22:10:45,59463.92413194444,316.339,51.9472
6081,LHAASOJ2108+5157,20210906,22:34:03,59463.9403125,317.15,52.45
6082,LHAASOJ2108+5157,20210906,23:00:13,59463.9584837963,317.15,51.45
6083,LHAASOJ2108+5157,20210906,23:23:10,59463.9744212963,317.961,51.9472
6084,LHAASOJ2108+5157,20210906,23:46:34,59463.9906712963,316.339,51.9472
6085,LHAASOJ2108+5157,20210907,00:10:56,59464.00759259259,317.15,52.45
6095,DarkPatch02,20210907,01:50:05,59464.07644675926,326.421,31.719
6096,DarkPatch02,20210907,01:54:47,59464.07971064815,326.421,31.719
6097,DarkPatch02,20210907,01:59:25,59464.08292824074,326.421,31.719
6098,DarkPatch02,20210907,02:03:55,59464.08605324074,326.421,31.719
6099,DarkPatch02,20210907,02:08:18,59464.08909722222,326.421,31.719
6100,DarkPatch02,20210907,02:12:59,59464.09234953704,326.421,31.719
6101,DarkPatch02,20210907,02:17:36,59464.095555555556,326.421,31.719
6102,DarkPatch02,20210907,02:22:03,59464.098645833335,326.421,31.719
6103,DarkPatch02,20210907,02:26:45,59464.10190972222,326.421,31.719
6104,DarkPatch02,20210907,02:31:22,59464.10511574074,326.421,31.719
6105,DarkPatch02,20210907,02:35:53,59464.108252314814,326.421,31.719
6106,DarkPatch02,20210907,02:40:34,59464.11150462963,326.421,31.719
6107,DarkPatch02,20210907,02:45:06,59464.114652777775,326.421,31.719
6108,DarkPatch02,20210907,02:49:39,59464.1178125,326.421,31.719
6109,DarkPatch02,20210907,02:54:15,59464.12100694444,326.421,31.719
6110,DarkPatch02,20210907,02:58:53,59464.12422453704,326.421,31.719
6111,DarkPatch02,20210907,03:03:34,59464.12747685185,326.421,31.719
6112,DarkPatch02,20210907,03:08:10,59464.1306712963,326.421,31.719
6113,DarkPatch02,20210907,03:12:48,59464.133888888886,326.421,31.719
6114,DarkPatch02,20210907,03:17:19,59464.137025462966,326.421,31.719
6115,DarkPatch02,20210907,03:21:52,59464.140185185184,326.421,31.719
6116,DarkPatch02,20210907,03:26:28,59464.143379629626,326.421,31.719
6117,DarkPatch02,20210907,03:30:55,59464.146469907406,326.421,31.719
6118,PKS0420-01,20210907,03:44:55,59464.15619212963,66.2159,-1.34249
6119,PKS0420-01,20210907,04:10:20,59464.173842592594,65.4157,-1.34249
6120,PKS0420-01,20210907,04:34:05,59464.19033564815,65.8158,-0.942519
6121,PKS0420-01,20210907,04:58:30,59464.207291666666,65.8158,-1.74252
6122,PKS0420-01,20210907,05:22:09,59464.223715277774,66.2159,-1.34249
6125,SGR1935+2154,20210907,20:49:21,59464.86760416667,294.16,21.8961
6126,SGR1935+2154,20210907,21:13:14,59464.88418981482,293.298,21.8961
6127,SGR1935+2154,20210907,21:37:17,59464.9008912037,293.729,22.2967
6128,SGR1935+2154,20210907,22:00:35,59464.91707175926,293.729,21.4967
6129,SGR1935+2154,20210907,22:23:57,59464.93329861111,294.16,21.8961
6130,LHAASOJ2108+5157,20210907,22:51:21,59464.95232638889,317.15,51.45
6131,LHAASOJ2108+5157,20210907,23:14:40,59464.968518518515,317.961,51.9472
6132,LHAASOJ2108+5157,20210907,23:37:47,59464.98457175926,316.339,51.9472
6133,LHAASOJ2108+5157,20210908,00:01:43,59465.00119212963,317.15,52.45
6134,LHAASOJ2108+5157,20210908,00:25:45,59465.01788194444,317.15,51.45
6135,LHAASOJ2108+5157,20210908,00:49:07,59465.034108796295,317.961,51.9472
6137,LHAASOJ2108+5157,20210908,01:43:50,59465.07210648148,316.339,51.9472
6138,LHAASOJ2108+5157,20210908,02:07:41,59465.08866898148,317.15,52.45
6139,LHAASOJ2108+5157,20210908,02:31:24,59465.10513888889,317.15,51.45
6140,LHAASOJ2108+5157,20210908,02:56:25,59465.122511574074,317.961,51.9472
6141,LHAASOJ2108+5157,20210908,03:21:36,59465.14,316.339,51.9472
6142,PKS0420-01,20210908,03:41:43,59465.153969907406,66.2159,-1.34249
6143,PKS0420-01,20210908,03:55:40,59465.16365740741,65.4157,-1.34249
6144,PKS0420-01,20210908,04:10:21,59465.173854166664,65.8158,-0.942519
6145,PKS0420-01,20210908,04:24:57,59465.18399305556,65.8158,-1.74252
6146,Crab,20210908,04:40:22,59465.194699074076,83.9871,22.2435
6147,Crab,20210908,04:59:02,59465.207662037035,83.2802,21.7847
6148,Crab,20210908,05:17:50,59465.220717592594,83.9871,22.2435
