[gd_scene load_steps=7 format=2]

[ext_resource path="res://img/fly01.png" type="Texture" id=1]
[ext_resource path="res://img/fly02.png" type="Texture" id=2]
[ext_resource path="res://scripts/housefly.gd" type="Script" id=3]
[ext_resource path="res://sound/housefly.mp3" type="AudioStream" id=4]

[sub_resource type="SpriteFrames" id=1]
animations = [ {
"frames": [  ],
"loop": true,
"name": "",
"speed": 5.0
}, {
"frames": [ ExtResource( 1 ), ExtResource( 2 ) ],
"loop": true,
"name": "default",
"speed": 5.0
} ]

[sub_resource type="CircleShape2D" id=2]

[node name="EnemyFly" type="Area2D"]
scale = Vector2( 2, 2 )
script = ExtResource( 3 )

[node name="AnimatedSprite" type="AnimatedSprite" parent="."]
frames = SubResource( 1 )

[node name="CollisionShape2D" type="CollisionShape2D" parent="."]
shape = SubResource( 2 )

[node name="AudioStreamPlayer2D" type="AudioStreamPlayer2D" parent="."]
stream = ExtResource( 4 )
autoplay = true

[connection signal="body_entered" from="." to="." method="_on_EnemyFly_body_entered"]
