[gd_scene load_steps=5 format=2]

[ext_resource path="res://3d/titulo3.tscn" type="PackedScene" id=1]
[ext_resource path="res://3d/Fall.gd" type="Script" id=2]

[sub_resource type="Animation" id=1]
length = 0.001
tracks/0/type = "value"
tracks/0/path = NodePath("Camera:translation")
tracks/0/interp = 1
tracks/0/loop_wrap = true
tracks/0/imported = false
tracks/0/enabled = true
tracks/0/keys = {
"times": PoolRealArray( 0 ),
"transitions": PoolRealArray( 1 ),
"update": 0,
"values": [ Vector3( 0, 4.42491, 0.937343 ) ]
}
tracks/1/type = "value"
tracks/1/path = NodePath("titulo3:rotation_degrees")
tracks/1/interp = 1
tracks/1/loop_wrap = true
tracks/1/imported = false
tracks/1/enabled = true
tracks/1/keys = {
"times": PoolRealArray( 0 ),
"transitions": PoolRealArray( 1 ),
"update": 0,
"values": [ Vector3( 0, 0, 0 ) ]
}

[sub_resource type="Animation" id=2]
resource_name = "cam_move"
length = 10.0
tracks/0/type = "value"
tracks/0/path = NodePath("Camera:translation")
tracks/0/interp = 1
tracks/0/loop_wrap = true
tracks/0/imported = false
tracks/0/enabled = true
tracks/0/keys = {
"times": PoolRealArray( 0, 10.1 ),
"transitions": PoolRealArray( 1, 1 ),
"update": 0,
"values": [ Vector3( 0, 4.42491, 0.937343 ), Vector3( 0, -8.2416, 0.937343 ) ]
}
tracks/1/type = "value"
tracks/1/path = NodePath("titulo3:rotation_degrees")
tracks/1/interp = 1
tracks/1/loop_wrap = true
tracks/1/imported = false
tracks/1/enabled = true
tracks/1/keys = {
"times": PoolRealArray( 0, 10 ),
"transitions": PoolRealArray( 1, 1 ),
"update": 0,
"values": [ Vector3( 0, 0, 0 ), Vector3( 0, 359, 0 ) ]
}
tracks/2/type = "method"
tracks/2/path = NodePath(".")
tracks/2/interp = 1
tracks/2/loop_wrap = true
tracks/2/imported = false
tracks/2/enabled = true
tracks/2/keys = {
"times": PoolRealArray( 9.8 ),
"transitions": PoolRealArray( 1 ),
"values": [ {
"args": [  ],
"method": "back"
} ]
}

[node name="Spatial" type="Spatial"]
script = ExtResource( 2 )

[node name="titulo3" parent="." instance=ExtResource( 1 )]

[node name="Camera" type="Camera" parent="."]
transform = Transform( 1, 0, 0, 0, 0.139743, 0.990188, 0, -0.990188, 0.139743, 0, 4.42491, 0.937343 )
current = true

[node name="OmniLight" type="OmniLight" parent="Camera"]
light_energy = 1.344

[node name="AnimationPlayer" type="AnimationPlayer" parent="."]
autoplay = "cam_move"
anims/RESET = SubResource( 1 )
anims/cam_move = SubResource( 2 )
