<!DOCTYPE svg PUBLIC "-//W3C//DTD SVG 20010904//EN"
 "http://www.w3.org/TR/2001/REC-SVG-20010904/DTD/svg10.dtd">
<svg version="1.0" xmlns="http://www.w3.org/2000/svg"
viewBox="0 0 1804.000000 1374.000000"
 preserveAspectRatio="xMidYMid meet">
<metadata>
Created by potrace 1.15, written by Peter Selinger 2001-2017
</metadata>
<g transform="translate(0.000000,1374.000000) scale(0.100000,-0.100000)"
fill="#000000" stroke="none">
<path d="M8745 13114 c-144 -22 -308 -93 -417 -179 -121 -95 -226 -255 -262
-400 -9 -39 -20 -80 -24 -93 -6 -20 -32 -32 -182 -81 -500 -166 -964 -443
-1425 -851 -144 -128 -402 -392 -539 -552 -60 -71 -112 -128 -116 -128 -4 0
-42 10 -86 22 -113 31 -335 31 -448 0 -173 -48 -332 -149 -436 -279 -70 -87
-109 -158 -142 -263 -19 -62 -23 -97 -23 -200 0 -137 18 -218 76 -331 31 -63
136 -198 175 -226 l25 -19 -138 -274 c-349 -692 -613 -1358 -853 -2151 -402
-1329 -651 -2792 -740 -4359 -12 -221 -35 -929 -29 -934 2 -2 79 -7 172 -10
l167 -7 0 93 c0 269 29 885 61 1293 153 1998 592 3861 1269 5386 82 185 358
749 382 782 13 17 18 17 102 2 270 -47 528 25 737 205 l56 48 139 -52 c859
-324 1573 -867 2024 -1541 62 -94 150 -238 150 -248 0 -2 -26 -20 -59 -40
-161 -100 -287 -269 -336 -452 l-18 -65 -941 -2 c-880 -3 -943 -4 -967 -21
-32 -22 -49 -57 -49 -104 0 -28 8 -42 37 -69 32 -30 44 -34 90 -34 29 0 53 -3
53 -6 0 -4 -13 -48 -29 -98 -16 -50 -53 -172 -81 -271 -28 -99 -75 -263 -104
-365 -29 -102 -75 -259 -100 -350 -26 -91 -65 -223 -86 -295 -45 -151 -109
-371 -185 -640 -30 -104 -68 -235 -84 -290 -31 -105 -81 -280 -138 -480 -19
-66 -48 -165 -65 -220 -16 -55 -37 -126 -45 -157 l-15 -58 -264 0 c-306 0
-279 14 -238 -126 26 -94 34 -111 108 -264 165 -338 486 -633 833 -766 241
-92 336 -109 603 -109 257 1 338 14 545 90 396 147 701 420 890 795 65 129
143 359 127 374 -3 3 -124 6 -269 6 -244 0 -263 1 -263 18 0 9 -11 53 -24 97
-65 219 -173 590 -221 760 -56 195 -169 586 -185 640 -5 17 -32 111 -60 210
-27 99 -55 194 -61 210 -6 17 -35 116 -64 220 -130 460 -164 576 -193 670 -17
55 -41 136 -53 180 -11 44 -27 103 -36 130 -8 28 -17 60 -20 73 l-5 22 779 0
779 0 18 -71 c38 -148 143 -308 264 -404 81 -65 232 -138 328 -160 l81 -18 7
-1081 c3 -595 9 -1647 12 -2338 l7 -1258 170 0 170 0 -7 1248 c-3 686 -9 1743
-12 2349 l-7 1102 44 11 c64 17 205 92 271 145 121 95 226 256 264 404 l18 71
763 0 c420 0 763 -3 763 -6 0 -4 -11 -41 -25 -83 -23 -70 -48 -155 -184 -636
-27 -93 -60 -208 -74 -255 -15 -47 -50 -166 -78 -265 -28 -99 -78 -272 -111
-385 -32 -113 -83 -290 -113 -395 -30 -104 -67 -235 -84 -290 -16 -55 -45
-156 -65 -225 -20 -69 -49 -170 -65 -225 -16 -55 -41 -145 -56 -200 -15 -55
-33 -116 -41 -135 -7 -19 -19 -56 -25 -82 l-11 -48 -264 0 c-205 0 -264 -3
-264 -12 0 -45 60 -221 110 -326 211 -437 528 -712 1007 -871 125 -42 236 -55
453 -56 257 0 337 14 545 90 126 47 220 90 259 120 18 14 36 25 40 25 5 0 45
26 89 57 109 77 298 267 376 378 68 98 158 265 192 354 29 78 68 228 61 235
-3 3 -124 6 -269 6 -244 0 -263 1 -263 18 0 9 -11 53 -24 97 -71 240 -174 593
-221 760 -120 422 -154 542 -168 585 -28 88 -46 151 -201 695 -57 200 -104
361 -162 560 -71 241 -144 500 -144 509 0 3 23 6 51 6 45 0 55 4 85 34 28 28
34 41 34 78 0 24 -7 54 -16 67 -37 52 -14 51 -992 51 l-909 0 -18 67 c-26 95
-84 206 -150 285 -49 60 -129 132 -172 157 -14 7 -9 21 32 97 318 589 845
1114 1496 1490 169 97 455 236 624 302 190 74 170 76 242 -17 105 -133 265
-236 439 -282 84 -23 287 -32 371 -16 l43 7 134 -272 c277 -564 462 -1015 661
-1613 521 -1564 808 -3260 875 -5155 5 -151 10 -317 10 -368 l0 -93 168 7 c92
3 169 8 171 10 6 5 -17 713 -29 934 -127 2235 -585 4284 -1331 5963 -64 144
-179 383 -347 717 -1 3 20 23 48 44 62 47 161 169 199 245 58 113 76 194 76
331 0 103 -4 138 -23 200 -33 105 -72 176 -142 263 -214 266 -601 374 -939
261 -40 -14 -75 -23 -76 -22 -1 2 -37 46 -80 98 -269 326 -593 645 -900 885
-133 104 -412 288 -560 369 -175 95 -396 191 -595 257 -150 49 -176 61 -182
81 -4 13 -15 54 -24 93 -36 145 -141 305 -262 400 -79 62 -212 129 -307 155
-78 21 -271 34 -340 24z m300 -179 c32 -9 98 -36 146 -61 198 -103 329 -310
329 -524 0 -214 -131 -421 -329 -524 -122 -63 -191 -80 -331 -80 -140 0 -209
17 -331 80 -198 103 -329 310 -329 524 0 213 131 422 328 523 48 24 103 50
122 56 103 33 281 35 395 6z m-920 -924 c76 -144 190 -255 345 -336 131 -67
227 -89 390 -89 163 0 259 22 390 89 154 81 269 192 344 335 l36 68 103 -33
c427 -136 856 -383 1247 -720 220 -190 495 -473 683 -703 l58 -71 -46 -56
c-88 -109 -142 -252 -153 -406 l-7 -92 -128 -48 c-484 -182 -926 -434 -1352
-771 -147 -117 -460 -423 -584 -573 -161 -194 -357 -489 -455 -684 l-37 -73
-37 6 c-20 3 -66 6 -102 6 l-65 1 -55 102 c-70 129 -204 331 -313 470 -401
512 -936 936 -1582 1251 -135 67 -422 188 -516 219 -14 5 -15 12 -2 74 10 46
13 101 10 168 -8 162 -59 294 -161 421 -31 38 -56 73 -56 78 0 15 168 203 325
364 501 515 1034 863 1595 1043 47 15 86 28 87 28 1 1 18 -30 38 -68z m-2449
-1322 c275 -84 464 -320 464 -579 0 -261 -189 -495 -470 -581 -61 -19 -98 -23
-200 -23 -102 0 -139 4 -200 23 -234 72 -399 237 -455 456 -82 324 172 667
539 726 82 13 244 2 322 -22z m6880 -60 c275 -84 464 -320 464 -579 0 -261
-189 -495 -470 -581 -61 -19 -98 -23 -200 -23 -102 0 -139 4 -200 23 -234 72
-399 237 -455 456 -82 324 172 667 539 726 82 13 244 2 322 -22z m-3551 -2954
c32 -9 98 -36 146 -61 198 -103 329 -310 329 -524 0 -214 -131 -421 -329 -524
-122 -63 -191 -80 -331 -80 -140 0 -209 17 -331 80 -198 103 -329 310 -329
524 0 213 131 422 328 523 48 24 103 50 122 56 103 33 281 35 395 6z m2424
-1545 c27 -96 60 -211 74 -255 24 -75 64 -213 176 -610 83 -294 142 -496 181
-625 21 -69 55 -186 75 -260 20 -74 45 -162 56 -195 21 -64 119 -418 119 -429
0 -3 -380 -6 -844 -6 l-845 0 14 48 c7 26 25 92 40 147 15 55 33 116 40 135 7
19 31 105 55 190 23 85 57 205 75 265 19 61 55 184 80 275 26 91 74 257 107
370 32 113 79 277 104 365 24 88 55 194 68 235 14 41 41 136 61 210 20 74 54
191 75 260 21 69 56 186 76 260 20 74 41 144 47 154 10 20 32 -50 166 -534z
m-5038 372 c69 -246 137 -484 170 -592 32 -105 116 -399 184 -645 25 -88 56
-194 69 -235 14 -41 41 -136 61 -210 20 -74 52 -184 70 -245 46 -149 234 -806
235 -822 0 -2 -380 -3 -845 -3 -465 0 -845 1 -845 3 0 1 23 81 50 177 28 96
71 247 96 335 25 88 60 210 79 270 18 61 54 184 80 275 26 91 74 257 107 370
32 113 79 277 104 365 24 88 55 194 68 235 13 41 41 136 61 210 20 74 47 169
60 210 14 41 45 152 70 245 47 177 63 225 74 225 3 0 27 -76 52 -168z"/>
</g>
</svg>
