TA,age,ethnicity,eta_h_omicron
1,0,Maori,0.004265651081645907
1,1,Maori,0.00461805993460905
1,2,Maori,0.029962352338571856
1,3,Maori,0.141694198062495
1,0,MaoriPacific,0.004862501424972255
1,1,MaoriPacific,0.004733501413920785
1,2,MaoriPacific,0.024267353226626397
1,3,MaoriPacific,0.16940156694549902
1,0,Other,0.0028623348800119533
1,1,Other,0.003291701120399685
1,2,Other,0.022980350787216695
1,3,Other,0.11470775709266333
1,0,Pacific,0.00495642637396657
1,1,Pacific,0.005457150947533697
1,2,Pacific,0.030243436032599724
1,3,Pacific,0.14844693679313126
2,0,Maori,0.004356451490584347
2,1,Maori,0.004684004399009233
2,2,Maori,0.027764264200493338
2,3,Maori,0.14019076357780538
2,0,MaoriPacific,0.004934167406218928
2,1,MaoriPacific,0.004824006389278359
2,2,MaoriPacific,0.02441238296447136
2,3,MaoriPacific,0.1835426578308718
2,0,Other,0.0029064123824499005
2,1,Other,0.003308477664209913
2,2,Other,0.02146928010438802
2,3,Other,0.12272904722248554
2,0,Pacific,0.004905987036558485
2,1,Pacific,0.005420625468175526
2,2,Pacific,0.029634407239218636
2,3,Pacific,0.16350113850499232
3,0,Maori,0.0044283208430733086
3,1,Maori,0.004568736192561072
3,2,Maori,0.02949883314835152
3,3,Maori,0.14120298468403142
3,0,MaoriPacific,0.0049730517773166165
3,1,MaoriPacific,0.004733822210092367
3,2,MaoriPacific,0.024365110326821465
3,3,MaoriPacific,0.19046339364358125
3,0,Other,0.0029231125682055072
3,1,Other,0.0032850854867545517
3,2,Other,0.022411527251586585
3,3,Other,0.11297163601139244
3,0,Pacific,0.0047856925441700626
3,1,Pacific,0.005288894144291173
3,2,Pacific,0.02819013780422079
3,3,Pacific,0.16523606307432792
11,0,Maori,0.004222825919592895
11,1,Maori,0.004486922370983946
11,2,Maori,0.02927894231601582
11,3,Maori,0.14157193651236097
11,0,MaoriPacific,0.004456889519387888
11,1,MaoriPacific,0.004515777559369567
11,2,MaoriPacific,0.02395535675000012
11,3,MaoriPacific,0.23603366327116299
11,0,Other,0.002888910954505485
11,1,Other,0.00329277234393706
11,2,Other,0.023357641089950105
11,3,Other,0.1190238818609067
11,0,Pacific,0.004745284695554618
11,1,Pacific,0.0052508578139506355
11,2,Pacific,0.03212324703934116
11,3,Pacific,0.16176008714898482
12,0,Maori,0.004301075658462371
12,1,Maori,0.004629043587885809
12,2,Maori,0.028589688279664523
12,3,Maori,0.13756609652078264
12,0,MaoriPacific,0.004869080805458846
12,1,MaoriPacific,0.004655418116182548
12,2,MaoriPacific,0.02940896495015549
12,3,MaoriPacific,0.20104376588676945
12,0,Other,0.002900323038790734
12,1,Other,0.003243711022138993
12,2,Other,0.022543485121617458
12,3,Other,0.12016245931984428
12,0,Pacific,0.004982612432364631
12,1,Pacific,0.005277492408061293
12,2,Pacific,0.028026362257191337
12,3,Pacific,0.18094683889622395
13,0,Maori,0.00426227745846956
13,1,Maori,0.004616795708773565
13,2,Maori,0.02739921925728029
13,3,Maori,0.1321577808679812
13,0,MaoriPacific,0.004865915453309459
13,1,MaoriPacific,0.004879139059621805
13,2,MaoriPacific,0.024738950745719163
13,3,MaoriPacific,0.15599668711733486
13,0,Other,0.002873243765144863
13,1,Other,0.0032435107688632628
13,2,Other,0.020805198348117768
13,3,Other,0.11039960721626565
13,0,Pacific,0.0050359798181003205
13,1,Pacific,0.005271556866336534
13,2,Pacific,0.0271899330482781
13,3,Pacific,0.15210453904996624
15,0,Maori,0.004374006325165217
15,1,Maori,0.004661608662329226
15,2,Maori,0.02719126025981417
15,3,Maori,0.1362956494805915
15,0,MaoriPacific,0.004969179736869336
15,1,MaoriPacific,0.004990595646512639
15,2,MaoriPacific,0.02512153085424659
15,3,MaoriPacific,0.1966985189848097
15,0,Other,0.002952839875847575
15,1,Other,0.003310508727772486
15,2,Other,0.021057339747926482
15,3,Other,0.1272917023399624
15,0,Pacific,0.004905317191265047
15,1,Pacific,0.005317364192990479
15,2,Pacific,0.028557127129417867
15,3,Pacific,0.17085950130140073
16,0,Maori,0.004399091910199512
16,1,Maori,0.004706939328307992
16,2,Maori,0.025772819518362224
16,3,Maori,0.13365743820015186
16,0,MaoriPacific,0.005086058880166784
16,1,MaoriPacific,0.004872818659995677
16,2,MaoriPacific,0.022036896768948516
16,3,MaoriPacific,0.16879435673668927
16,0,Other,0.0030147225545145064
16,1,Other,0.003365753165522435
16,2,Other,0.018506896428328912
16,3,Other,0.12284019770078664
16,0,Pacific,0.004900879915577106
16,1,Pacific,0.00527177265901417
16,2,Pacific,0.027282605430114952
16,3,Pacific,0.15392956802450666
17,0,Maori,0.0043678834542618394
17,1,Maori,0.0045515505723731095
17,2,Maori,0.027340787616013877
17,3,Maori,0.1401427811669302
17,0,MaoriPacific,0.004955164058779365
17,1,MaoriPacific,0.005098356647871091
17,2,MaoriPacific,0.023561239813863086
17,3,MaoriPacific,0.2098049434484093
17,0,Other,0.002891335796967349
17,1,Other,0.003219160075334214
17,2,Other,0.02067931965135683
17,3,Other,0.12460191060723577
17,0,Pacific,0.004667172106519693
17,1,Pacific,0.0051473281623377
17,2,Pacific,0.02965475462742498
17,3,Pacific,0.17179041352179372
18,0,Maori,0.004424071606682331
18,1,Maori,0.004688954570297049
18,2,Maori,0.027480104043103463
18,3,Maori,0.14433507810133092
18,0,MaoriPacific,0.004946325198667502
18,1,MaoriPacific,0.004767765248318773
18,2,MaoriPacific,0.025637167284750836
18,3,MaoriPacific,0.224016028813938
18,0,Other,0.002980492776973647
18,1,Other,0.00336612916467099
18,2,Other,0.020099112459582385
18,3,Other,0.11582255120411333
18,0,Pacific,0.0047042117922941485
18,1,Pacific,0.005505795708265846
18,2,Pacific,0.025330908281729514
18,3,Pacific,0.2786393271102065
19,0,Maori,0.004342503570678752
19,1,Maori,0.004658145729718153
19,2,Maori,0.02841719751229006
19,3,Maori,0.1386302064604173
19,0,MaoriPacific,0.005064929235392427
19,1,MaoriPacific,0.0046544540418034476
19,2,MaoriPacific,0.022268802009281292
19,3,MaoriPacific,0.187289708646997
19,0,Other,0.0030212167393080186
19,1,Other,0.003368772845862616
19,2,Other,0.02174750359099222
19,3,Other,0.12128146099409073
19,0,Pacific,0.004904387670684352
19,1,Pacific,0.005365727556762031
19,2,Pacific,0.03208082168212779
19,3,Pacific,0.1684301004578329
20,0,Maori,0.004230910560473222
20,1,Maori,0.004573598465257041
20,2,Maori,0.028868236355551857
20,3,Maori,0.13952681631430527
20,0,MaoriPacific,0.004759805553767965
20,1,MaoriPacific,0.00504102611081878
20,2,MaoriPacific,0.02415704401929797
20,3,MaoriPacific,0.22392264809096615
20,0,Other,0.0029259356962497195
20,1,Other,0.003366532660240437
20,2,Other,0.021632041963446404
20,3,Other,0.11490482021237203
20,0,Pacific,0.005662883500098565
20,1,Pacific,0.00523505425823849
20,2,Pacific,0.024389442749988506
20,3,Pacific,0.25880661936434934
21,0,Maori,0.004345637095189625
21,1,Maori,0.004675301083367297
21,2,Maori,0.028060554513389797
21,3,Maori,0.1408036698489823
21,0,MaoriPacific,0.004832273969312529
21,1,MaoriPacific,0.0047226338122109005
21,2,MaoriPacific,0.021843103791207744
21,3,MaoriPacific,0.20643015211208332
21,0,Other,0.0029273510673353013
21,1,Other,0.0033456009882314626
21,2,Other,0.020885374761104556
21,3,Other,0.11978671535941592
21,0,Pacific,0.004948976730033031
21,1,Pacific,0.005424129448385249
21,2,Pacific,0.02991171232254508
21,3,Pacific,0.15631409970422636
22,0,Maori,0.004298810059473024
22,1,Maori,0.0046202044334351395
22,2,Maori,0.02879561688938244
22,3,Maori,0.14188888610196862
22,0,MaoriPacific,0.004794235033837792
22,1,MaoriPacific,0.0047323026007542405
22,2,MaoriPacific,0.019788513934039496
22,3,MaoriPacific,0.19046339364358125
22,0,Other,0.0028454071154900254
22,1,Other,0.003265029327474251
22,2,Other,0.022311241128806652
22,3,Other,0.11661756435927424
22,0,Pacific,0.004925870753669266
22,1,Pacific,0.00520139712343519
22,2,Pacific,0.026932593336814328
22,3,Pacific,0.1620809512811028
23,0,Maori,0.004314685799474186
23,1,Maori,0.004644924320318743
23,2,Maori,0.026247579251397292
23,3,Maori,0.1416045815296549
23,0,MaoriPacific,0.004870086015429374
23,1,MaoriPacific,0.00483051329281334
23,2,MaoriPacific,0.02124702593610985
23,3,MaoriPacific,0.165767267793127
23,0,Other,0.002949296494072795
23,1,Other,0.0033529518641269495
23,2,Other,0.019909658769143856
23,3,Other,0.12999360306304172
23,0,Pacific,0.004839572484110939
23,1,Pacific,0.005240402788872114
23,2,Pacific,0.028004863952423027
23,3,Pacific,0.1603000902272428
24,0,Maori,0.004301954701279201
24,1,Maori,0.004625818973772319
24,2,Maori,0.027967178914023536
24,3,Maori,0.13787496333456886
24,0,MaoriPacific,0.004749582176245396
24,1,MaoriPacific,0.004812437067624595
24,2,MaoriPacific,0.025012997881386938
24,3,MaoriPacific,0.17279501262921132
24,0,Other,0.0029337769671968976
24,1,Other,0.0033961908926496355
24,2,Other,0.02042893078828232
24,3,Other,0.12075292815715785
24,0,Pacific,0.004851214764296056
24,1,Pacific,0.005304084261706155
24,2,Pacific,0.030206084601334667
24,3,Pacific,0.1657422126761162
25,0,Maori,0.0042950084872519605
25,1,Maori,0.004593359626153788
25,2,Maori,0.02883357310250591
25,3,Maori,0.13719976805394118
25,0,MaoriPacific,0.004732765008448208
25,1,MaoriPacific,0.00450831435387206
25,2,MaoriPacific,0.023419270919393102
25,3,MaoriPacific,0.18014334849795077
25,0,Other,0.00288989817399368
25,1,Other,0.003313851452431148
25,2,Other,0.02180131276479972
25,3,Other,0.1189420542986524
25,0,Pacific,0.005295898304780752
25,1,Pacific,0.005578509518613517
25,2,Pacific,0.03036468866726264
25,3,Pacific,0.165755191160457
26,0,Maori,0.004358723092728327
26,1,Maori,0.0046456163939533
26,2,Maori,0.027709318967149035
26,3,Maori,0.14054354480275413
26,0,MaoriPacific,0.004989414144723249
26,1,MaoriPacific,0.005052533627910642
26,2,MaoriPacific,0.02475281305944271
26,3,MaoriPacific,0.2492533819708463
26,0,Other,0.002914463794848866
26,1,Other,0.003279713758202149
26,2,Other,0.023578406480623974
26,3,Other,0.12723052233867324
26,0,Pacific,0.005265082032370016
26,1,Pacific,0.005349270251277965
26,2,Pacific,0.03345228378855676
26,3,Pacific,0.22204222951830777
27,0,Maori,0.0043341966955281926
27,1,Maori,0.004650741953833267
27,2,Maori,0.029705052038151627
27,3,Maori,0.14758699275358425
27,0,MaoriPacific,0.00511506105011022
27,1,MaoriPacific,0.004686586911054627
27,2,MaoriPacific,0.027554910744448068
27,3,MaoriPacific,0.24862512794952205
27,0,Other,0.003076287398773308
27,1,Other,0.0035189808929242086
27,2,Other,0.024254969022425816
27,3,Other,0.11584795346932623
27,0,Pacific,0.004645028584083276
27,1,Pacific,0.005331725883246128
27,2,Pacific,0.029016645217900598
27,3,Pacific,0.19067933131249276
28,0,Maori,0.004289829236607057
28,1,Maori,0.004636883182354303
28,2,Maori,0.028389068100780724
28,3,Maori,0.1391619321005825
28,0,MaoriPacific,0.0048574565450547275
28,1,MaoriPacific,0.004678372098846099
28,2,MaoriPacific,0.023554715391551368
28,3,MaoriPacific,0.1804157674575027
28,0,Other,0.002935761725543169
28,1,Other,0.003321821082475278
28,2,Other,0.021424857165213827
28,3,Other,0.12346878119371822
28,0,Pacific,0.005022819175000382
28,1,Pacific,0.005469734713671248
28,2,Pacific,0.030422191419063254
28,3,Pacific,0.15208099947208661
29,0,Maori,0.004339117984199205
29,1,Maori,0.004616730844222564
29,2,Maori,0.029607256803156057
29,3,Maori,0.14318060898030716
29,0,MaoriPacific,0.004759681955429861
29,1,MaoriPacific,0.004160237058851077
29,2,MaoriPacific,0.023832063893465115
29,3,MaoriPacific,0.22379807873145874
29,0,Other,0.0030533778132283617
29,1,Other,0.0034315541164468073
29,2,Other,0.02341921185081945
29,3,Other,0.11454847365181155
29,0,Pacific,0.004203188492789929
29,1,Pacific,0.005300190966071115
29,2,Pacific,0.0339260286712376
29,3,Pacific,0.24695702101278683
30,0,Maori,0.004343806818914322
30,1,Maori,0.0046621777046372765
30,2,Maori,0.027685616275605084
30,3,Maori,0.13535052048568885
30,0,MaoriPacific,0.00496608024815903
30,1,MaoriPacific,0.0046478846410569355
30,2,MaoriPacific,0.023859354199124102
30,3,MaoriPacific,0.17316313180318538
30,0,Other,0.0028500670488403614
30,1,Other,0.003258856888114161
30,2,Other,0.021386619550898833
30,3,Other,0.12290988797190694
30,0,Pacific,0.005069925198141829
30,1,Pacific,0.005464741568813401
30,2,Pacific,0.026598541428145814
30,3,Pacific,0.15434159510640216
31,0,Maori,0.004373507791637803
31,1,Maori,0.004597870112277323
31,2,Maori,0.027070836534143015
31,3,Maori,0.13668569489014062
31,0,MaoriPacific,0.004888225243952887
31,1,MaoriPacific,0.004746009657909056
31,2,MaoriPacific,0.023481828339722538
31,3,MaoriPacific,0.23683398126380428
31,0,Other,0.002905156300050236
31,1,Other,0.0033087708252369833
31,2,Other,0.02108331666871358
31,3,Other,0.125526233445867
31,0,Pacific,0.004703587442834463
31,1,Pacific,0.005346542583824024
31,2,Pacific,0.029234920564635756
31,3,Pacific,0.1598959300108768
32,0,Maori,0.004410955967551444
32,1,Maori,0.004590660510377108
32,2,Maori,0.029693377947120837
32,3,Maori,0.1356590103514666
32,0,MaoriPacific,0.004945305761356331
32,1,MaoriPacific,0.004882105242415647
32,2,MaoriPacific,0.024568620889036837
32,3,MaoriPacific,0.22124258192349372
32,0,Other,0.002934052993131901
32,1,Other,0.0032389083669830347
32,2,Other,0.021731077337185788
32,3,Other,0.11449208520025912
32,0,Pacific,0.005719734723421539
32,1,Pacific,0.005647965023327879
32,2,Pacific,0.026147507237002553
32,3,Pacific,0.22233855835466024
33,0,Maori,0.004312420021365322
33,1,Maori,0.004644564506439342
33,2,Maori,0.026715226374950676
33,3,Maori,0.1407006869862282
33,0,MaoriPacific,0.004951878328374514
33,1,MaoriPacific,0.004883016561615705
33,2,MaoriPacific,0.024236203444810943
33,3,MaoriPacific,0.18418397689155055
33,0,Other,0.0029392912838159496
33,1,Other,0.00329503469605186
33,2,Other,0.02056195344550785
33,3,Other,0.12369076595066149
33,0,Pacific,0.00473305732794182
33,1,Pacific,0.005035894938062711
33,2,Pacific,0.028235003877790543
33,3,Pacific,0.14723378674436474
34,0,Maori,0.004475425194291063
34,1,Maori,0.00462339980717308
34,2,Maori,0.02600163053362767
34,3,Maori,0.13379028617742922
34,0,MaoriPacific,0.005689396222594824
34,1,MaoriPacific,0.004961087252613932
34,2,MaoriPacific,0.027053450299209907
34,3,MaoriPacific,0.2719619953676515
34,0,Other,0.002906798995801433
34,1,Other,0.0033301216045905292
34,2,Other,0.021050656731742216
34,3,Other,0.12447321053224208
34,0,Pacific,0.005922485231720033
34,1,Pacific,0.005720215664081228
34,2,Pacific,0.02489693264800549
34,3,Pacific,0.27099550044478526
35,0,Maori,0.004355106617719928
35,1,Maori,0.004651817446926739
35,2,Maori,0.027402278329124282
35,3,Maori,0.1426724441506806
35,0,MaoriPacific,0.004595077214039768
35,1,MaoriPacific,0.004987422811479986
35,2,MaoriPacific,0.027070516810409867
35,3,MaoriPacific,0.21734764233067683
35,0,Other,0.0029838751572697298
35,1,Other,0.0032947088633343766
35,2,Other,0.02071509386063577
35,3,Other,0.11835406137909216
35,0,Pacific,0.00499568493364781
35,1,Pacific,0.00557366559423694
35,2,Pacific,0.02926760871131529
35,3,Pacific,0.1837048858132663
36,0,Maori,0.004414330421053976
36,1,Maori,0.004627627155509608
36,2,Maori,0.02869953408045332
36,3,Maori,0.13423162306577519
36,0,MaoriPacific,0.0047583983771850545
36,1,MaoriPacific,0.005085028200707359
36,2,MaoriPacific,0.024935243635792425
36,3,MaoriPacific,0.2330336958064685
36,0,Other,0.0030383003841120662
36,1,Other,0.0035165501628390532
36,2,Other,0.021805554113659528
36,3,Other,0.11046158543552408
36,0,Pacific,0.004905932075923842
36,1,Pacific,0.00588666066564776
36,2,Pacific,0.029502503738614905
36,3,Pacific,0.2465640080943918
37,0,Maori,0.004384482799882086
37,1,Maori,0.004656369901584686
37,2,Maori,0.02787769762849892
37,3,Maori,0.13857973372251786
37,0,MaoriPacific,0.005163494826821566
37,1,MaoriPacific,0.004874757587613863
37,2,MaoriPacific,0.023676861015259152
37,3,MaoriPacific,0.25614312113757853
37,0,Other,0.0028675200422945504
37,1,Other,0.003244670442663158
37,2,Other,0.021823902642019166
37,3,Other,0.1264804112697957
37,0,Pacific,0.004751983277587913
37,1,Pacific,0.0052380764018684755
37,2,Pacific,0.029932539304006082
37,3,Pacific,0.155050300552551
38,0,Maori,0.004342666007327782
38,1,Maori,0.004680678677347091
38,2,Maori,0.029046408276577357
38,3,Maori,0.14487911991556224
38,0,MaoriPacific,0.004944982680873769
38,1,MaoriPacific,0.004722091721163572
38,2,MaoriPacific,0.027955907978406455
38,3,MaoriPacific,0.20608392570237635
38,0,Other,0.0029247683677931305
38,1,Other,0.0033037876942026453
38,2,Other,0.022235513280048795
38,3,Other,0.11842651334858278
38,0,Pacific,0.005275415905734526
38,1,Pacific,0.00558813303388241
38,2,Pacific,0.02200530330125111
38,3,Pacific,0.16844414423676274
39,0,Maori,0.004245740964010539
39,1,Maori,0.004637892623743303
39,2,Maori,0.02653445742829788
39,3,Maori,0.13571429355780074
39,0,MaoriPacific,0.004711820336849238
39,1,MaoriPacific,0.004775769350991513
39,2,MaoriPacific,0.018069735841109904
39,3,MaoriPacific,0.20608392570237635
39,0,Other,0.0029468039364176964
39,1,Other,0.0032406482779817375
39,2,Other,0.021323319356488235
39,3,Other,0.1203601188503246
39,0,Pacific,0.00451084449877527
39,1,Pacific,0.005149344063719578
39,2,Pacific,0.028699577176358553
39,3,Pacific,0.16253648925438446
40,0,Maori,0.004372914275632984
40,1,Maori,0.0046457927974062644
40,2,Maori,0.025561955837244292
40,3,Maori,0.13894331073122376
40,0,MaoriPacific,0.005015997769374524
40,1,MaoriPacific,0.00487626111306711
40,2,MaoriPacific,0.022738559085567357
40,3,MaoriPacific,0.18503790183258978
40,0,Other,0.002968828209666308
40,1,Other,0.00328690645464305
40,2,Other,0.019837901414039308
40,3,Other,0.12359695038795782
40,0,Pacific,0.005081538396603226
40,1,Pacific,0.005381816207139626
40,2,Pacific,0.02835401620426038
40,3,Pacific,0.15533020383757154
41,0,Maori,0.004366796185543536
41,1,Maori,0.004589374834644503
41,2,Maori,0.027612852131088647
41,3,Maori,0.13531455164662765
41,0,MaoriPacific,0.0049660193828471285
41,1,MaoriPacific,0.004901007665026037
41,2,MaoriPacific,0.027251892682858506
41,3,MaoriPacific,0.25227632971781855
41,0,Other,0.002851909759235152
41,1,Other,0.003288543556933726
41,2,Other,0.021925853201061433
41,3,Other,0.11988042796491351
41,0,Pacific,0.005123218129660927
41,1,Pacific,0.005614062106699437
41,2,Pacific,0.029885877583009084
41,3,Pacific,0.21200011245856146
42,0,Maori,0.004325747065479416
42,1,Maori,0.004640794824926873
42,2,Maori,0.029024081526779065
42,3,Maori,0.1404325459212591
42,0,MaoriPacific,0.004939974317652107
42,1,MaoriPacific,0.004591893774289524
42,2,MaoriPacific,0.024217756673486905
42,3,MaoriPacific,0.24789536385617178
42,0,Other,0.0028634174937831242
42,1,Other,0.003277329715400194
42,2,Other,0.02279349558073337
42,3,Other,0.12698252764407786
42,0,Pacific,0.004737316057699905
42,1,Pacific,0.005175957220036413
42,2,Pacific,0.028922716775567046
42,3,Pacific,0.16608526966620027
43,0,Maori,0.0042981761164589535
43,1,Maori,0.004692247372458798
43,2,Maori,0.02877238204638307
43,3,Maori,0.1466323906779114
43,0,MaoriPacific,0.004915461460424809
43,1,MaoriPacific,0.0050166453853695905
43,2,MaoriPacific,0.02273153385355936
43,3,MaoriPacific,0.2669236561401811
43,0,Other,0.0028538821448614864
43,1,Other,0.003160028308043325
43,2,Other,0.021850002142724572
43,3,Other,0.13332455593955692
43,0,Pacific,0.0048323926144578115
43,1,Pacific,0.0050366239629957305
43,2,Pacific,0.033119855951477366
43,3,Pacific,0.17124007186199675
44,0,Maori,0.004285843170123466
44,1,Maori,0.004752326667620598
44,2,Maori,0.026967426174669004
44,3,Maori,0.13348968289994612
44,0,MaoriPacific,0.004879729750804758
44,1,MaoriPacific,0.004878730338594492
44,2,MaoriPacific,0.02117254538180102
44,3,MaoriPacific,0.16943091160685847
44,0,Other,0.0030118202343827585
44,1,Other,0.0033038872325485296
44,2,Other,0.019853529227813912
44,3,Other,0.11195916306804941
44,0,Pacific,0.004884003184178383
44,1,Pacific,0.005270062906392773
44,2,Pacific,0.030475322355212366
44,3,Pacific,0.15721498194605527
45,0,Maori,0.004359806533561761
45,1,Maori,0.004777219383509416
45,2,Maori,0.02646742972918676
45,3,Maori,0.135167714052039
45,0,MaoriPacific,0.004819588340020234
45,1,MaoriPacific,0.004835789329354597
45,2,MaoriPacific,0.023192781681765667
45,3,MaoriPacific,0.2599536456615798
45,0,Other,0.0029692311520286957
45,1,Other,0.0032716621164741518
45,2,Other,0.020250180745623535
45,3,Other,0.12496627213946497
45,0,Pacific,0.004826677461320136
45,1,Pacific,0.005258241487077766
45,2,Pacific,0.02828434818876966
45,3,Pacific,0.16010891699898125
46,0,Maori,0.0043444347092815964
46,1,Maori,0.004715646654123315
46,2,Maori,0.02711133176691983
46,3,Maori,0.12944799137099258
46,0,MaoriPacific,0.004989365516689597
46,1,MaoriPacific,0.004732337354384582
46,2,MaoriPacific,0.021662776743913727
46,3,MaoriPacific,0.15343415672524222
46,0,Other,0.0030078898542045085
46,1,Other,0.0033807957756370496
46,2,Other,0.019575893371531747
46,3,Other,0.12030840332660023
46,0,Pacific,0.004819147010011962
46,1,Pacific,0.005288586073863502
46,2,Pacific,0.0287916615457705
46,3,Pacific,0.14956197997214565
47,0,Maori,0.004251798188659904
47,1,Maori,0.004717883920469958
47,2,Maori,0.026762096485723
47,3,Maori,0.13044380995588378
47,0,MaoriPacific,0.0050148838461332714
47,1,MaoriPacific,0.0050042055997873095
47,2,MaoriPacific,0.022337020931954443
47,3,MaoriPacific,0.22491685102501513
47,0,Other,0.002937132482691256
47,1,Other,0.003372983730891975
47,2,Other,0.018546087472978427
47,3,Other,0.11568679431211759
47,0,Pacific,0.004786051232128703
47,1,Pacific,0.005291158401593489
47,2,Pacific,0.029597494487177668
47,3,Pacific,0.15628099157041633
48,0,Maori,0.004396473140489876
48,1,Maori,0.004629435024716834
48,2,Maori,0.027105564293287563
48,3,Maori,0.14465965703818962
48,0,MaoriPacific,0.004891798691360355
48,1,MaoriPacific,0.004654634694365922
48,2,MaoriPacific,0.026802534648639104
48,3,MaoriPacific,0.24558708330637752
48,0,Other,0.002883953346747847
48,1,Other,0.00327589554523081
48,2,Other,0.021615581100738374
48,3,Other,0.12429309491880956
48,0,Pacific,0.00486498220400566
48,1,Pacific,0.005215391538260317
48,2,Pacific,0.03039984672956688
48,3,Pacific,0.15690325988976464
49,0,Maori,0.004291595863757301
49,1,Maori,0.004482029284868194
49,2,Maori,0.028871758978210232
49,3,Maori,0.14407199219801345
49,0,MaoriPacific,0.005080271851836904
49,1,MaoriPacific,0.00565722948326186
49,2,MaoriPacific,0.03890917579748155
49,3,MaoriPacific,0.2766235980564102
49,0,Other,0.002839289308832899
49,1,Other,0.0031751858329316643
49,2,Other,0.02218207784121115
49,3,Other,0.11608315543490647
49,0,Pacific,0.0049026524246188145
49,1,Pacific,0.005209311992160832
49,2,Pacific,0.026217998250994967
49,3,Pacific,0.2779900067283914
50,0,Maori,0.0042320910820858705
50,1,Maori,0.004550196465315068
50,2,Maori,0.029492675769296723
50,3,Maori,0.13572787122318658
50,0,MaoriPacific,0.00448689758403132
50,1,MaoriPacific,0.004238585295410667
50,2,MaoriPacific,0.027539447297853726
50,3,MaoriPacific,0.2599536456615798
50,0,Other,0.002947489673698471
50,1,Other,0.0033140581012879623
50,2,Other,0.022092084746587533
50,3,Other,0.11404228592511169
50,0,Pacific,0.004714063621884654
50,1,Pacific,0.004953684896252451
50,2,Pacific,0.0312987497464948
50,3,Pacific,0.21902733008818318
51,0,Maori,0.004276104472685336
51,1,Maori,0.004556094414640609
51,2,Maori,0.029012314340772543
51,3,Maori,0.14049294558603018
51,0,MaoriPacific,0.004550203295664598
51,1,MaoriPacific,0.00420174192178284
51,2,MaoriPacific,0.029575272630367102
51,3,MaoriPacific,0.2654159306222214
51,0,Other,0.002755662900522813
51,1,Other,0.003154685288374515
51,2,Other,0.021885385987008284
51,3,Other,0.11529031702933129
51,0,Pacific,0.0046045728028604295
51,1,Pacific,0.005495459830940584
51,2,Pacific,0.023812316196950695
51,3,Pacific,0.16839670239975596
52,0,Maori,0.004300752440078633
52,1,Maori,0.004645577974884206
52,2,Maori,0.027182585551052674
52,3,Maori,0.14711043121365175
52,0,MaoriPacific,0.005238618531696468
52,1,MaoriPacific,0.004629098213194525
52,2,MaoriPacific,0.0217866179715003
52,3,MaoriPacific,0.22788312327889795
52,0,Other,0.002903232940722148
52,1,Other,0.003288899076116014
52,2,Other,0.020973961867904938
52,3,Other,0.12255656552515899
52,0,Pacific,0.004983515779269678
52,1,Pacific,0.005271541964921324
52,2,Pacific,0.02734874021873471
52,3,Pacific,0.1603434319984314
53,0,Maori,0.004442625873366829
53,1,Maori,0.004638048585274218
53,2,Maori,0.028746485660161445
53,3,Maori,0.1375537304074144
53,0,MaoriPacific,0.005208913910578045
53,1,MaoriPacific,0.004959641842578473
53,2,MaoriPacific,0.02237604216926355
53,3,MaoriPacific,0.22359479940188823
53,0,Other,0.002921064406851911
53,1,Other,0.003325535593128612
53,2,Other,0.021349541492487596
53,3,Other,0.1201063752233746
53,0,Pacific,0.004840482211021844
53,1,Pacific,0.005598362579590365
53,2,Pacific,0.025674052255862796
53,3,Pacific,0.17520662632126693
54,0,Maori,0.004401131746742812
54,1,Maori,0.004542624890333027
54,2,Maori,0.02998927854059683
54,3,Maori,0.14840529720164453
54,0,MaoriPacific,0.004755231772527209
54,1,MaoriPacific,0.005195916338835719
54,2,MaoriPacific,0.033821725678497
54,3,MaoriPacific,0.2766235980564102
54,0,Other,0.003087756629085789
54,1,Other,0.0034851310221739066
54,2,Other,0.021484451962028982
54,3,Other,0.1112357695965001
54,0,Pacific,0.0059473524432708804
54,1,Pacific,0.004956359835143036
54,2,Pacific,0.03305366822244039
54,3,Pacific,0.26539494846069317
55,0,Maori,0.004445332879119047
55,1,Maori,0.004808963501274613
55,2,Maori,0.03185242650785522
55,3,Maori,0.14202577699684119
55,0,MaoriPacific,0.00448689758403132
55,1,MaoriPacific,0.0054312461225078795
55,2,MaoriPacific,0.033463603007123484
55,3,MaoriPacific,0.24599202205963056
55,0,Other,0.0028997090662189824
55,1,Other,0.0032893561342661913
55,2,Other,0.022984802224690806
55,3,Other,0.11532188938648985
55,0,Pacific,0.004055493850339624
55,1,Pacific,0.004464594364090028
55,2,Pacific,0.025777848768000225
55,3,Pacific,0.20412362574009646
56,0,Maori,0.0043456134343954865
56,1,Maori,0.004440316684849135
56,2,Maori,0.03039543351748535
56,3,Maori,0.13114457843920493
56,0,MaoriPacific,0.004505318616403564
56,1,MaoriPacific,0.004447091792562242
56,2,MaoriPacific,0.023433760518659016
56,3,MaoriPacific,0.2599536456615798
56,0,Other,0.00296112481312311
56,1,Other,0.0032860324046534582
56,2,Other,0.02184765419638663
56,3,Other,0.11722226888440627
56,0,Pacific,0.004535540666354454
56,1,Pacific,0.005331725883246128
56,2,Pacific,0.03378056924576634
56,3,Pacific,0.23102993517137455
57,0,Maori,0.0045547733663772955
57,1,Maori,0.004685946171709322
57,2,Maori,0.030104552713222956
57,3,Maori,0.14525882091955614
57,0,MaoriPacific,0.004780942118025696
57,1,MaoriPacific,0.004361434920772956
57,2,MaoriPacific,0.027717448330461983
57,3,MaoriPacific,0.23349496061634734
57,0,Other,0.002914004328128424
57,1,Other,0.003475010588499231
57,2,Other,0.021680590906889306
57,3,Other,0.11104891867685557
57,0,Pacific,0.005159076780333451
57,1,Pacific,0.006281368295324962
57,2,Pacific,0.01868488432996549
57,3,Pacific,0.2165391085972268
58,0,Maori,0.004362407162035375
58,1,Maori,0.004738689239680473
58,2,Maori,0.027534000674594574
58,3,Maori,0.13911578727401341
58,0,MaoriPacific,0.0041888472104566025
58,1,MaoriPacific,0.005141753934805666
58,2,MaoriPacific,0.026088495209204452
58,3,MaoriPacific,0.2515682304752795
58,0,Other,0.0029151377587430913
58,1,Other,0.003325997308422544
58,2,Other,0.021377301931977396
58,3,Other,0.11290498107175748
58,0,Pacific,0.004398965537776763
58,1,Pacific,0.005320836075042676
58,2,Pacific,0.028756383279167987
58,3,Pacific,0.19760246550170713
59,0,Maori,0.004244271457816414
59,1,Maori,0.004505777147555204
59,2,Maori,0.027427443534750857
59,3,Maori,0.1363028302011866
59,0,MaoriPacific,0.005055760117496617
59,1,MaoriPacific,0.004896550643356364
59,2,MaoriPacific,0.027286343760768612
59,3,MaoriPacific,0.25853864868233023
59,0,Other,0.002864836198783334
59,1,Other,0.0031782898798771993
59,2,Other,0.021334133646609788
59,3,Other,0.11869460221024065
59,0,Pacific,0.004935668429378647
59,1,Pacific,0.005207745909981304
59,2,Pacific,0.02560504775802613
59,3,Pacific,0.16805100131812312
60,0,Maori,0.004390728870745808
60,1,Maori,0.004738481619591589
60,2,Maori,0.026297358005002186
60,3,Maori,0.13362310523364315
60,0,MaoriPacific,0.004994315290545089
60,1,MaoriPacific,0.004888024801238316
60,2,MaoriPacific,0.02543960978078097
60,3,MaoriPacific,0.18909724302055114
60,0,Other,0.0029651932894771997
60,1,Other,0.0033738950855401037
60,2,Other,0.0194532039146092
60,3,Other,0.12393947015158016
60,0,Pacific,0.004980763225325241
60,1,Pacific,0.005331744815953811
60,2,Pacific,0.02810221819600164
60,3,Pacific,0.15064537073095294
62,0,Maori,0.004313787259476747
62,1,Maori,0.004576517678778375
62,2,Maori,0.025451622879206895
62,3,Maori,0.13320412455792008
62,0,MaoriPacific,0.005072468857261066
62,1,MaoriPacific,0.005087826266765594
62,2,MaoriPacific,0.020062393107674922
62,3,MaoriPacific,0.2628049911034793
62,0,Other,0.0028854262906979314
62,1,Other,0.003213590261160156
62,2,Other,0.01987906215187294
62,3,Other,0.1042214744529696
62,0,Pacific,0.004997545289278579
62,1,Pacific,0.00546811982092555
62,2,Pacific,0.023783755224460756
62,3,Pacific,0.19236515124101777
63,0,Maori,0.004420622466121902
63,1,Maori,0.004649793610898319
63,2,Maori,0.025736773105947467
63,3,Maori,0.14981332723731727
63,0,MaoriPacific,0.004935166155399961
63,1,MaoriPacific,0.00503183280109136
63,2,MaoriPacific,0.02519543723446147
63,3,MaoriPacific,0.23582097790564255
63,0,Other,0.002978997745972209
63,1,Other,0.003363825206144659
63,2,Other,0.020019061568040498
63,3,Other,0.12476157249328287
63,0,Pacific,0.005197194084894138
63,1,Pacific,0.005640791422159928
63,2,Pacific,0.023708830045730978
63,3,Pacific,0.15977041763692923
64,0,Maori,0.004309016520436818
64,1,Maori,0.004569663068229071
64,2,Maori,0.026541942653027194
64,3,Maori,0.14367076368156384
64,0,MaoriPacific,0.004990932890008323
64,1,MaoriPacific,0.004783098497620471
64,2,MaoriPacific,0.0313889108973852
64,3,MaoriPacific,0.2569596880442149
64,0,Other,0.0029250273815850693
64,1,Other,0.0033065550050716064
64,2,Other,0.02159756724496869
64,3,Other,0.1250323606314276
64,0,Pacific,0.0049383522746723986
64,1,Pacific,0.005435675409432986
64,2,Pacific,0.02578059177179388
64,3,Pacific,0.18908388570784523
65,0,Maori,0.0043434354150970154
65,1,Maori,0.004361616923145237
65,2,Maori,0.028009848231610332
65,3,Maori,0.15550270940370658
65,0,MaoriPacific,0.004755231772527209
65,1,MaoriPacific,0.004531179958339413
65,2,MaoriPacific,0.03885534501176925
65,3,MaoriPacific,0.2599536456615798
65,0,Other,0.0029805468391538425
65,1,Other,0.0034655390801206143
65,2,Other,0.020411279657661707
65,3,Other,0.1076302732120088
65,0,Pacific,0.005427123555173904
65,1,Pacific,0.00556433081484527
65,2,Pacific,0.02157395500525304
65,3,Pacific,0.2823516185548485
66,0,Maori,0.004336061558387234
66,1,Maori,0.0045805659971040495
66,2,Maori,0.030030892446958037
66,3,Maori,0.15498861641484463
66,0,MaoriPacific,0.005264005476312896
66,1,MaoriPacific,0.005936115194212041
66,2,MaoriPacific,0.034365456080768624
66,3,MaoriPacific,0.2512532717473529
66,0,Other,0.002870140321035583
66,1,Other,0.003321662141472602
66,2,Other,0.021706802848092656
66,3,Other,0.1208777764592318
66,0,Pacific,0.005358005470707016
66,1,Pacific,0.004796754894119962
66,2,Pacific,0.03856214629756931
66,3,Pacific,0.21131184088814947
67,0,Maori,0.004188458521516252
67,1,Maori,0.004972140106230426
67,2,Maori,0.029504041995049926
67,3,Maori,0.14217600542543488
67,0,MaoriPacific,0.0037103409677693836
67,1,MaoriPacific,0.00542547993432434
67,2,MaoriPacific,0.030676956079199815
67,3,MaoriPacific,0.2719619953676515
67,0,Other,0.003179104346979531
67,1,Other,0.003678550402558325
67,2,Other,0.023192789222347746
67,3,Other,0.11681927534488684
67,0,Pacific,0.0049026524246188145
67,1,Pacific,0.005357140158452293
67,2,Pacific,0.03380941189888577
67,3,Pacific,0.2823516185548485
68,0,Maori,0.004366669529608466
68,1,Maori,0.004529923433502001
68,2,Maori,0.02901272385137942
68,3,Maori,0.14546419019431925
68,0,MaoriPacific,0.004755231772527209
68,1,MaoriPacific,0.004283087748505907
68,2,MaoriPacific,0.037421583123857544
68,3,MaoriPacific,0.24278233499028498
68,0,Other,0.0028790879014287253
68,1,Other,0.0032850470481229927
68,2,Other,0.021749007880117754
68,3,Other,0.12311247467070302
68,0,Pacific,0.004928699330027549
68,1,Pacific,0.005213885887517397
68,2,Pacific,0.023785314660424082
68,3,Pacific,0.17528436949071047
69,0,Maori,0.004355193924426311
69,1,Maori,0.004653961177091974
69,2,Maori,0.0268711505713656
69,3,Maori,0.1398771533549733
69,0,MaoriPacific,0.004755231772527209
69,1,MaoriPacific,0.00468987791878151
69,2,MaoriPacific,0.02411452955388193
69,3,MaoriPacific,0.2766235980564102
69,0,Other,0.00292370279969275
69,1,Other,0.003344574945822237
69,2,Other,0.021441471325465013
69,3,Other,0.11596355631913866
69,0,Pacific,0.004996601463829488
69,1,Pacific,0.006222943794162535
69,2,Pacific,0.02254175841504479
69,3,Pacific,0.20374492235201078
70,0,Maori,0.00439100986477512
70,1,Maori,0.004903353762435463
70,2,Maori,0.025353393067072176
70,3,Maori,0.1371111722105152
70,0,MaoriPacific,0.004910875811965343
70,1,MaoriPacific,0.004764523482372556
70,2,MaoriPacific,0.024488731413522955
70,3,MaoriPacific,0.2628049911034793
70,0,Other,0.0030084247640618316
70,1,Other,0.003715957198490175
70,2,Other,0.01694952777613542
70,3,Other,0.10797998855056766
70,0,Pacific,0.005355504622936191
70,1,Pacific,0.005662897220937727
70,2,Pacific,0.023273843689881717
70,3,Pacific,0.24303250499212273
71,0,Maori,0.004293792450223821
71,1,Maori,0.004442427245214254
71,2,Maori,0.026683672256532284
71,3,Maori,0.1367215301486202
71,0,MaoriPacific,0.00482659984142258
71,1,MaoriPacific,0.0047457992369271795
71,2,MaoriPacific,0.024020933731584572
71,3,MaoriPacific,0.231214793653025
71,0,Other,0.002908034304891673
71,1,Other,0.0031157684273688878
71,2,Other,0.020634987636952578
71,3,Other,0.12315247467201815
71,0,Pacific,0.004946182206111649
71,1,Pacific,0.00504379626589187
71,2,Pacific,0.02842014588065285
71,3,Pacific,0.16051135419151646
72,0,Maori,0.004323841200598523
72,1,Maori,0.004662984125013067
72,2,Maori,0.026648715306654795
72,3,Maori,0.13579707079008857
72,0,MaoriPacific,0.0056536268398518896
72,1,MaoriPacific,0.0054630207590765706
72,2,MaoriPacific,0.026455009838187608
72,3,MaoriPacific,0.2363947651790407
72,0,Other,0.002928527315166715
72,1,Other,0.0032127558852000702
72,2,Other,0.021280004856795327
72,3,Other,0.11752216451973761
72,0,Pacific,0.005110949387149846
72,1,Pacific,0.006201273872896183
72,2,Pacific,0.02307490968519493
72,3,Pacific,0.20225441432218572
73,0,Maori,0.004243695942193412
73,1,Maori,0.004562031621184052
73,2,Maori,0.02665811319405331
73,3,Maori,0.14488486489986943
73,0,MaoriPacific,0.0044615201340862795
73,1,MaoriPacific,0.004572654229054523
73,2,MaoriPacific,0.03121341541339348
73,3,MaoriPacific,0.26393566739384117
73,0,Other,0.0029809786032063165
73,1,Other,0.0033275917028536602
73,2,Other,0.020380547967138337
73,3,Other,0.10976411178600508
73,0,Pacific,0.005015612876368975
73,1,Pacific,0.005154936818900571
73,2,Pacific,0.02607880218071574
73,3,Pacific,0.21137379176024343
74,0,Maori,0.004485951595019738
74,1,Maori,0.004760531200673153
74,2,Maori,0.027046323324353954
74,3,Maori,0.14013966473464795
74,0,MaoriPacific,0.004750084688942782
74,1,MaoriPacific,0.004465438032289565
74,2,MaoriPacific,0.029720270131106105
74,3,MaoriPacific,0.27554230972684834
74,0,Other,0.0028021328048248298
74,1,Other,0.0032779054091139855
74,2,Other,0.021930880410900782
74,3,Other,0.13012276988047433
74,0,Pacific,0.004029004051360142
74,1,Pacific,0.0045266861992943625
74,2,Pacific,0.029756783756834576
74,3,Pacific,0.2168405392466445
75,0,Maori,0.004258077289588674
75,1,Maori,0.004675275413056913
75,2,Maori,0.02629191199168357
75,3,Maori,0.1465682410047585
75,0,MaoriPacific,0.005029865443895239
75,1,MaoriPacific,0.00461166422619225
75,2,MaoriPacific,0.018803398772603678
75,3,MaoriPacific,0.23076146964220626
75,0,Other,0.0029355427798142724
75,1,Other,0.003326724658322035
75,2,Other,0.0204389744968411
75,3,Other,0.12641124885260996
75,0,Pacific,0.004969974641986849
75,1,Pacific,0.005237194803633739
75,2,Pacific,0.027914961594672157
75,3,Pacific,0.1609188516625469
76,0,Maori,0.004315167623931279
76,1,Maori,0.004744077027655046
76,2,Maori,0.027417666474223928
76,3,Maori,0.13452912628785116
76,0,MaoriPacific,0.004939718879270185
76,1,MaoriPacific,0.004874510536263913
76,2,MaoriPacific,0.022792547999904433
76,3,MaoriPacific,0.13909909875125145
76,0,Other,0.0029907422276294004
76,1,Other,0.0034062890134428357
76,2,Other,0.018801783916710103
76,3,Other,0.11893567783934689
76,0,Pacific,0.0048607259974319745
76,1,Pacific,0.005262297973837462
76,2,Pacific,0.02980456804427098
76,3,Pacific,0.15734025316576036
