age,ethnicity,mu_c_delta
0,Maori,0.06284081852611004
1,Maori,0.10917150232486653
2,Maori,0.28876072112022405
3,Maori,0.6523278364990922
0,MaoriPacific,0.06208279804854379
1,MaoriPacific,0.10638920152401837
2,MaoriPacific,0.2634781641656175
3,MaoriPacific,0.64370415134874
0,Other,0.06293459039733618
1,Other,0.11134584592653407
2,Other,0.29431430729712144
3,Other,0.7380160393802295
0,Pacific,0.06289170132894761
1,Pacific,0.10924612554429644
2,Pacific,0.2823349223703423
3,Pacific,0.6625827357064216
