age,ethnicity,p_asympt_omicron
0,Maori,0.5133675133290445
1,Maori,0.3882140584673367
2,Maori,0.2294225894468821
3,Maori,0.11314744520367932
0,MaoriPacific,0.5165716800332683
1,MaoriPacific,0.3945477259000904
2,MaoriPacific,0.25125947842801327
3,MaoriPacific,0.11627421428939261
0,Other,0.512628943956843
1,Other,0.38208591506224715
2,Other,0.2262784779593087
3,Other,0.10539970431870745
0,Pacific,0.5131518130848147
1,Pacific,0.3876352284882032
2,Pacific,0.23422397120147134
3,Pacific,0.11168742038604881
