{    
    "defaultSeverity": "error",
    "extends": [
        "tslint:recommended"
    ],
    "jsRules": {},
    "rules": {
        "max-line-length": [false],
        "quotemark": [true, "single", "jsx-double"],
        "no-console": false,
        "ordered-imports": false,
        "object-literal-sort-keys": false
    },
    "rulesDirectory": []
}