﻿{
  "responseHeader": {
    "status": 0,
    "QTime": 37,
    "params": {
      "json": "{\"query\":\"*:*\",\"limit\":0,\"filter\":[\"NOT projecttype_id:1000\",\"customfieldid:6958\"],\"facet\":{\"group_results\":{\"type\":\"terms\",\"field\":\"brand_name\",\"facet\":{\"form_data\":{\"type\":\"terms\",\"field\":\"form_data\"}}}}}"
    }
  },
  "response": {
    "numFound": 252,
    "start": 0,
    "docs": []
  },
  "facets": {
    "count": 252,
    "group_results": {
      "buckets": [
        {
          "val": "Lemtrada",
          "count": 72,
          "form_data": {
            "buckets": [
              {
                "val": "On Time",
                "count": 69
              },
              {
                "val": "2 or More Weeks Late",
                "count": 2
              },
              {
                "val": "1 Week Late",
                "count": 1
              }
            ]
          }
        },
        {
          "val": "Toujeo",
          "count": 65,
          "form_data": {
            "buckets": [
              {
                "val": "On Time",
                "count": 52
              },
              {
                "val": "2 or More Weeks Late",
                "count": 10
              },
              {
                "val": "1 Week Late",
                "count": 3
              }
            ]
          }
        },
        {
          "val": "Soliqua",
          "count": 21,
          "form_data": {
            "buckets": [
              {
                "val": "On Time",
                "count": 19
              },
              {
                "val": "1 Week Late",
                "count": 1
              },
              {
                "val": "2 or More Weeks Late",
                "count": 1
              }
            ]
          }
        },
        {
          "val": "Aubagio",
          "count": 19,
          "form_data": {
            "buckets": [
              {
                "val": "On Time",
                "count": 19
              }
            ]
          }
        },
        {
          "val": "Lantus",
          "count": 17,
          "form_data": {
            "buckets": [
              {
                "val": "On Time",
                "count": 17
              }
            ]
          }
        },
        {
          "val": "Sota",
          "count": 10,
          "form_data": {
            "buckets": [
              {
                "val": "On Time",
                "count": 10
              }
            ]
          }
        },
        {
          "val": "Promacta Revolade",
          "count": 6,
          "form_data": {
            "buckets": [
              {
                "val": "On Time",
                "count": 6
              }
            ]
          }
        },
        {
          "val": "Dupixent",
          "count": 5,
          "form_data": {
            "buckets": [
              {
                "val": "On Time",
                "count": 4
              },
              {
                "val": "2 or More Weeks Late",
                "count": 1
              }
            ]
          }
        },
        {
          "val": "Clexane",
          "count": 4,
          "form_data": {
            "buckets": [
              {
                "val": "On Time",
                "count": 4
              }
            ]
          }
        },
        {
          "val": "Aubagio Global",
          "count": 3,
          "form_data": {
            "buckets": [
              {
                "val": "On Time",
                "count": 3
              }
            ]
          }
        }
      ]
    }
  }
}