"0","unhcr<-fread('unhcr_popstats_export_time_series_all_data.csv')"
"0","unhcr<-unref(unhcr, groups = 'ref', range = c(2010,2017), sum = TRUE)"
"0","unhcr<-unhcr[,.(value=sum(value)), by=.(origin_iso,destination_iso, origin, destination)]"
"0",""
