{
  "project_info": {
    "project_number": "288170027392",
    "project_id": "search-me-17d5f",
    "storage_bucket": "search-me-17d5f.appspot.com"
  },
  "client": [
    {
      "client_info": {
        "mobilesdk_app_id": "1:288170027392:android:f9b1ed8555e907548eb965",
        "android_client_info": {
          "package_name": "com.spellsventuresllc.search_me"
        }
      },
      "oauth_client": [
        {
          "client_id": "288170027392-p6ed2bju32bbfukfi7q3l5998tfgspru.apps.googleusercontent.com",
          "client_type": 3
        }
      ],
      "api_key": [
        {
          "current_key": "AIzaSyB51idya3AHQUQmYRpPHURkFpw-LvxZUVM"
        }
      ],
      "services": {
        "appinvite_service": {
          "other_platform_oauth_client": [
            {
              "client_id": "288170027392-p6ed2bju32bbfukfi7q3l5998tfgspru.apps.googleusercontent.com",
              "client_type": 3
            },
            {
              "client_id": "288170027392-i4tmdkall7av95rk2ckoh7k1255okms4.apps.googleusercontent.com",
              "client_type": 2,
              "ios_info": {
                "bundle_id": "com.spellsventuresllc.searchMe"
              }
            }
          ]
        }
      }
    }
  ],
  "configuration_version": "1"
}