<?xml version="1.0" encoding="UTF-8" standalone="yes"?>
<!DOCTYPE svg PUBLIC "-//W3C//DTD SVG 1.1//EN" "http://www.w3.org/Graphics/SVG/1.1/DTD/svg11.dtd">

<svg width="220" height="220" viewBox="0 0 220 220" xmlns="http://www.w3.org/2000/svg" xmlns:xlink="http://www.w3.org/1999/xlink" version="1.1" baseProfile="full">
    <g transform="scale(1.000000,-1.000000) translate(0,-220)">
        <mask id="mask1">
            <path d="M 1.000000 7.931774 C 0.999928 8.204235 1.042568 8.747487 1.085148 9.016600 C 1.127728 9.285713 1.254882 9.815593 1.339064 10.074723 C 1.423246 10.333854 1.631779 10.837296 1.755487 11.080054 C 1.879194 11.322812 2.163965 11.787404 2.324149 12.007805 C 2.484333 12.228205 2.838319 12.642492 3.031029 12.835100 C 3.223739 13.027708 3.638214 13.381475 3.858699 13.541542 C 4.079184 13.701609 4.543927 13.986134 4.786751 14.109713 C 5.029574 14.233292 5.533127 14.441559 5.792302 14.525603 C 6.051477 14.609647 6.581424 14.736521 6.850560 14.778958 C 7.119695 14.821396 7.662969 14.863748 7.935431 14.863532 C 8.480828 14.863388 9.558150 14.692465 10.076809 14.523791 C 10.595469 14.355117 11.567244 13.859649 12.008396 13.538956 C 12.449547 13.218262 13.220652 12.446750 13.541113 12.005429 C 13.861573 11.564108 14.356527 10.592071 14.524927 10.073323 C 14.693327 9.554574 14.863681 8.477163 14.863537 7.931765 C 14.863681 7.659467 14.821224 7.116529 14.778755 6.847564 C 14.736286 6.578599 14.609391 6.048994 14.525355 5.789988 C 14.441320 5.530982 14.233112 5.027759 14.109581 4.785094 C 13.986050 4.542430 13.701659 4.077989 13.541676 3.857645 C 13.381693 3.637300 13.028127 3.223084 12.835635 3.030490 C 12.643142 2.837896 12.229112 2.484111 12.008853 2.324012 C 11.788593 2.163913 11.324302 1.879277 11.081703 1.755618 C 10.839103 1.631960 10.335990 1.423486 10.077029 1.339314 C 9.818067 1.255142 9.288529 1.127967 9.019586 1.085356 C 8.750643 1.042745 8.207728 1.000002 7.935431 1.000002 C 7.662930 0.999642 7.119556 1.041742 6.850363 1.084072 C 6.581170 1.126401 6.051099 1.253097 5.791860 1.337072 C 5.532620 1.421046 5.028939 1.629210 4.786054 1.752756 C 4.543169 1.876302 4.078313 2.160795 3.857779 2.320862 C 3.637245 2.480929 3.222691 2.834726 3.029953 3.027363 C 2.837215 3.219999 2.483199 3.634366 2.323015 3.854815 C 2.162831 4.075265 1.878093 4.539970 1.754419 4.782790 C 1.630745 5.025610 1.422315 5.529181 1.338204 5.788376 C 1.254092 6.047571 1.127117 6.577576 1.084645 6.846746 C 1.042173 7.115917 0.999786 7.659268 1.000003 7.931769 Z" transform="scale(1.000000,1.000000) translate(75.692997,117.170209)" fill="#000000" opacity="1.000000"></path>
            <path d="M 1.000002 6.955999 C 1.000721 7.424166 1.148389 8.348784 1.293525 8.793886 C 1.438662 9.238989 1.864416 10.072930 2.139807 10.451533 C 2.415199 10.830136 3.077492 11.492021 3.456264 11.767180 C 3.835037 12.042339 4.669240 12.467579 5.114431 12.612442 C 5.559623 12.757305 6.484331 12.904404 6.952499 12.904835 C 7.303890 12.905051 8.001846 12.822844 8.343571 12.740992 C 8.685295 12.659139 9.344754 12.416208 9.657914 12.256815 C 9.971074 12.097421 10.555565 11.707201 10.822842 11.479081 C 11.090118 11.250961 11.567317 10.735032 11.773929 10.450802 C 11.980541 10.166571 12.324057 9.553466 12.458578 9.228844 C 12.593099 8.904222 12.783935 8.227846 12.838926 7.880785 C 12.893916 7.533724 12.921518 6.831485 12.893937 6.481178 C 12.866357 6.130872 12.729197 5.441605 12.620571 5.107426 C 12.511944 4.773247 12.217609 4.135071 12.033944 3.835500 C 11.850278 3.535930 11.415046 2.984138 11.166499 2.735743 C 10.917952 2.487349 10.365892 2.052457 10.066208 1.868975 C 9.766525 1.685494 9.128168 1.391552 8.793922 1.283131 C 8.459676 1.174710 7.770325 1.037975 7.420002 1.010610 C 7.069678 0.983244 6.367456 1.011278 6.020429 1.066482 C 5.673402 1.121686 4.997144 1.312938 4.672605 1.447659 C 4.348066 1.582380 3.735171 1.926273 3.451068 2.133060 C 3.166965 2.339847 2.651330 2.817363 2.423374 3.084780 C 2.195419 3.352196 1.805558 3.936927 1.646357 4.250185 C 1.487157 4.563443 1.244631 5.223052 1.162989 5.564826 C 1.081347 5.906601 0.999570 6.604608 1.000002 6.955999 Z" transform="scale(1.000000,1.000000) translate(123.001817,122.257078)" fill="#000000" opacity="1.000000"></path>
        </mask>
        <path d="M 115.821500 1.142100 L 121.367000 1.563800 L 126.831800 2.258300 L 132.209200 3.218800 L 137.492300 4.438200 L 142.674200 5.909900 L 147.748100 7.626800 L 152.707100 9.582200 L 157.544300 11.769200 L 162.252800 14.181000 L 166.825900 16.810600 L 171.256600 19.651100 L 175.538100 22.695900 L 179.663400 25.937800 L 183.625900 29.370200 L 187.418500 32.986200 L 191.034400 36.778800 L 194.466800 40.741200 L 197.708800 44.866600 L 200.753500 49.148100 L 203.594100 53.578800 L 206.223700 58.151900 L 208.635500 62.860400 L 210.822500 67.697600 L 212.777900 72.656600 L 214.494800 77.730400 L 215.966500 82.912400 L 217.185900 88.195400 L 218.146300 93.572800 L 218.840900 99.037700 L 219.262600 104.583100 L 219.404700 110.202300 L 219.262600 115.821600 L 218.840900 121.367200 L 218.146300 126.832200 L 217.185900 132.209700 L 215.966500 137.492900 L 214.494800 142.674900 L 212.777900 147.748800 L 210.822500 152.707800 L 208.635400 157.545000 L 206.223700 162.253600 L 203.594100 166.826600 L 200.753500 171.257300 L 197.708800 175.538800 L 194.466800 179.664100 L 191.034400 183.626500 L 187.418500 187.419100 L 183.625900 191.035000 L 179.663400 194.467400 L 175.538100 197.709300 L 171.256600 200.754000 L 166.825900 203.594500 L 162.252800 206.224000 L 157.544300 208.635700 L 152.707100 210.822600 L 147.748100 212.778000 L 142.674200 214.494900 L 137.492300 215.966500 L 132.209200 217.185900 L 126.831800 218.146300 L 121.367000 218.840800 L 115.821500 219.262500 L 110.202400 219.404600 L 104.583200 219.262500 L 99.037800 218.840800 L 93.572900 218.146300 L 88.195500 217.185900 L 82.912400 215.966400 L 77.730500 214.494800 L 72.656600 212.777800 L 67.697700 210.822400 L 62.860500 208.635400 L 58.151900 206.223700 L 53.578900 203.594100 L 49.148200 200.753500 L 44.866700 197.708800 L 40.741300 194.466800 L 36.778900 191.034400 L 32.986300 187.418400 L 29.370300 183.625800 L 25.937900 179.663400 L 22.695900 175.538000 L 19.651200 171.256500 L 16.810600 166.825800 L 14.181000 162.252700 L 11.769300 157.544200 L 9.582300 152.707000 L 7.626900 147.748000 L 5.909900 142.674200 L 4.438300 137.492300 L 3.218800 132.209200 L 2.258400 126.831800 L 1.563900 121.366900 L 1.142200 115.821500 L 1.000000 110.202300 L 1.142200 104.583100 L 1.563900 99.037700 L 2.258400 93.572800 L 3.218800 88.195400 L 4.438300 82.912400 L 5.909900 77.730400 L 7.626900 72.656600 L 9.582300 67.697600 L 11.769300 62.860400 L 14.181000 58.151900 L 16.810600 53.578800 L 19.651200 49.148100 L 22.695900 44.866600 L 25.937900 40.741200 L 29.370300 36.778800 L 32.986300 32.986200 L 36.778900 29.370200 L 40.741300 25.937800 L 44.866700 22.695900 L 49.148200 19.651100 L 53.578900 16.810500 L 58.151900 14.181000 L 62.860500 11.769200 L 67.697700 9.582200 L 72.656600 7.626800 L 77.730500 5.909900 L 82.912400 4.438200 L 88.195500 3.218800 L 93.572900 2.258300 L 99.037800 1.563800 L 104.583200 1.142100 L 110.202400 1.000000 Z M 130.105000 23.841500 L 126.761300 30.300500 L 133.385200 27.856200 L 137.501100 26.491800 L 141.345600 25.395500 L 144.486100 24.775700 L 145.657100 24.709600 L 146.489800 24.840800 L 147.085300 25.380100 L 147.581700 26.456200 L 147.981100 27.991700 L 148.285300 29.909200 L 148.615700 34.580700 L 148.588400 39.851300 L 148.218600 45.101800 L 147.521500 49.712700 L 147.055000 51.584900 L 146.512500 53.065000 L 145.895700 54.075600 L 145.206700 54.539200 L 144.325900 54.540900 L 143.168700 54.250200 L 140.208800 52.953100 L 136.694900 50.970300 L 132.994900 48.624700 L 126.508200 44.135000 L 125.552900 43.436800 L 125.101500 45.196800 L 124.780800 45.554100 L 124.170500 45.823100 L 122.252400 46.106600 L 119.689700 46.067600 L 119.115000 45.999200 L 117.577300 49.636700 L 115.246300 55.984400 L 113.287100 62.424500 L 111.823200 68.802200 L 111.315800 71.919400 L 110.978500 74.963100 L 110.827000 77.913800 L 110.876600 80.752300 L 111.142800 83.459200 L 111.548400 85.539700 L 111.560400 85.530200 L 113.590500 84.465700 L 117.009400 83.074100 L 121.471800 81.503300 L 126.632300 79.900800 L 132.145900 78.414300 L 137.667000 77.191400 L 142.850300 76.379900 L 145.207400 76.174500 L 147.350600 76.127400 L 151.674700 76.491400 L 156.336700 77.365200 L 161.024900 78.658400 L 165.427300 80.280600 L 169.231900 82.141300 L 170.812700 83.132800 L 172.127000 84.150100 L 173.136000 85.181700 L 173.800700 86.216500 L 174.082000 87.243100 L 173.941000 88.250200 L 173.397400 89.071300 L 172.508400 89.574000 L 171.295600 89.797500 L 169.781100 89.781600 L 165.933800 89.188900 L 161.141300 88.111800 L 155.578600 86.866000 L 149.420400 85.767500 L 146.172600 85.372200 L 142.841400 85.132200 L 139.448900 85.086900 L 136.016700 85.275800 L 131.429100 85.963900 L 129.508000 86.454000 L 127.823900 87.028900 L 126.368500 87.679100 L 125.133200 88.395100 L 124.109700 89.167400 L 123.289400 89.986600 L 122.663700 90.843000 L 122.224300 91.727400 L 121.962700 92.630100 L 121.870300 93.541700 L 121.938800 94.452700 L 122.159700 95.353700 L 123.024400 97.087400 L 123.771300 97.998700 L 124.593300 98.655500 L 125.492200 99.090400 L 126.470200 99.336200 L 128.671200 99.390900 L 131.212300 99.081400 L 134.109400 98.669200 L 137.378700 98.415900 L 141.036000 98.583000 L 143.015100 98.906000 L 145.097300 99.432200 L 154.270600 102.399100 L 163.782900 105.860600 L 172.267900 109.305600 L 175.698300 110.862200 L 178.359600 112.223100 L 180.547700 113.600400 L 182.030900 114.871900 L 182.879200 116.036400 L 183.162800 117.092700 L 182.951800 118.039700 L 182.316400 118.876100 L 181.326700 119.600700 L 180.052900 120.212400 L 178.565200 120.709900 L 176.933600 121.092000 L 173.519600 121.505500 L 170.372200 121.443200 L 169.073800 121.230600 L 168.052500 120.895600 L 165.820800 120.018400 L 162.727100 119.006900 L 154.987500 116.796400 L 141.581100 113.396100 L 142.160400 116.067700 L 142.452200 118.987000 L 142.465500 122.077400 L 142.218400 125.303800 L 141.728900 128.631400 L 141.015100 132.025100 L 140.095000 135.450100 L 138.986800 138.871400 L 137.708400 142.253900 L 136.278000 145.562900 L 134.713500 148.763300 L 133.033200 151.820100 L 131.255000 154.698500 L 129.397000 157.363400 L 127.477200 159.780000 L 125.513800 161.913300 L 124.139700 163.143800 L 122.606000 164.257800 L 120.926600 165.258300 L 119.115100 166.148100 L 115.151300 167.607800 L 110.824700 168.660200 L 108.840600 170.990800 L 106.317300 173.262500 L 103.242100 175.466600 L 99.602400 177.594400 L 95.797500 179.410000 L 91.809300 180.918800 L 87.675700 182.109000 L 83.435100 182.968900 L 79.125900 183.486900 L 74.786100 183.651100 L 70.454200 183.449800 L 66.168200 182.871500 L 66.255500 182.847300 L 65.717900 182.777200 L 64.286600 182.326200 L 62.928300 181.954400 L 65.350500 181.192200 L 69.034600 179.653800 L 72.620600 178.129900 L 71.286500 177.695300 L 68.230400 176.845800 L 67.225800 176.463500 L 66.543700 176.347600 L 65.291400 175.930500 L 64.717900 175.574900 L 64.191200 175.071700 L 63.315300 173.783500 L 62.738200 172.388200 L 62.534800 171.208100 L 66.120300 171.462800 L 70.052000 171.538000 L 74.203500 171.421700 L 78.448400 171.101900 L 82.660400 170.566600 L 86.713100 169.803700 L 89.962400 168.939000 L 86.906500 168.481900 L 82.367800 167.450700 L 78.256700 166.133300 L 74.701600 164.550900 L 74.094600 164.195700 L 72.902300 163.694200 L 70.634500 162.353700 L 68.533400 160.815000 L 66.601700 159.086400 L 64.842100 157.176500 L 63.257300 155.093700 L 61.849900 152.846400 L 60.622800 150.443100 L 59.578500 147.892100 L 58.719700 145.201900 L 58.049300 142.381000 L 57.569800 139.437700 L 57.283900 136.380600 L 57.194400 133.218000 L 57.303900 129.958400 L 57.615200 126.610100 L 58.130800 123.181800 L 62.381200 101.651700 L 68.858900 70.580100 L 80.575300 14.951400 L 80.654500 14.448500 L 80.411400 14.517500 L 75.756300 16.092800 L 71.206600 17.886800 L 66.768500 19.893300 L 62.448500 22.105900 L 58.252700 24.518500 L 54.187500 27.124600 L 50.259200 29.918000 L 46.474100 32.892400 L 42.838400 36.041500 L 39.358600 39.359000 L 36.040900 42.838600 L 32.891500 46.474000 L 29.916800 50.258900 L 27.123100 54.187000 L 24.516700 58.252000 L 22.103900 62.447600 L 19.891000 66.767500 L 17.884300 71.205500 L 16.090000 75.755200 L 14.514600 80.410300 L 13.164200 85.164600 L 12.045300 90.011600 L 11.164000 94.945200 L 10.526700 99.959100 L 10.139700 105.046900 L 10.009300 110.202300 L 10.139700 115.357700 L 10.526700 120.445500 L 11.164000 125.459400 L 12.045200 130.393000 L 13.164100 135.240100 L 14.514400 139.994300 L 16.089800 144.649400 L 17.884000 149.199100 L 19.890700 153.637100 L 22.103600 157.957000 L 24.516300 162.152600 L 27.122600 166.217700 L 29.916300 170.145800 L 32.890900 173.930600 L 36.040200 177.566000 L 39.357900 181.045600 L 42.837700 184.363100 L 46.473300 187.512200 L 50.258400 190.486600 L 54.186700 193.280000 L 58.251900 195.886100 L 62.447600 198.298700 L 66.767700 200.511400 L 71.205800 202.517800 L 75.755600 204.311800 L 80.410700 205.887100 L 85.165000 207.237300 L 90.012100 208.356100 L 94.945600 209.237200 L 99.959400 209.874400 L 105.047100 210.261300 L 110.202400 210.391700 L 115.357800 210.261300 L 120.445600 209.874400 L 125.459500 209.237200 L 130.393200 208.356100 L 135.240400 207.237400 L 139.994700 205.887200 L 144.649900 204.312000 L 149.199700 202.518100 L 153.637800 200.511700 L 157.957900 198.299100 L 162.153700 195.886600 L 166.218900 193.280500 L 170.147100 190.487100 L 173.932200 187.512800 L 177.567800 184.363800 L 181.047500 181.046300 L 184.365200 177.566800 L 187.514500 173.931400 L 190.489000 170.146500 L 193.282600 166.218500 L 195.888900 162.153400 L 198.301600 157.957800 L 200.514400 153.637900 L 202.521000 149.199900 L 204.315100 144.650100 L 205.890500 139.995000 L 207.240700 135.240700 L 208.359600 130.393500 L 209.240800 125.459800 L 209.878100 120.445800 L 210.265000 115.357900 L 210.395400 110.202300 L 210.265000 105.046900 L 209.878100 99.959100 L 209.240800 94.945200 L 208.359600 90.011600 L 207.240700 85.164600 L 205.890500 80.410300 L 204.315100 75.755200 L 202.521000 71.205500 L 200.514400 66.767500 L 198.301600 62.447600 L 195.888900 58.252000 L 193.282600 54.187000 L 190.489000 50.258900 L 187.514500 46.474000 L 184.365200 42.838600 L 181.047500 39.359000 L 177.567800 36.041500 L 173.932200 32.892400 L 170.147100 29.918000 L 166.218900 27.124600 L 162.153700 24.518500 L 157.957900 22.105900 L 153.637800 19.893300 L 149.199700 17.886800 L 144.649900 16.092800 L 139.994700 14.517500 L 135.528700 13.249300 Z" transform="scale(1.000000,1.000000) translate(-0.000100,-0.245200)" fill="#000000" opacity="1.000000"></path>
    </g>
</svg>