S222P01;1
S222P02;1
S222P03;1
S222P04;1
S222P05;1
S222P06;1
S222P07;1
S222P08;1
S222P09;1
S222P10;1
S222P11;1
S222P12;1
S222P13;1
S222P14;1
S222P15;1
S222P16;1
S222P17;1
S222P18;1
S222P19;1
S222P20;1
S222P21;1
S222P22;1
S224P01;2
S224P02;2
S224P03;2
S224P04;2
S224P05;2
S224P06;2
S224P07;2
S224P08;2
S224P09;2
S224P10;2
S224P11;2
S224P12;2
S224P13;2
S224P14;2
S224P15;2
S224P16;2
S224P17;2
S224P18;2
S224P19;2
S224P20;2
S224P21;2
S224P22;2
S227P01;3
S227P02;3
S227P03;3
S227P04;3
S227P05;3
S227P06;3
S227P07;3
S227P08;3
S227P09;3
S227P10;3
S227P11;3
S227P12;3
S227P13;3
S227P14;3
S227P15;3
S227P16;3
S227P17;3
S227P18;3
S227P19;3
S227P20;3
S227P21;3
S227P22;3
