1;1
2;1
3;1
4;1
5;1
6;1
7;1
8;1
9;1
10;1
11;1
12;1
13;1
14;1
15;1
16;1
17;1
18;1
19;1
20;1
21;1
22;1
23;1
24;1
25;1
26;1
27;1
28;1
29;1
30;1
31;1
32;1
33;1
34;1
35;1
36;1
37;1
38;1
39;1
40;1
41;1
42;1
43;1
2;4
3;3
4;4
5;4
7;4
9;3
10;3
11;3
12;3
13;3
14;4
15;3
16;3
17;4
18;4
19;4
20;4
22;3
23;3
24;4
26;3
27;3
28;3
29;4
30;4
31;4
33;4
34;4
37;4
38;4
41;3
42;4
43;3
