\babel@toc {portuguese}{}
\contentsline {chapter}{\numberline {1}Introdução}{2}{chapter.1}%
\contentsline {chapter}{\numberline {2}Modelação do Sistema}{3}{chapter.2}%
\contentsline {section}{\numberline {2.1}Visão Geral da Arquitetura}{3}{section.2.1}%
\contentsline {section}{\numberline {2.2}Casos de Uso}{4}{section.2.2}%
\contentsline {section}{\numberline {2.3}Diagrama E-R}{5}{section.2.3}%
\contentsline {section}{\numberline {2.4}Diagrama de Atividades 1: Screens na A\discretionary {-}{}{}plicação Móvel}{6}{section.2.4}%
\contentsline {section}{\numberline {2.5}Diagrama de Atividades 2: Interação entre Aplicação Móvel e fragmento Unity}{7}{section.2.5}%
\contentsline {section}{\numberline {2.6}Diagrama de Atividades 3: Resolução de Tarefa de Reportar Impostor}{8}{section.2.6}%
\contentsline {chapter}{\numberline {3}Conclusão}{9}{chapter.3}%
