Library\Bee\artifacts\movedfrom\UnityEngine.UI.ref.dll_12664940582929284107.movedfrom
Library\Bee\artifacts\movedfrom\UnityEngine.AccessibilityModule.dll_6828811877239063046.movedfrom
Library\Bee\artifacts\movedfrom\UnityEngine.AIModule.dll_9056835448087736212.movedfrom
Library\Bee\artifacts\movedfrom\UnityEngine.AndroidJNIModule.dll_8514470194260868946.movedfrom
Library\Bee\artifacts\movedfrom\UnityEngine.AnimationModule.dll_15814315362781065004.movedfrom
Library\Bee\artifacts\movedfrom\UnityEngine.ARModule.dll_3973051036977647197.movedfrom
Library\Bee\artifacts\movedfrom\UnityEngine.AssetBundleModule.dll_3883907348042114010.movedfrom
Library\Bee\artifacts\movedfrom\UnityEngine.AudioModule.dll_2631348757367170334.movedfrom
Library\Bee\artifacts\movedfrom\UnityEngine.ClothModule.dll_10046627776303596546.movedfrom
Library\Bee\artifacts\movedfrom\UnityEngine.CoreModule.dll_4041696285268358251.movedfrom
Library\Bee\artifacts\movedfrom\UnityEngine.CrashReportingModule.dll_3992177546064804067.movedfrom
Library\Bee\artifacts\movedfrom\UnityEngine.DirectorModule.dll_2787010010172376392.movedfrom
Library\Bee\artifacts\movedfrom\UnityEngine.dll_6142493363220490554.movedfrom
Library\Bee\artifacts\movedfrom\UnityEngine.DSPGraphModule.dll_3170204558993987177.movedfrom
Library\Bee\artifacts\movedfrom\UnityEngine.GameCenterModule.dll_11562644195916312643.movedfrom
Library\Bee\artifacts\movedfrom\UnityEngine.GIModule.dll_1579814489541203886.movedfrom
Library\Bee\artifacts\movedfrom\UnityEngine.GridModule.dll_1551517875733547618.movedfrom
Library\Bee\artifacts\movedfrom\UnityEngine.HotReloadModule.dll_6683476050649057966.movedfrom
Library\Bee\artifacts\movedfrom\UnityEngine.ImageConversionModule.dll_5163974006364818937.movedfrom
Library\Bee\artifacts\movedfrom\UnityEngine.IMGUIModule.dll_6693489410039265535.movedfrom
Library\Bee\artifacts\movedfrom\UnityEngine.InputLegacyModule.dll_14351710075146869195.movedfrom
Library\Bee\artifacts\movedfrom\UnityEngine.InputModule.dll_10014375482222528962.movedfrom
Library\Bee\artifacts\movedfrom\UnityEngine.JSONSerializeModule.dll_13752965720122647184.movedfrom
Library\Bee\artifacts\movedfrom\UnityEngine.LocalizationModule.dll_13911218707370565045.movedfrom
Library\Bee\artifacts\movedfrom\UnityEngine.ParticleSystemModule.dll_9978104993406600305.movedfrom
Library\Bee\artifacts\movedfrom\UnityEngine.PerformanceReportingModule.dll_13933427743488242730.movedfrom
Library\Bee\artifacts\movedfrom\UnityEngine.Physics2DModule.dll_2890655623883417281.movedfrom
Library\Bee\artifacts\movedfrom\UnityEngine.PhysicsModule.dll_10652347987236470703.movedfrom
Library\Bee\artifacts\movedfrom\UnityEngine.ProfilerModule.dll_6409655867102317653.movedfrom
Library\Bee\artifacts\movedfrom\UnityEngine.RuntimeInitializeOnLoadManagerInitializerModule.dll_16707252190018722186.movedfrom
Library\Bee\artifacts\movedfrom\UnityEngine.ScreenCaptureModule.dll_15619617077775896306.movedfrom
Library\Bee\artifacts\movedfrom\UnityEngine.SharedInternalsModule.dll_14680430580523845961.movedfrom
Library\Bee\artifacts\movedfrom\UnityEngine.SpriteMaskModule.dll_9917830395381056957.movedfrom
Library\Bee\artifacts\movedfrom\UnityEngine.SpriteShapeModule.dll_5712700139348859876.movedfrom
Library\Bee\artifacts\movedfrom\UnityEngine.StreamingModule.dll_10379857441639179882.movedfrom
Library\Bee\artifacts\movedfrom\UnityEngine.SubstanceModule.dll_7833938582320194680.movedfrom
Library\Bee\artifacts\movedfrom\UnityEngine.SubsystemsModule.dll_17604743104631041488.movedfrom
Library\Bee\artifacts\movedfrom\UnityEngine.TerrainModule.dll_12545684396554979485.movedfrom
Library\Bee\artifacts\movedfrom\UnityEngine.TerrainPhysicsModule.dll_10012630565180686078.movedfrom
Library\Bee\artifacts\movedfrom\UnityEngine.TextCoreModule.dll_13792351653750814040.movedfrom
Library\Bee\artifacts\movedfrom\UnityEngine.TextRenderingModule.dll_145092673503268583.movedfrom
Library\Bee\artifacts\movedfrom\UnityEngine.TilemapModule.dll_5555085679115823526.movedfrom
Library\Bee\artifacts\movedfrom\UnityEngine.TLSModule.dll_8163077972082560195.movedfrom
Library\Bee\artifacts\movedfrom\UnityEngine.UIElementsModule.dll_17910532028696537543.movedfrom
Library\Bee\artifacts\movedfrom\UnityEngine.UIElementsNativeModule.dll_17847535294190769854.movedfrom
Library\Bee\artifacts\movedfrom\UnityEngine.UIModule.dll_8729091017878697280.movedfrom
Library\Bee\artifacts\movedfrom\UnityEngine.UmbraModule.dll_11482237146504351889.movedfrom
Library\Bee\artifacts\movedfrom\UnityEngine.UNETModule.dll_14608908928285583844.movedfrom
Library\Bee\artifacts\movedfrom\UnityEngine.UnityAnalyticsModule.dll_12256768941358356077.movedfrom
Library\Bee\artifacts\movedfrom\UnityEngine.UnityConnectModule.dll_17331215157138528417.movedfrom
Library\Bee\artifacts\movedfrom\UnityEngine.UnityCurlModule.dll_1050567118059561241.movedfrom
Library\Bee\artifacts\movedfrom\UnityEngine.UnityTestProtocolModule.dll_10610789367109190151.movedfrom
Library\Bee\artifacts\movedfrom\UnityEngine.UnityWebRequestAssetBundleModule.dll_13423033805591560958.movedfrom
Library\Bee\artifacts\movedfrom\UnityEngine.UnityWebRequestAudioModule.dll_4132561269626191554.movedfrom
Library\Bee\artifacts\movedfrom\UnityEngine.UnityWebRequestModule.dll_6433716053216225400.movedfrom
Library\Bee\artifacts\movedfrom\UnityEngine.UnityWebRequestTextureModule.dll_6650869310145175767.movedfrom
Library\Bee\artifacts\movedfrom\UnityEngine.UnityWebRequestWWWModule.dll_18129924965802338067.movedfrom
Library\Bee\artifacts\movedfrom\UnityEngine.VehiclesModule.dll_11416744172073391331.movedfrom
Library\Bee\artifacts\movedfrom\UnityEngine.VFXModule.dll_17449105055578420784.movedfrom
Library\Bee\artifacts\movedfrom\UnityEngine.VideoModule.dll_5300158605626654915.movedfrom
Library\Bee\artifacts\movedfrom\UnityEngine.VRModule.dll_14696965829483887288.movedfrom
Library\Bee\artifacts\movedfrom\UnityEngine.WindModule.dll_12566688397208728276.movedfrom
Library\Bee\artifacts\movedfrom\UnityEngine.XRModule.dll_18353540201204893718.movedfrom