\relax 
\providecommand\hyper@newdestlabel[2]{}
\@nameuse{bbl@beforestart}
\catcode `"\active 
\providecommand\HyperFirstAtBeginDocument{\AtBeginDocument}
\HyperFirstAtBeginDocument{\ifx\hyper@anchor\@undefined
\global\let\oldcontentsline\contentsline
\gdef\contentsline#1#2#3#4{\oldcontentsline{#1}{#2}{#3}}
\global\let\oldnewlabel\newlabel
\gdef\newlabel#1#2{\newlabelxx{#1}#2}
\gdef\newlabelxx#1#2#3#4#5#6{\oldnewlabel{#1}{{#2}{#3}}}
\AtEndDocument{\ifx\hyper@anchor\@undefined
\let\contentsline\oldcontentsline
\let\newlabel\oldnewlabel
\fi}
\fi}
\global\let\hyper@last\relax 
\gdef\HyperFirstAtBeginDocument#1{#1}
\providecommand\HyField@AuxAddToFields[1]{}
\providecommand\HyField@AuxAddToCoFields[2]{}
\babel@aux{portuguese}{}
\providecommand*\caption@xref[2]{\@setref\relax\@undefined{#1}}
\newlabel{fig:logoUTAD}{{\caption@xref {fig:logoUTAD}{ on input line 36}}{1}{}{figure.caption.1}{}}
\@writefile{toc}{\contentsline {chapter}{\numberline {1}Introdução}{2}{chapter.1}\protected@file@percent }
\@writefile{lof}{\addvspace {10\p@ }}
\@writefile{lot}{\addvspace {10\p@ }}
\@writefile{toc}{\contentsline {chapter}{\numberline {2}Modelação do Sistema}{3}{chapter.2}\protected@file@percent }
\@writefile{lof}{\addvspace {10\p@ }}
\@writefile{lot}{\addvspace {10\p@ }}
\@writefile{toc}{\contentsline {section}{\numberline {2.1}Visão Geral da Arquitetura}{3}{section.2.1}\protected@file@percent }
\@writefile{lof}{\contentsline {figure}{\numberline {2.1}{\ignorespaces Diagrama que apresenta os vários microserviços que constituem o sistema.\relax }}{3}{figure.caption.3}\protected@file@percent }
\newlabel{fig:microservices}{{2.1}{3}{Diagrama que apresenta os vários microserviços que constituem o sistema.\relax }{figure.caption.3}{}}
\@writefile{toc}{\contentsline {section}{\numberline {2.2}Casos de Uso}{4}{section.2.2}\protected@file@percent }
\@writefile{lof}{\contentsline {figure}{\numberline {2.2}{\ignorespaces Diagrama de Casos de Uso.\relax }}{4}{figure.caption.4}\protected@file@percent }
\newlabel{fig:diagUseCases}{{2.2}{4}{Diagrama de Casos de Uso.\relax }{figure.caption.4}{}}
\@writefile{toc}{\contentsline {section}{\numberline {2.3}Diagrama E-R}{5}{section.2.3}\protected@file@percent }
\@writefile{lof}{\contentsline {figure}{\numberline {2.3}{\ignorespaces Diagrama E-R que apresenta as relações entre as entidades na base de dados.\relax }}{5}{figure.caption.5}\protected@file@percent }
\newlabel{fig:diagER}{{2.3}{5}{Diagrama E-R que apresenta as relações entre as entidades na base de dados.\relax }{figure.caption.5}{}}
\@writefile{toc}{\contentsline {section}{\numberline {2.4}Diagrama de Atividades 1: Screens na A\discretionary {-}{}{}plicação Móvel}{6}{section.2.4}\protected@file@percent }
\@writefile{lof}{\contentsline {figure}{\numberline {2.4}{\ignorespaces Diagrama de Atividades que modela o fluxo geral dentro da aplicação móvel.\relax }}{6}{figure.caption.6}\protected@file@percent }
\newlabel{fig:diagAct1}{{2.4}{6}{Diagrama de Atividades que modela o fluxo geral dentro da aplicação móvel.\relax }{figure.caption.6}{}}
\@writefile{toc}{\contentsline {section}{\numberline {2.5}Diagrama de Atividades 2: Interação entre Aplicação Móvel e fragmento Unity}{7}{section.2.5}\protected@file@percent }
\@writefile{lof}{\contentsline {figure}{\numberline {2.5}{\ignorespaces Diagrama de Atividades que modela o fluxo da interação entre a aplicação Android e o fragmento Unity.\relax }}{7}{figure.caption.7}\protected@file@percent }
\newlabel{fig:diagAct2}{{2.5}{7}{Diagrama de Atividades que modela o fluxo da interação entre a aplicação Android e o fragmento Unity.\relax }{figure.caption.7}{}}
\@writefile{toc}{\contentsline {section}{\numberline {2.6}Diagrama de Atividades 3: Resolução de Tarefa de Reportar Impostor}{8}{section.2.6}\protected@file@percent }
\@writefile{lof}{\contentsline {figure}{\numberline {2.6}{\ignorespaces Diagrama de Atividades que modela o fluxo durante a resolução de uma tarefa de reportar um impostor (tarefa de escolha múltipla).\relax }}{8}{figure.caption.8}\protected@file@percent }
\newlabel{fig:diagAct3}{{2.6}{8}{Diagrama de Atividades que modela o fluxo durante a resolução de uma tarefa de reportar um impostor (tarefa de escolha múltipla).\relax }{figure.caption.8}{}}
\@writefile{toc}{\contentsline {chapter}{\numberline {3}Conclusão}{9}{chapter.3}\protected@file@percent }
\@writefile{lof}{\addvspace {10\p@ }}
\@writefile{lot}{\addvspace {10\p@ }}
