// Jest Snapshot v1, https://goo.gl/fbAQLP

exports[`TempltFavoritesComponent Debe hacer match con el snapshot 1`] = `
<div
  id="root1"
>
  <header
    class="header"
  >
    <app-o-header />
  </header>
  <main
    class="main"
  >
    <b
      class="main__b"
    >
      Cargando....
    </b>
    
    
    <app-o-nav-bar />
  </main>
</div>
`;
