%YAML 1.1
%TAG !u! tag:unity3d.com,2011:
--- !u!74 &7400000
AnimationClip:
  m_ObjectHideFlags: 0
  m_CorrespondingSourceObject: {fileID: 0}
  m_PrefabInstance: {fileID: 0}
  m_PrefabAsset: {fileID: 0}
  m_Name: Pause Animation
  serializedVersion: 7
  m_Legacy: 0
  m_Compressed: 0
  m_UseHighQualityCurve: 1
  m_RotationCurves: []
  m_CompressedRotationCurves: []
  m_EulerCurves: []
  m_PositionCurves: []
  m_ScaleCurves: []
  m_FloatCurves: []
  m_PPtrCurves:
  - serializedVersion: 2
    curve:
    - time: 0
      value: {fileID: 21300000, guid: 38e5fc93ec4a8cb49ab3e96e47fce8f0, type: 3}
    - time: 0.083333336
      value: {fileID: 21300000, guid: 015608e0573cc8447ab0acd788308646, type: 3}
    - time: 0.16666667
      value: {fileID: 21300000, guid: 29db8956164f92c4eab1dc48bfbfadcf, type: 3}
    - time: 0.25
      value: {fileID: 21300000, guid: ada36b80e4e17324ca21950edb007198, type: 3}
    - time: 0.33333334
      value: {fileID: 21300000, guid: c08cf7f7d174f4e4fb213439a8a5e11c, type: 3}
    - time: 0.41666666
      value: {fileID: 21300000, guid: 7a69823deec7a7048b73bc0dc5a9b307, type: 3}
    - time: 0.5
      value: {fileID: 21300000, guid: 1d1c4185533a8134a9f10cc48079692e, type: 3}
    - time: 0.5833333
      value: {fileID: 21300000, guid: 503039aa548355b4799751829aabfb83, type: 3}
    - time: 0.6666667
      value: {fileID: 21300000, guid: b4c97ad12d99bf84187ea025840bcf2a, type: 3}
    - time: 0.75
      value: {fileID: 21300000, guid: dec096d691b4ece4ca707ebe7c6b06b3, type: 3}
    - time: 0.8333333
      value: {fileID: 21300000, guid: 50a4f05d6226b484d94c3080bfd66b4a, type: 3}
    - time: 0.9166667
      value: {fileID: 21300000, guid: 490d295704390384fa9f40cce66bb6fc, type: 3}
    - time: 1
      value: {fileID: 21300000, guid: 3a85230dd12bc9449acbd3bee0f6a378, type: 3}
    - time: 1.0833334
      value: {fileID: 21300000, guid: 51828677da390eb408d0dbd9f712461e, type: 3}
    - time: 1.1666666
      value: {fileID: 21300000, guid: acddfc4156d30d94487023090a4b0b3e, type: 3}
    - time: 1.25
      value: {fileID: 21300000, guid: e1050dce85df34b4c8d8c219c8d5f12d, type: 3}
    - time: 1.3333334
      value: {fileID: 21300000, guid: 6c41231cc9e3398438bddb2465aaae98, type: 3}
    - time: 1.4166666
      value: {fileID: 21300000, guid: 82179d288ee44dc40a663cf2b8295e3c, type: 3}
    - time: 1.5
      value: {fileID: 21300000, guid: 2bfea4cc1ec5d5d41871b2584d51bab5, type: 3}
    - time: 1.5833334
      value: {fileID: 21300000, guid: 3f51202d6f2af7840a34eb70f721470f, type: 3}
    attribute: m_Sprite
    path: 
    classID: 212
    script: {fileID: 0}
    flags: 2
  m_SampleRate: 12
  m_WrapMode: 0
  m_Bounds:
    m_Center: {x: 0, y: 0, z: 0}
    m_Extent: {x: 0, y: 0, z: 0}
  m_ClipBindingConstant:
    genericBindings:
    - serializedVersion: 2
      path: 0
      attribute: 0
      script: {fileID: 0}
      typeID: 212
      customType: 23
      isPPtrCurve: 1
      isIntCurve: 0
      isSerializeReferenceCurve: 0
    pptrCurveMapping:
    - {fileID: 21300000, guid: 38e5fc93ec4a8cb49ab3e96e47fce8f0, type: 3}
    - {fileID: 21300000, guid: 015608e0573cc8447ab0acd788308646, type: 3}
    - {fileID: 21300000, guid: 29db8956164f92c4eab1dc48bfbfadcf, type: 3}
    - {fileID: 21300000, guid: ada36b80e4e17324ca21950edb007198, type: 3}
    - {fileID: 21300000, guid: c08cf7f7d174f4e4fb213439a8a5e11c, type: 3}
    - {fileID: 21300000, guid: 7a69823deec7a7048b73bc0dc5a9b307, type: 3}
    - {fileID: 21300000, guid: 1d1c4185533a8134a9f10cc48079692e, type: 3}
    - {fileID: 21300000, guid: 503039aa548355b4799751829aabfb83, type: 3}
    - {fileID: 21300000, guid: b4c97ad12d99bf84187ea025840bcf2a, type: 3}
    - {fileID: 21300000, guid: dec096d691b4ece4ca707ebe7c6b06b3, type: 3}
    - {fileID: 21300000, guid: 50a4f05d6226b484d94c3080bfd66b4a, type: 3}
    - {fileID: 21300000, guid: 490d295704390384fa9f40cce66bb6fc, type: 3}
    - {fileID: 21300000, guid: 3a85230dd12bc9449acbd3bee0f6a378, type: 3}
    - {fileID: 21300000, guid: 51828677da390eb408d0dbd9f712461e, type: 3}
    - {fileID: 21300000, guid: acddfc4156d30d94487023090a4b0b3e, type: 3}
    - {fileID: 21300000, guid: e1050dce85df34b4c8d8c219c8d5f12d, type: 3}
    - {fileID: 21300000, guid: 6c41231cc9e3398438bddb2465aaae98, type: 3}
    - {fileID: 21300000, guid: 82179d288ee44dc40a663cf2b8295e3c, type: 3}
    - {fileID: 21300000, guid: 2bfea4cc1ec5d5d41871b2584d51bab5, type: 3}
    - {fileID: 21300000, guid: 3f51202d6f2af7840a34eb70f721470f, type: 3}
  m_AnimationClipSettings:
    serializedVersion: 2
    m_AdditiveReferencePoseClip: {fileID: 0}
    m_AdditiveReferencePoseTime: 0
    m_StartTime: 0
    m_StopTime: 1.6666667
    m_OrientationOffsetY: 0
    m_Level: 0
    m_CycleOffset: 0
    m_HasAdditiveReferencePose: 0
    m_LoopTime: 1
    m_LoopBlend: 0
    m_LoopBlendOrientation: 0
    m_LoopBlendPositionY: 0
    m_LoopBlendPositionXZ: 0
    m_KeepOriginalOrientation: 0
    m_KeepOriginalPositionY: 1
    m_KeepOriginalPositionXZ: 0
    m_HeightFromFeet: 0
    m_Mirror: 0
  m_EditorCurves: []
  m_EulerEditorCurves: []
  m_HasGenericRootTransform: 0
  m_HasMotionFloatCurves: 0
  m_Events: []
