%YAML 1.1
%TAG !u! tag:unity3d.com,2011:
--- !u!1 &103832
GameObject:
  m_ObjectHideFlags: 0
  m_CorrespondingSourceObject: {fileID: 0}
  m_PrefabInstance: {fileID: 0}
  m_PrefabAsset: {fileID: 0}
  serializedVersion: 6
  m_Component:
  - component: {fileID: 453448}
  m_Layer: 0
  m_Name: UpperMouth2
  m_TagString: Untagged
  m_Icon: {fileID: 0}
  m_NavMeshLayer: 0
  m_StaticEditorFlags: 0
  m_IsActive: 1
--- !u!4 &453448
Transform:
  m_ObjectHideFlags: 0
  m_CorrespondingSourceObject: {fileID: 0}
  m_PrefabInstance: {fileID: 0}
  m_PrefabAsset: {fileID: 0}
  m_GameObject: {fileID: 103832}
  serializedVersion: 2
  m_LocalRotation: {x: 0.032367058, y: -0.70636564, z: 0.032367058, w: 0.70636564}
  m_LocalPosition: {x: -51.337505, y: 0.090556875, z: 6.215433e-15}
  m_LocalScale: {x: 1, y: 1, z: 1}
  m_ConstrainProportionsScale: 0
  m_Children: []
  m_Father: {fileID: 446006}
  m_LocalEulerAnglesHint: {x: 0, y: 0, z: 0}
--- !u!1 &109822
GameObject:
  m_ObjectHideFlags: 0
  m_CorrespondingSourceObject: {fileID: 0}
  m_PrefabInstance: {fileID: 0}
  m_PrefabAsset: {fileID: 0}
  serializedVersion: 6
  m_Component:
  - component: {fileID: 496788}
  m_Layer: 0
  m_Name: L_Feet
  m_TagString: Untagged
  m_Icon: {fileID: 0}
  m_NavMeshLayer: 0
  m_StaticEditorFlags: 0
  m_IsActive: 1
--- !u!4 &496788
Transform:
  m_ObjectHideFlags: 0
  m_CorrespondingSourceObject: {fileID: 0}
  m_PrefabInstance: {fileID: 0}
  m_PrefabAsset: {fileID: 0}
  m_GameObject: {fileID: 109822}
  serializedVersion: 2
  m_LocalRotation: {x: 0.35342586, y: 0.35147986, z: -0.5801505, w: 0.64418745}
  m_LocalPosition: {x: -35.19601, y: 0, z: 2.842171e-14}
  m_LocalScale: {x: 1, y: 1, z: 1}
  m_ConstrainProportionsScale: 0
  m_Children:
  - {fileID: 410952}
  m_Father: {fileID: 414172}
  m_LocalEulerAnglesHint: {x: 0, y: 0, z: 0}
--- !u!1 &111110
GameObject:
  m_ObjectHideFlags: 0
  m_CorrespondingSourceObject: {fileID: 0}
  m_PrefabInstance: {fileID: 0}
  m_PrefabAsset: {fileID: 0}
  serializedVersion: 6
  m_Component:
  - component: {fileID: 448578}
  m_Layer: 0
  m_Name: R_LowerEye
  m_TagString: Untagged
  m_Icon: {fileID: 0}
  m_NavMeshLayer: 0
  m_StaticEditorFlags: 0
  m_IsActive: 1
--- !u!4 &448578
Transform:
  m_ObjectHideFlags: 0
  m_CorrespondingSourceObject: {fileID: 0}
  m_PrefabInstance: {fileID: 0}
  m_PrefabAsset: {fileID: 0}
  m_GameObject: {fileID: 111110}
  serializedVersion: 2
  m_LocalRotation: {x: 0.70636564, y: 0.032367058, z: 0.70636564, w: -0.032367058}
  m_LocalPosition: {x: -3.2674363, y: -2.3338573, z: 33.4895}
  m_LocalScale: {x: 1, y: 1, z: 1}
  m_ConstrainProportionsScale: 0
  m_Children: []
  m_Father: {fileID: 446006}
  m_LocalEulerAnglesHint: {x: 0, y: 0, z: 0}
--- !u!1 &111694
GameObject:
  m_ObjectHideFlags: 0
  m_CorrespondingSourceObject: {fileID: 0}
  m_PrefabInstance: {fileID: 0}
  m_PrefabAsset: {fileID: 0}
  serializedVersion: 6
  m_Component:
  - component: {fileID: 414172}
  m_Layer: 0
  m_Name: L_LowerLeg
  m_TagString: Untagged
  m_Icon: {fileID: 0}
  m_NavMeshLayer: 0
  m_StaticEditorFlags: 0
  m_IsActive: 1
--- !u!4 &414172
Transform:
  m_ObjectHideFlags: 0
  m_CorrespondingSourceObject: {fileID: 0}
  m_PrefabInstance: {fileID: 0}
  m_PrefabAsset: {fileID: 0}
  m_GameObject: {fileID: 111694}
  serializedVersion: 2
  m_LocalRotation: {x: 0.5816576, y: 0.25232828, z: 0.26021886, w: 0.72821087}
  m_LocalPosition: {x: -66.21609, y: 1.4210855e-14, z: 7.1054274e-15}
  m_LocalScale: {x: 1, y: 1, z: 1}
  m_ConstrainProportionsScale: 0
  m_Children:
  - {fileID: 496788}
  m_Father: {fileID: 464360}
  m_LocalEulerAnglesHint: {x: 0, y: 0, z: 0}
--- !u!1 &112866
GameObject:
  m_ObjectHideFlags: 0
  m_CorrespondingSourceObject: {fileID: 0}
  m_PrefabInstance: {fileID: 0}
  m_PrefabAsset: {fileID: 0}
  serializedVersion: 6
  m_Component:
  - component: {fileID: 469486}
  m_Layer: 0
  m_Name: Root_CTRL
  m_TagString: Untagged
  m_Icon: {fileID: 0}
  m_NavMeshLayer: 0
  m_StaticEditorFlags: 0
  m_IsActive: 1
--- !u!4 &469486
Transform:
  m_ObjectHideFlags: 0
  m_CorrespondingSourceObject: {fileID: 0}
  m_PrefabInstance: {fileID: 0}
  m_PrefabAsset: {fileID: 0}
  m_GameObject: {fileID: 112866}
  serializedVersion: 2
  m_LocalRotation: {x: 0, y: 0, z: 0, w: 1}
  m_LocalPosition: {x: 0, y: 1.681398, z: -0.56901985}
  m_LocalScale: {x: 0.01, y: 0.01, z: 0.01}
  m_ConstrainProportionsScale: 0
  m_Children: []
  m_Father: {fileID: 409254}
  m_LocalEulerAnglesHint: {x: 0, y: 0, z: 0}
--- !u!1 &116866
GameObject:
  m_ObjectHideFlags: 0
  m_CorrespondingSourceObject: {fileID: 0}
  m_PrefabInstance: {fileID: 0}
  m_PrefabAsset: {fileID: 0}
  serializedVersion: 6
  m_Component:
  - component: {fileID: 494902}
  m_Layer: 0
  m_Name: R_Horn2
  m_TagString: Untagged
  m_Icon: {fileID: 0}
  m_NavMeshLayer: 0
  m_StaticEditorFlags: 0
  m_IsActive: 1
--- !u!4 &494902
Transform:
  m_ObjectHideFlags: 0
  m_CorrespondingSourceObject: {fileID: 0}
  m_PrefabInstance: {fileID: 0}
  m_PrefabAsset: {fileID: 0}
  m_GameObject: {fileID: 116866}
  serializedVersion: 2
  m_LocalRotation: {x: 0.18299374, y: 0.13578305, z: 0.9736732, w: -0.006065499}
  m_LocalPosition: {x: -69.88794, y: 0, z: 1.4210855e-14}
  m_LocalScale: {x: 1, y: 1, z: 1}
  m_ConstrainProportionsScale: 0
  m_Children: []
  m_Father: {fileID: 436476}
  m_LocalEulerAnglesHint: {x: 0, y: 0, z: 0}
--- !u!1 &125348
GameObject:
  m_ObjectHideFlags: 0
  m_CorrespondingSourceObject: {fileID: 0}
  m_PrefabInstance: {fileID: 0}
  m_PrefabAsset: {fileID: 0}
  serializedVersion: 6
  m_Component:
  - component: {fileID: 472844}
  m_Layer: 0
  m_Name: R_RowerReg
  m_TagString: Untagged
  m_Icon: {fileID: 0}
  m_NavMeshLayer: 0
  m_StaticEditorFlags: 0
  m_IsActive: 1
--- !u!4 &472844
Transform:
  m_ObjectHideFlags: 0
  m_CorrespondingSourceObject: {fileID: 0}
  m_PrefabInstance: {fileID: 0}
  m_PrefabAsset: {fileID: 0}
  m_GameObject: {fileID: 125348}
  serializedVersion: 2
  m_LocalRotation: {x: 0.72819996, y: 0.26021546, z: 0.25233355, w: 0.58167046}
  m_LocalPosition: {x: -66.216064, y: -1.4210855e-14, z: -2.842171e-14}
  m_LocalScale: {x: 1, y: 1, z: 1}
  m_ConstrainProportionsScale: 0
  m_Children:
  - {fileID: 426616}
  m_Father: {fileID: 431474}
  m_LocalEulerAnglesHint: {x: 0, y: 0, z: 0}
--- !u!1 &126858
GameObject:
  m_ObjectHideFlags: 0
  m_CorrespondingSourceObject: {fileID: 0}
  m_PrefabInstance: {fileID: 0}
  m_PrefabAsset: {fileID: 0}
  serializedVersion: 6
  m_Component:
  - component: {fileID: 470392}
  m_Layer: 0
  m_Name: Jaw2
  m_TagString: Untagged
  m_Icon: {fileID: 0}
  m_NavMeshLayer: 0
  m_StaticEditorFlags: 0
  m_IsActive: 1
--- !u!4 &470392
Transform:
  m_ObjectHideFlags: 0
  m_CorrespondingSourceObject: {fileID: 0}
  m_PrefabInstance: {fileID: 0}
  m_PrefabAsset: {fileID: 0}
  m_GameObject: {fileID: 126858}
  serializedVersion: 2
  m_LocalRotation: {x: 0, y: 0, z: -0.4093078, w: 0.9123964}
  m_LocalPosition: {x: -61.337563, y: 0, z: 1.3619675e-14}
  m_LocalScale: {x: 1, y: 1, z: 1}
  m_ConstrainProportionsScale: 0
  m_Children:
  - {fileID: 483742}
  m_Father: {fileID: 407004}
  m_LocalEulerAnglesHint: {x: 0, y: 0, z: 0}
--- !u!1 &129660
GameObject:
  m_ObjectHideFlags: 0
  m_CorrespondingSourceObject: {fileID: 0}
  m_PrefabInstance: {fileID: 0}
  m_PrefabAsset: {fileID: 0}
  serializedVersion: 6
  m_Component:
  - component: {fileID: 452676}
  m_Layer: 0
  m_Name: Spine1
  m_TagString: Untagged
  m_Icon: {fileID: 0}
  m_NavMeshLayer: 0
  m_StaticEditorFlags: 0
  m_IsActive: 1
--- !u!4 &452676
Transform:
  m_ObjectHideFlags: 0
  m_CorrespondingSourceObject: {fileID: 0}
  m_PrefabInstance: {fileID: 0}
  m_PrefabAsset: {fileID: 0}
  m_GameObject: {fileID: 129660}
  serializedVersion: 2
  m_LocalRotation: {x: -1.3877788e-17, y: -7.2858386e-17, z: 0.14483942, w: 0.98945516}
  m_LocalPosition: {x: -94.41445, y: 8.526513e-14, z: 4.7331654e-30}
  m_LocalScale: {x: 1, y: 1, z: 1}
  m_ConstrainProportionsScale: 0
  m_Children:
  - {fileID: 496230}
  m_Father: {fileID: 481878}
  m_LocalEulerAnglesHint: {x: 0, y: 0, z: 0}
--- !u!1 &131336
GameObject:
  m_ObjectHideFlags: 0
  m_CorrespondingSourceObject: {fileID: 0}
  m_PrefabInstance: {fileID: 0}
  m_PrefabAsset: {fileID: 0}
  serializedVersion: 6
  m_Component:
  - component: {fileID: 451736}
  m_Layer: 0
  m_Name: Tongue2
  m_TagString: Untagged
  m_Icon: {fileID: 0}
  m_NavMeshLayer: 0
  m_StaticEditorFlags: 0
  m_IsActive: 1
--- !u!4 &451736
Transform:
  m_ObjectHideFlags: 0
  m_CorrespondingSourceObject: {fileID: 0}
  m_PrefabInstance: {fileID: 0}
  m_PrefabAsset: {fileID: 0}
  m_GameObject: {fileID: 131336}
  serializedVersion: 2
  m_LocalRotation: {x: 0, y: 0, z: -0.014510794, w: 0.99989474}
  m_LocalPosition: {x: -37.610462, y: -2.3874236e-12, z: -3.427547e-16}
  m_LocalScale: {x: 1, y: 1, z: 1}
  m_ConstrainProportionsScale: 0
  m_Children:
  - {fileID: 496274}
  m_Father: {fileID: 471164}
  m_LocalEulerAnglesHint: {x: 0, y: 0, z: 0}
--- !u!1 &135022
GameObject:
  m_ObjectHideFlags: 0
  m_CorrespondingSourceObject: {fileID: 0}
  m_PrefabInstance: {fileID: 0}
  m_PrefabAsset: {fileID: 0}
  serializedVersion: 6
  m_Component:
  - component: {fileID: 465848}
  m_Layer: 0
  m_Name: L_UpperArm
  m_TagString: Untagged
  m_Icon: {fileID: 0}
  m_NavMeshLayer: 0
  m_StaticEditorFlags: 0
  m_IsActive: 1
--- !u!4 &465848
Transform:
  m_ObjectHideFlags: 0
  m_CorrespondingSourceObject: {fileID: 0}
  m_PrefabInstance: {fileID: 0}
  m_PrefabAsset: {fileID: 0}
  m_GameObject: {fileID: 135022}
  serializedVersion: 2
  m_LocalRotation: {x: 0.49176103, y: 0.6622767, z: -0.32587248, w: -0.46191755}
  m_LocalPosition: {x: 5.3608994, y: -68.16634, z: -63.230366}
  m_LocalScale: {x: 1, y: 1, z: 1}
  m_ConstrainProportionsScale: 0
  m_Children:
  - {fileID: 483630}
  m_Father: {fileID: 496230}
  m_LocalEulerAnglesHint: {x: 0, y: 0, z: 0}
--- !u!1 &137670
GameObject:
  m_ObjectHideFlags: 0
  m_CorrespondingSourceObject: {fileID: 0}
  m_PrefabInstance: {fileID: 0}
  m_PrefabAsset: {fileID: 0}
  serializedVersion: 6
  m_Component:
  - component: {fileID: 446006}
  m_Layer: 0
  m_Name: UpperMouth1
  m_TagString: Untagged
  m_Icon: {fileID: 0}
  m_NavMeshLayer: 0
  m_StaticEditorFlags: 0
  m_IsActive: 1
--- !u!4 &446006
Transform:
  m_ObjectHideFlags: 0
  m_CorrespondingSourceObject: {fileID: 0}
  m_PrefabInstance: {fileID: 0}
  m_PrefabAsset: {fileID: 0}
  m_GameObject: {fileID: 137670}
  serializedVersion: 2
  m_LocalRotation: {x: 0, y: 0, z: 0.01710504, w: 0.99985373}
  m_LocalPosition: {x: -67.29943, y: 8.526513e-14, z: 6.9598694e-15}
  m_LocalScale: {x: 1, y: 1, z: 1}
  m_ConstrainProportionsScale: 0
  m_Children:
  - {fileID: 480404}
  - {fileID: 444946}
  - {fileID: 448578}
  - {fileID: 404984}
  - {fileID: 453448}
  m_Father: {fileID: 441258}
  m_LocalEulerAnglesHint: {x: 0, y: 0, z: 0}
--- !u!1 &143586
GameObject:
  m_ObjectHideFlags: 0
  m_CorrespondingSourceObject: {fileID: 0}
  m_PrefabInstance: {fileID: 0}
  m_PrefabAsset: {fileID: 0}
  serializedVersion: 6
  m_Component:
  - component: {fileID: 464360}
  m_Layer: 0
  m_Name: L_UpperLeg
  m_TagString: Untagged
  m_Icon: {fileID: 0}
  m_NavMeshLayer: 0
  m_StaticEditorFlags: 0
  m_IsActive: 1
--- !u!4 &464360
Transform:
  m_ObjectHideFlags: 0
  m_CorrespondingSourceObject: {fileID: 0}
  m_PrefabInstance: {fileID: 0}
  m_PrefabAsset: {fileID: 0}
  m_GameObject: {fileID: 143586}
  serializedVersion: 2
  m_LocalRotation: {x: 0.18168405, y: 0.95422834, z: -0.1486704, w: -0.1853006}
  m_LocalPosition: {x: 34.79974, y: -63.647976, z: -70.98306}
  m_LocalScale: {x: 1, y: 1, z: 1}
  m_ConstrainProportionsScale: 0
  m_Children:
  - {fileID: 414172}
  m_Father: {fileID: 481878}
  m_LocalEulerAnglesHint: {x: 0, y: 0, z: 0}
--- !u!1 &144602
GameObject:
  m_ObjectHideFlags: 0
  m_CorrespondingSourceObject: {fileID: 0}
  m_PrefabInstance: {fileID: 0}
  m_PrefabAsset: {fileID: 0}
  serializedVersion: 6
  m_Component:
  - component: {fileID: 407004}
  m_Layer: 0
  m_Name: Jaw1
  m_TagString: Untagged
  m_Icon: {fileID: 0}
  m_NavMeshLayer: 0
  m_StaticEditorFlags: 0
  m_IsActive: 1
--- !u!4 &407004
Transform:
  m_ObjectHideFlags: 0
  m_CorrespondingSourceObject: {fileID: 0}
  m_PrefabInstance: {fileID: 0}
  m_PrefabAsset: {fileID: 0}
  m_GameObject: {fileID: 144602}
  serializedVersion: 2
  m_LocalRotation: {x: 0, y: 0, z: 0.31757584, w: 0.9482329}
  m_LocalPosition: {x: -13.065828, y: -43.754913, z: 1.1300551e-14}
  m_LocalScale: {x: 1, y: 1, z: 1}
  m_ConstrainProportionsScale: 0
  m_Children:
  - {fileID: 470392}
  m_Father: {fileID: 441258}
  m_LocalEulerAnglesHint: {x: 0, y: 0, z: 0}
--- !u!1 &146944
GameObject:
  m_ObjectHideFlags: 0
  m_CorrespondingSourceObject: {fileID: 0}
  m_PrefabInstance: {fileID: 0}
  m_PrefabAsset: {fileID: 0}
  serializedVersion: 6
  m_Component:
  - component: {fileID: 426616}
  m_Layer: 0
  m_Name: R_Feet
  m_TagString: Untagged
  m_Icon: {fileID: 0}
  m_NavMeshLayer: 0
  m_StaticEditorFlags: 0
  m_IsActive: 1
--- !u!4 &426616
Transform:
  m_ObjectHideFlags: 0
  m_CorrespondingSourceObject: {fileID: 0}
  m_PrefabInstance: {fileID: 0}
  m_PrefabAsset: {fileID: 0}
  m_GameObject: {fileID: 146944}
  serializedVersion: 2
  m_LocalRotation: {x: 0.6373578, y: 0.5881441, z: -0.33885095, w: 0.36474892}
  m_LocalPosition: {x: -35.196022, y: 2.842171e-14, z: 1.4210855e-14}
  m_LocalScale: {x: 1, y: 1, z: 1}
  m_ConstrainProportionsScale: 0
  m_Children:
  - {fileID: 459844}
  m_Father: {fileID: 472844}
  m_LocalEulerAnglesHint: {x: 0, y: 0, z: 0}
--- !u!1 &148128
GameObject:
  m_ObjectHideFlags: 0
  m_CorrespondingSourceObject: {fileID: 0}
  m_PrefabInstance: {fileID: 0}
  m_PrefabAsset: {fileID: 0}
  serializedVersion: 6
  m_Component:
  - component: {fileID: 480404}
  m_Layer: 0
  m_Name: L_LowerEye
  m_TagString: Untagged
  m_Icon: {fileID: 0}
  m_NavMeshLayer: 0
  m_StaticEditorFlags: 0
  m_IsActive: 1
--- !u!4 &480404
Transform:
  m_ObjectHideFlags: 0
  m_CorrespondingSourceObject: {fileID: 0}
  m_PrefabInstance: {fileID: 0}
  m_PrefabAsset: {fileID: 0}
  m_GameObject: {fileID: 148128}
  serializedVersion: 2
  m_LocalRotation: {x: 0.032367058, y: -0.70636564, z: 0.032367058, w: 0.70636564}
  m_LocalPosition: {x: -3.2676337, y: -2.3336165, z: -33.489536}
  m_LocalScale: {x: 1, y: 1, z: 1}
  m_ConstrainProportionsScale: 0
  m_Children: []
  m_Father: {fileID: 446006}
  m_LocalEulerAnglesHint: {x: 0, y: 0, z: 0}
--- !u!1 &148452
GameObject:
  m_ObjectHideFlags: 0
  m_CorrespondingSourceObject: {fileID: 0}
  m_PrefabInstance: {fileID: 0}
  m_PrefabAsset: {fileID: 0}
  serializedVersion: 6
  m_Component:
  - component: {fileID: 496274}
  m_Layer: 0
  m_Name: Tongue3
  m_TagString: Untagged
  m_Icon: {fileID: 0}
  m_NavMeshLayer: 0
  m_StaticEditorFlags: 0
  m_IsActive: 1
--- !u!4 &496274
Transform:
  m_ObjectHideFlags: 0
  m_CorrespondingSourceObject: {fileID: 0}
  m_PrefabInstance: {fileID: 0}
  m_PrefabAsset: {fileID: 0}
  m_GameObject: {fileID: 148452}
  serializedVersion: 2
  m_LocalRotation: {x: -0.030805, y: -0.7064355, z: -0.030805, w: 0.7064355}
  m_LocalPosition: {x: -40.45182, y: 2.842171e-14, z: 7.984626e-17}
  m_LocalScale: {x: 1, y: 1, z: 1}
  m_ConstrainProportionsScale: 0
  m_Children: []
  m_Father: {fileID: 451736}
  m_LocalEulerAnglesHint: {x: 0, y: 0, z: 0}
--- !u!1 &149572
GameObject:
  m_ObjectHideFlags: 0
  m_CorrespondingSourceObject: {fileID: 0}
  m_PrefabInstance: {fileID: 0}
  m_PrefabAsset: {fileID: 0}
  serializedVersion: 6
  m_Component:
  - component: {fileID: 419572}
  m_Layer: 0
  m_Name: joint6
  m_TagString: Untagged
  m_Icon: {fileID: 0}
  m_NavMeshLayer: 0
  m_StaticEditorFlags: 0
  m_IsActive: 1
--- !u!4 &419572
Transform:
  m_ObjectHideFlags: 0
  m_CorrespondingSourceObject: {fileID: 0}
  m_PrefabInstance: {fileID: 0}
  m_PrefabAsset: {fileID: 0}
  m_GameObject: {fileID: 149572}
  serializedVersion: 2
  m_LocalRotation: {x: 0.026641626, y: 0.06834257, z: -0.10330912, w: 0.9919409}
  m_LocalPosition: {x: -78.75991, y: -2.842171e-14, z: -1.7488213e-14}
  m_LocalScale: {x: 1, y: 1, z: 1}
  m_ConstrainProportionsScale: 0
  m_Children:
  - {fileID: 429800}
  m_Father: {fileID: 472502}
  m_LocalEulerAnglesHint: {x: 0, y: 0, z: 0}
--- !u!1 &157978
GameObject:
  m_ObjectHideFlags: 0
  m_CorrespondingSourceObject: {fileID: 0}
  m_PrefabInstance: {fileID: 0}
  m_PrefabAsset: {fileID: 0}
  serializedVersion: 6
  m_Component:
  - component: {fileID: 436476}
  m_Layer: 0
  m_Name: R_Horn1
  m_TagString: Untagged
  m_Icon: {fileID: 0}
  m_NavMeshLayer: 0
  m_StaticEditorFlags: 0
  m_IsActive: 1
--- !u!4 &436476
Transform:
  m_ObjectHideFlags: 0
  m_CorrespondingSourceObject: {fileID: 0}
  m_PrefabInstance: {fileID: 0}
  m_PrefabAsset: {fileID: 0}
  m_GameObject: {fileID: 157978}
  serializedVersion: 2
  m_LocalRotation: {x: -0.3215745, y: 0.9190572, z: -0.063415974, w: 0.21886559}
  m_LocalPosition: {x: -2.9659271, y: 44.251667, z: 24.7896}
  m_LocalScale: {x: 1, y: 1, z: 1}
  m_ConstrainProportionsScale: 0
  m_Children:
  - {fileID: 494902}
  m_Father: {fileID: 441258}
  m_LocalEulerAnglesHint: {x: 0, y: 0, z: 0}
--- !u!1 &158954
GameObject:
  m_ObjectHideFlags: 0
  m_CorrespondingSourceObject: {fileID: 0}
  m_PrefabInstance: {fileID: 0}
  m_PrefabAsset: {fileID: 0}
  serializedVersion: 6
  m_Component:
  - component: {fileID: 446582}
  m_Layer: 0
  m_Name: L_Fingers
  m_TagString: Untagged
  m_Icon: {fileID: 0}
  m_NavMeshLayer: 0
  m_StaticEditorFlags: 0
  m_IsActive: 1
--- !u!4 &446582
Transform:
  m_ObjectHideFlags: 0
  m_CorrespondingSourceObject: {fileID: 0}
  m_PrefabInstance: {fileID: 0}
  m_PrefabAsset: {fileID: 0}
  m_GameObject: {fileID: 158954}
  serializedVersion: 2
  m_LocalRotation: {x: -0.025879458, y: -0.6546004, z: -0.029846447, w: 0.75494224}
  m_LocalPosition: {x: -36.333042, y: -2.842171e-14, z: 1.4210855e-14}
  m_LocalScale: {x: 1, y: 1, z: 1}
  m_ConstrainProportionsScale: 0
  m_Children: []
  m_Father: {fileID: 471746}
  m_LocalEulerAnglesHint: {x: 0, y: 0, z: 0}
--- !u!1 &159900
GameObject:
  m_ObjectHideFlags: 0
  m_CorrespondingSourceObject: {fileID: 0}
  m_PrefabInstance: {fileID: 0}
  m_PrefabAsset: {fileID: 0}
  serializedVersion: 6
  m_Component:
  - component: {fileID: 472502}
  m_Layer: 0
  m_Name: joint5
  m_TagString: Untagged
  m_Icon: {fileID: 0}
  m_NavMeshLayer: 0
  m_StaticEditorFlags: 0
  m_IsActive: 1
--- !u!4 &472502
Transform:
  m_ObjectHideFlags: 0
  m_CorrespondingSourceObject: {fileID: 0}
  m_PrefabInstance: {fileID: 0}
  m_PrefabAsset: {fileID: 0}
  m_GameObject: {fileID: 159900}
  serializedVersion: 2
  m_LocalRotation: {x: -0.009193904, y: 0.9972436, z: -0.03497816, w: -0.06478642}
  m_LocalPosition: {x: 80.14654, y: -14.499245, z: 3.621914e-15}
  m_LocalScale: {x: 1, y: 1, z: 1}
  m_ConstrainProportionsScale: 0
  m_Children:
  - {fileID: 419572}
  m_Father: {fileID: 481878}
  m_LocalEulerAnglesHint: {x: 0, y: 0, z: 0}
--- !u!1 &162656
GameObject:
  m_ObjectHideFlags: 0
  m_CorrespondingSourceObject: {fileID: 0}
  m_PrefabInstance: {fileID: 0}
  m_PrefabAsset: {fileID: 0}
  serializedVersion: 6
  m_Component:
  - component: {fileID: 444946}
  m_Layer: 0
  m_Name: L_UpperEye
  m_TagString: Untagged
  m_Icon: {fileID: 0}
  m_NavMeshLayer: 0
  m_StaticEditorFlags: 0
  m_IsActive: 1
--- !u!4 &444946
Transform:
  m_ObjectHideFlags: 0
  m_CorrespondingSourceObject: {fileID: 0}
  m_PrefabInstance: {fileID: 0}
  m_PrefabAsset: {fileID: 0}
  m_GameObject: {fileID: 162656}
  serializedVersion: 2
  m_LocalRotation: {x: 0.032367058, y: -0.70636564, z: 0.032367058, w: 0.70636564}
  m_LocalPosition: {x: -9.351012, y: 14.503892, z: -28.283401}
  m_LocalScale: {x: 1, y: 1, z: 1}
  m_ConstrainProportionsScale: 0
  m_Children: []
  m_Father: {fileID: 446006}
  m_LocalEulerAnglesHint: {x: 0, y: 0, z: 0}
--- !u!1 &163778
GameObject:
  m_ObjectHideFlags: 0
  m_CorrespondingSourceObject: {fileID: 0}
  m_PrefabInstance: {fileID: 0}
  m_PrefabAsset: {fileID: 0}
  serializedVersion: 6
  m_Component:
  - component: {fileID: 428792}
  m_Layer: 0
  m_Name: R_Fingers
  m_TagString: Untagged
  m_Icon: {fileID: 0}
  m_NavMeshLayer: 0
  m_StaticEditorFlags: 0
  m_IsActive: 1
--- !u!4 &428792
Transform:
  m_ObjectHideFlags: 0
  m_CorrespondingSourceObject: {fileID: 0}
  m_PrefabInstance: {fileID: 0}
  m_PrefabAsset: {fileID: 0}
  m_GameObject: {fileID: 163778}
  serializedVersion: 2
  m_LocalRotation: {x: 0.65459895, y: -0.025878487, z: 0.75494355, w: 0.029845444}
  m_LocalPosition: {x: -36.333668, y: 3.5527137e-15, z: 1.4210855e-14}
  m_LocalScale: {x: 1, y: 1, z: 1}
  m_ConstrainProportionsScale: 0
  m_Children: []
  m_Father: {fileID: 477292}
  m_LocalEulerAnglesHint: {x: 0, y: 0, z: 0}
--- !u!1 &164670
GameObject:
  m_ObjectHideFlags: 0
  m_CorrespondingSourceObject: {fileID: 0}
  m_PrefabInstance: {fileID: 0}
  m_PrefabAsset: {fileID: 0}
  serializedVersion: 6
  m_Component:
  - component: {fileID: 496230}
  m_Layer: 0
  m_Name: Chest
  m_TagString: Untagged
  m_Icon: {fileID: 0}
  m_NavMeshLayer: 0
  m_StaticEditorFlags: 0
  m_IsActive: 1
--- !u!4 &496230
Transform:
  m_ObjectHideFlags: 0
  m_CorrespondingSourceObject: {fileID: 0}
  m_PrefabInstance: {fileID: 0}
  m_PrefabAsset: {fileID: 0}
  m_GameObject: {fileID: 164670}
  serializedVersion: 2
  m_LocalRotation: {x: -6.2450045e-17, y: -6.2775306e-17, z: 0.11130045, w: 0.9937868}
  m_LocalPosition: {x: -93.45327, y: 8.526513e-14, z: 6.7464595e-15}
  m_LocalScale: {x: 1, y: 1, z: 1}
  m_ConstrainProportionsScale: 0
  m_Children:
  - {fileID: 441258}
  - {fileID: 465848}
  - {fileID: 484430}
  m_Father: {fileID: 452676}
  m_LocalEulerAnglesHint: {x: 0, y: 0, z: 0}
--- !u!1 &165830
GameObject:
  m_ObjectHideFlags: 0
  m_CorrespondingSourceObject: {fileID: 0}
  m_PrefabInstance: {fileID: 0}
  m_PrefabAsset: {fileID: 0}
  serializedVersion: 6
  m_Component:
  - component: {fileID: 429800}
  m_Layer: 0
  m_Name: joint7
  m_TagString: Untagged
  m_Icon: {fileID: 0}
  m_NavMeshLayer: 0
  m_StaticEditorFlags: 0
  m_IsActive: 1
--- !u!4 &429800
Transform:
  m_ObjectHideFlags: 0
  m_CorrespondingSourceObject: {fileID: 0}
  m_PrefabInstance: {fileID: 0}
  m_PrefabAsset: {fileID: 0}
  m_GameObject: {fileID: 165830}
  serializedVersion: 2
  m_LocalRotation: {x: 0.01300189, y: 0.07204615, z: -0.07814534, w: 0.9942503}
  m_LocalPosition: {x: -78.00609, y: 5.684342e-14, z: -1.874224e-14}
  m_LocalScale: {x: 1, y: 1, z: 1}
  m_ConstrainProportionsScale: 0
  m_Children:
  - {fileID: 424020}
  m_Father: {fileID: 419572}
  m_LocalEulerAnglesHint: {x: 0, y: 0, z: 0}
--- !u!1 &168754
GameObject:
  m_ObjectHideFlags: 0
  m_CorrespondingSourceObject: {fileID: 0}
  m_PrefabInstance: {fileID: 0}
  m_PrefabAsset: {fileID: 0}
  serializedVersion: 6
  m_Component:
  - component: {fileID: 406596}
  m_Layer: 0
  m_Name: L_Horn2
  m_TagString: Untagged
  m_Icon: {fileID: 0}
  m_NavMeshLayer: 0
  m_StaticEditorFlags: 0
  m_IsActive: 1
--- !u!4 &406596
Transform:
  m_ObjectHideFlags: 0
  m_CorrespondingSourceObject: {fileID: 0}
  m_PrefabInstance: {fileID: 0}
  m_PrefabAsset: {fileID: 0}
  m_GameObject: {fileID: 168754}
  serializedVersion: 2
  m_LocalRotation: {x: 0.13578254, y: -0.18299435, z: 0.0060621784, w: 0.97367316}
  m_LocalPosition: {x: -69.88746, y: 0, z: 0}
  m_LocalScale: {x: 1, y: 1, z: 1}
  m_ConstrainProportionsScale: 0
  m_Children: []
  m_Father: {fileID: 451512}
  m_LocalEulerAnglesHint: {x: 0, y: 0, z: 0}
--- !u!1 &175794
GameObject:
  m_ObjectHideFlags: 0
  m_CorrespondingSourceObject: {fileID: 0}
  m_PrefabInstance: {fileID: 0}
  m_PrefabAsset: {fileID: 0}
  serializedVersion: 6
  m_Component:
  - component: {fileID: 410952}
  m_Layer: 0
  m_Name: L_Toes
  m_TagString: Untagged
  m_Icon: {fileID: 0}
  m_NavMeshLayer: 0
  m_StaticEditorFlags: 0
  m_IsActive: 1
--- !u!4 &410952
Transform:
  m_ObjectHideFlags: 0
  m_CorrespondingSourceObject: {fileID: 0}
  m_PrefabInstance: {fileID: 0}
  m_PrefabAsset: {fileID: 0}
  m_GameObject: {fileID: 175794}
  serializedVersion: 2
  m_LocalRotation: {x: -0.005962262, y: -0.6163785, z: -0.007616472, w: 0.78739065}
  m_LocalPosition: {x: -41.618404, y: 1.9539925e-14, z: 0}
  m_LocalScale: {x: 1, y: 1, z: 1}
  m_ConstrainProportionsScale: 0
  m_Children: []
  m_Father: {fileID: 496788}
  m_LocalEulerAnglesHint: {x: 0, y: 0, z: 0}
--- !u!1 &175954
GameObject:
  m_ObjectHideFlags: 0
  m_CorrespondingSourceObject: {fileID: 0}
  m_PrefabInstance: {fileID: 0}
  m_PrefabAsset: {fileID: 0}
  serializedVersion: 6
  m_Component:
  - component: {fileID: 431474}
  m_Layer: 0
  m_Name: R_UpperReg
  m_TagString: Untagged
  m_Icon: {fileID: 0}
  m_NavMeshLayer: 0
  m_StaticEditorFlags: 0
  m_IsActive: 1
--- !u!4 &431474
Transform:
  m_ObjectHideFlags: 0
  m_CorrespondingSourceObject: {fileID: 0}
  m_PrefabInstance: {fileID: 0}
  m_PrefabAsset: {fileID: 0}
  m_GameObject: {fileID: 175954}
  serializedVersion: 2
  m_LocalRotation: {x: 0.18132263, y: 0.953821, z: 0.15057784, w: 0.18620941}
  m_LocalPosition: {x: 34.79974, y: -63.648003, z: 70.9831}
  m_LocalScale: {x: 1, y: 1, z: 1}
  m_ConstrainProportionsScale: 0
  m_Children:
  - {fileID: 472844}
  m_Father: {fileID: 481878}
  m_LocalEulerAnglesHint: {x: 0, y: 0, z: 0}
--- !u!1 &177494
GameObject:
  m_ObjectHideFlags: 0
  m_CorrespondingSourceObject: {fileID: 0}
  m_PrefabInstance: {fileID: 0}
  m_PrefabAsset: {fileID: 0}
  serializedVersion: 6
  m_Component:
  - component: {fileID: 471164}
  m_Layer: 0
  m_Name: Tongue1
  m_TagString: Untagged
  m_Icon: {fileID: 0}
  m_NavMeshLayer: 0
  m_StaticEditorFlags: 0
  m_IsActive: 1
--- !u!4 &471164
Transform:
  m_ObjectHideFlags: 0
  m_CorrespondingSourceObject: {fileID: 0}
  m_PrefabInstance: {fileID: 0}
  m_PrefabAsset: {fileID: 0}
  m_GameObject: {fileID: 177494}
  serializedVersion: 2
  m_LocalRotation: {x: 0, y: 0, z: -0.04641976, w: 0.99892205}
  m_LocalPosition: {x: -43.30238, y: -42.433662, z: -1.7339784e-14}
  m_LocalScale: {x: 1, y: 1, z: 1}
  m_ConstrainProportionsScale: 0
  m_Children:
  - {fileID: 451736}
  m_Father: {fileID: 441258}
  m_LocalEulerAnglesHint: {x: 0, y: 0, z: 0}
--- !u!1 &177538
GameObject:
  m_ObjectHideFlags: 0
  m_CorrespondingSourceObject: {fileID: 0}
  m_PrefabInstance: {fileID: 0}
  m_PrefabAsset: {fileID: 0}
  serializedVersion: 6
  m_Component:
  - component: {fileID: 409254}
  - component: {fileID: 9562442}
  m_Layer: 0
  m_Name: RedBoarPBR
  m_TagString: Untagged
  m_Icon: {fileID: 0}
  m_NavMeshLayer: 0
  m_StaticEditorFlags: 0
  m_IsActive: 1
--- !u!4 &409254
Transform:
  m_ObjectHideFlags: 0
  m_CorrespondingSourceObject: {fileID: 0}
  m_PrefabInstance: {fileID: 0}
  m_PrefabAsset: {fileID: 0}
  m_GameObject: {fileID: 177538}
  serializedVersion: 2
  m_LocalRotation: {x: 0, y: 0, z: 0, w: 1}
  m_LocalPosition: {x: 0, y: 0, z: 0}
  m_LocalScale: {x: 1, y: 1, z: 1}
  m_ConstrainProportionsScale: 0
  m_Children:
  - {fileID: 460602}
  - {fileID: 481878}
  - {fileID: 469486}
  m_Father: {fileID: 0}
  m_LocalEulerAnglesHint: {x: 0, y: 0, z: 0}
--- !u!95 &9562442
Animator:
  serializedVersion: 5
  m_ObjectHideFlags: 0
  m_CorrespondingSourceObject: {fileID: 0}
  m_PrefabInstance: {fileID: 0}
  m_PrefabAsset: {fileID: 0}
  m_GameObject: {fileID: 177538}
  m_Enabled: 1
  m_Avatar: {fileID: 9000000, guid: 5c658df0d8d544b4c860c0ad70993a2a, type: 3}
  m_Controller: {fileID: 9100000, guid: 08f6634017a8e784a8807f193b72bec9, type: 2}
  m_CullingMode: 1
  m_UpdateMode: 0
  m_ApplyRootMotion: 0
  m_LinearVelocityBlending: 0
  m_StabilizeFeet: 0
  m_WarningMessage: 
  m_HasTransformHierarchy: 1
  m_AllowConstantClipSamplingOptimization: 1
  m_KeepAnimatorStateOnDisable: 0
  m_WriteDefaultValuesOnDisable: 0
--- !u!1 &178406
GameObject:
  m_ObjectHideFlags: 0
  m_CorrespondingSourceObject: {fileID: 0}
  m_PrefabInstance: {fileID: 0}
  m_PrefabAsset: {fileID: 0}
  serializedVersion: 6
  m_Component:
  - component: {fileID: 477292}
  m_Layer: 0
  m_Name: R_Hand
  m_TagString: Untagged
  m_Icon: {fileID: 0}
  m_NavMeshLayer: 0
  m_StaticEditorFlags: 0
  m_IsActive: 1
--- !u!4 &477292
Transform:
  m_ObjectHideFlags: 0
  m_CorrespondingSourceObject: {fileID: 0}
  m_PrefabInstance: {fileID: 0}
  m_PrefabAsset: {fileID: 0}
  m_GameObject: {fileID: 178406}
  serializedVersion: 2
  m_LocalRotation: {x: -0.105987795, y: -0.15490973, z: -0.47370988, w: 0.86044675}
  m_LocalPosition: {x: -61.12191, y: 0, z: 3.907985e-14}
  m_LocalScale: {x: 1, y: 1, z: 1}
  m_ConstrainProportionsScale: 0
  m_Children:
  - {fileID: 428792}
  m_Father: {fileID: 438520}
  m_LocalEulerAnglesHint: {x: 0, y: 0, z: 0}
--- !u!1 &180496
GameObject:
  m_ObjectHideFlags: 0
  m_CorrespondingSourceObject: {fileID: 0}
  m_PrefabInstance: {fileID: 0}
  m_PrefabAsset: {fileID: 0}
  serializedVersion: 6
  m_Component:
  - component: {fileID: 424020}
  m_Layer: 0
  m_Name: joint8
  m_TagString: Untagged
  m_Icon: {fileID: 0}
  m_NavMeshLayer: 0
  m_StaticEditorFlags: 0
  m_IsActive: 1
--- !u!4 &424020
Transform:
  m_ObjectHideFlags: 0
  m_CorrespondingSourceObject: {fileID: 0}
  m_PrefabInstance: {fileID: 0}
  m_PrefabAsset: {fileID: 0}
  m_GameObject: {fileID: 180496}
  serializedVersion: 2
  m_LocalRotation: {x: 0.03295829, y: 0.7063383, z: -0.03295829, w: 0.7063383}
  m_LocalPosition: {x: -87.18551, y: 4.2632564e-14, z: -2.1542774e-14}
  m_LocalScale: {x: 1, y: 1, z: 1}
  m_ConstrainProportionsScale: 0
  m_Children: []
  m_Father: {fileID: 429800}
  m_LocalEulerAnglesHint: {x: 0, y: 0, z: 0}
--- !u!1 &181724
GameObject:
  m_ObjectHideFlags: 0
  m_CorrespondingSourceObject: {fileID: 0}
  m_PrefabInstance: {fileID: 0}
  m_PrefabAsset: {fileID: 0}
  serializedVersion: 6
  m_Component:
  - component: {fileID: 471746}
  m_Layer: 0
  m_Name: L_Hand
  m_TagString: Untagged
  m_Icon: {fileID: 0}
  m_NavMeshLayer: 0
  m_StaticEditorFlags: 0
  m_IsActive: 1
--- !u!4 &471746
Transform:
  m_ObjectHideFlags: 0
  m_CorrespondingSourceObject: {fileID: 0}
  m_PrefabInstance: {fileID: 0}
  m_PrefabAsset: {fileID: 0}
  m_GameObject: {fileID: 181724}
  serializedVersion: 2
  m_LocalRotation: {x: 0.07804854, y: 0.17327933, z: -0.46709192, w: 0.86354375}
  m_LocalPosition: {x: -61.12222, y: 0, z: -1.4210855e-14}
  m_LocalScale: {x: 1, y: 1, z: 1}
  m_ConstrainProportionsScale: 0
  m_Children:
  - {fileID: 446582}
  m_Father: {fileID: 483630}
  m_LocalEulerAnglesHint: {x: 0, y: 0, z: 0}
--- !u!1 &185214
GameObject:
  m_ObjectHideFlags: 0
  m_CorrespondingSourceObject: {fileID: 0}
  m_PrefabInstance: {fileID: 0}
  m_PrefabAsset: {fileID: 0}
  serializedVersion: 6
  m_Component:
  - component: {fileID: 451512}
  m_Layer: 0
  m_Name: L_Horn1
  m_TagString: Untagged
  m_Icon: {fileID: 0}
  m_NavMeshLayer: 0
  m_StaticEditorFlags: 0
  m_IsActive: 1
--- !u!4 &451512
Transform:
  m_ObjectHideFlags: 0
  m_CorrespondingSourceObject: {fileID: 0}
  m_PrefabInstance: {fileID: 0}
  m_PrefabAsset: {fileID: 0}
  m_GameObject: {fileID: 185214}
  serializedVersion: 2
  m_LocalRotation: {x: -0.32130086, y: 0.91915286, z: 0.06335087, w: -0.21888466}
  m_LocalPosition: {x: -2.9658153, y: 44.251938, z: -24.789577}
  m_LocalScale: {x: 1, y: 1, z: 1}
  m_ConstrainProportionsScale: 0
  m_Children:
  - {fileID: 406596}
  m_Father: {fileID: 441258}
  m_LocalEulerAnglesHint: {x: 0, y: 0, z: 0}
--- !u!1 &187342
GameObject:
  m_ObjectHideFlags: 0
  m_CorrespondingSourceObject: {fileID: 0}
  m_PrefabInstance: {fileID: 0}
  m_PrefabAsset: {fileID: 0}
  serializedVersion: 6
  m_Component:
  - component: {fileID: 459844}
  m_Layer: 0
  m_Name: R_Toes
  m_TagString: Untagged
  m_Icon: {fileID: 0}
  m_NavMeshLayer: 0
  m_StaticEditorFlags: 0
  m_IsActive: 1
--- !u!4 &459844
Transform:
  m_ObjectHideFlags: 0
  m_CorrespondingSourceObject: {fileID: 0}
  m_PrefabInstance: {fileID: 0}
  m_PrefabAsset: {fileID: 0}
  m_GameObject: {fileID: 187342}
  serializedVersion: 2
  m_LocalRotation: {x: 0.6163759, y: -0.0059622503, z: 0.78739256, w: 0.007616508}
  m_LocalPosition: {x: -41.618374, y: 1.4210855e-14, z: 1.4210855e-14}
  m_LocalScale: {x: 1, y: 1, z: 1}
  m_ConstrainProportionsScale: 0
  m_Children: []
  m_Father: {fileID: 426616}
  m_LocalEulerAnglesHint: {x: 0, y: 0, z: 0}
--- !u!1 &187420
GameObject:
  m_ObjectHideFlags: 0
  m_CorrespondingSourceObject: {fileID: 0}
  m_PrefabInstance: {fileID: 0}
  m_PrefabAsset: {fileID: 0}
  serializedVersion: 6
  m_Component:
  - component: {fileID: 483742}
  m_Layer: 0
  m_Name: Jaw3
  m_TagString: Untagged
  m_Icon: {fileID: 0}
  m_NavMeshLayer: 0
  m_StaticEditorFlags: 0
  m_IsActive: 1
--- !u!4 &483742
Transform:
  m_ObjectHideFlags: 0
  m_CorrespondingSourceObject: {fileID: 0}
  m_PrefabInstance: {fileID: 0}
  m_PrefabAsset: {fileID: 0}
  m_GameObject: {fileID: 187420}
  serializedVersion: 2
  m_LocalRotation: {x: -0.17086771, y: -0.68615174, z: -0.17086771, w: 0.68615174}
  m_LocalPosition: {x: -73.25123, y: 3.4224534, z: 2.0172078e-14}
  m_LocalScale: {x: 1, y: 1, z: 1}
  m_ConstrainProportionsScale: 0
  m_Children: []
  m_Father: {fileID: 470392}
  m_LocalEulerAnglesHint: {x: 0, y: 0, z: 0}
--- !u!1 &189116
GameObject:
  m_ObjectHideFlags: 0
  m_CorrespondingSourceObject: {fileID: 0}
  m_PrefabInstance: {fileID: 0}
  m_PrefabAsset: {fileID: 0}
  serializedVersion: 6
  m_Component:
  - component: {fileID: 404984}
  m_Layer: 0
  m_Name: R_UpperEye
  m_TagString: Untagged
  m_Icon: {fileID: 0}
  m_NavMeshLayer: 0
  m_StaticEditorFlags: 0
  m_IsActive: 1
--- !u!4 &404984
Transform:
  m_ObjectHideFlags: 0
  m_CorrespondingSourceObject: {fileID: 0}
  m_PrefabInstance: {fileID: 0}
  m_PrefabAsset: {fileID: 0}
  m_GameObject: {fileID: 189116}
  serializedVersion: 2
  m_LocalRotation: {x: 0.70636564, y: 0.032367058, z: 0.70636564, w: -0.032367058}
  m_LocalPosition: {x: -9.350816, y: 14.504367, z: 28.2834}
  m_LocalScale: {x: 1, y: 1, z: 1}
  m_ConstrainProportionsScale: 0
  m_Children: []
  m_Father: {fileID: 446006}
  m_LocalEulerAnglesHint: {x: 0, y: 0, z: 0}
--- !u!1 &190154
GameObject:
  m_ObjectHideFlags: 0
  m_CorrespondingSourceObject: {fileID: 0}
  m_PrefabInstance: {fileID: 0}
  m_PrefabAsset: {fileID: 0}
  serializedVersion: 6
  m_Component:
  - component: {fileID: 483630}
  m_Layer: 0
  m_Name: L_LowerArm
  m_TagString: Untagged
  m_Icon: {fileID: 0}
  m_NavMeshLayer: 0
  m_StaticEditorFlags: 0
  m_IsActive: 1
--- !u!4 &483630
Transform:
  m_ObjectHideFlags: 0
  m_CorrespondingSourceObject: {fileID: 0}
  m_PrefabInstance: {fileID: 0}
  m_PrefabAsset: {fileID: 0}
  m_GameObject: {fileID: 190154}
  serializedVersion: 2
  m_LocalRotation: {x: 0.5962722, y: 0.26014256, z: -0.062312976, w: 0.7569032}
  m_LocalPosition: {x: -98.02088, y: 4.2632564e-14, z: 2.842171e-14}
  m_LocalScale: {x: 1, y: 1, z: 1}
  m_ConstrainProportionsScale: 0
  m_Children:
  - {fileID: 471746}
  m_Father: {fileID: 465848}
  m_LocalEulerAnglesHint: {x: 0, y: 0, z: 0}
--- !u!1 &190160
GameObject:
  m_ObjectHideFlags: 0
  m_CorrespondingSourceObject: {fileID: 0}
  m_PrefabInstance: {fileID: 0}
  m_PrefabAsset: {fileID: 0}
  serializedVersion: 6
  m_Component:
  - component: {fileID: 460602}
  - component: {fileID: 13751620}
  m_Layer: 0
  m_Name: DragonBoar
  m_TagString: Untagged
  m_Icon: {fileID: 0}
  m_NavMeshLayer: 0
  m_StaticEditorFlags: 0
  m_IsActive: 1
--- !u!4 &460602
Transform:
  m_ObjectHideFlags: 0
  m_CorrespondingSourceObject: {fileID: 0}
  m_PrefabInstance: {fileID: 0}
  m_PrefabAsset: {fileID: 0}
  m_GameObject: {fileID: 190160}
  serializedVersion: 2
  m_LocalRotation: {x: 0, y: 0, z: 0, w: 1}
  m_LocalPosition: {x: 112.28471, y: -19.06134, z: -167.88983}
  m_LocalScale: {x: 0.01, y: 0.01, z: 0.01}
  m_ConstrainProportionsScale: 0
  m_Children: []
  m_Father: {fileID: 409254}
  m_LocalEulerAnglesHint: {x: 0, y: 0, z: 0}
--- !u!137 &13751620
SkinnedMeshRenderer:
  m_ObjectHideFlags: 0
  m_CorrespondingSourceObject: {fileID: 0}
  m_PrefabInstance: {fileID: 0}
  m_PrefabAsset: {fileID: 0}
  m_GameObject: {fileID: 190160}
  m_Enabled: 1
  m_CastShadows: 1
  m_ReceiveShadows: 1
  m_DynamicOccludee: 1
  m_StaticShadowCaster: 0
  m_MotionVectors: 1
  m_LightProbeUsage: 1
  m_ReflectionProbeUsage: 1
  m_RayTracingMode: 3
  m_RayTraceProcedural: 0
  m_RenderingLayerMask: 1
  m_RendererPriority: 0
  m_Materials:
  - {fileID: 2100000, guid: 73c9ddefc022e2c4d8dc53890b1738b0, type: 2}
  m_StaticBatchInfo:
    firstSubMesh: 0
    subMeshCount: 0
  m_StaticBatchRoot: {fileID: 0}
  m_ProbeAnchor: {fileID: 0}
  m_LightProbeVolumeOverride: {fileID: 0}
  m_ScaleInLightmap: 1
  m_ReceiveGI: 1
  m_PreserveUVs: 0
  m_IgnoreNormalsForChartDetection: 0
  m_ImportantGI: 0
  m_StitchLightmapSeams: 1
  m_SelectedEditorRenderState: 3
  m_MinimumChartSize: 4
  m_AutoUVMaxDistance: 0.5
  m_AutoUVMaxAngle: 89
  m_LightmapParameters: {fileID: 0}
  m_SortingLayerID: 0
  m_SortingLayer: 0
  m_SortingOrder: 0
  serializedVersion: 2
  m_Quality: 0
  m_UpdateWhenOffscreen: 0
  m_SkinnedMotionVectors: 1
  m_Mesh: {fileID: 4300000, guid: 5c658df0d8d544b4c860c0ad70993a2a, type: 3}
  m_Bones:
  - {fileID: 481878}
  - {fileID: 452676}
  - {fileID: 496230}
  - {fileID: 441258}
  - {fileID: 446006}
  - {fileID: 453448}
  - {fileID: 444946}
  - {fileID: 480404}
  - {fileID: 404984}
  - {fileID: 448578}
  - {fileID: 407004}
  - {fileID: 470392}
  - {fileID: 483742}
  - {fileID: 451512}
  - {fileID: 406596}
  - {fileID: 471164}
  - {fileID: 451736}
  - {fileID: 496274}
  - {fileID: 436476}
  - {fileID: 494902}
  - {fileID: 465848}
  - {fileID: 483630}
  - {fileID: 471746}
  - {fileID: 446582}
  - {fileID: 484430}
  - {fileID: 438520}
  - {fileID: 477292}
  - {fileID: 428792}
  - {fileID: 472502}
  - {fileID: 419572}
  - {fileID: 429800}
  - {fileID: 424020}
  - {fileID: 464360}
  - {fileID: 414172}
  - {fileID: 496788}
  - {fileID: 410952}
  - {fileID: 431474}
  - {fileID: 472844}
  - {fileID: 426616}
  - {fileID: 459844}
  m_BlendShapeWeights: []
  m_RootBone: {fileID: 481878}
  m_AABB:
    m_Center: {x: -42.498856, y: -93.199745, z: -0.11955261}
    m_Extent: {x: 378.58728, y: 215.44064, z: 230.88512}
  m_DirtyAABB: 0
--- !u!1 &190544
GameObject:
  m_ObjectHideFlags: 0
  m_CorrespondingSourceObject: {fileID: 0}
  m_PrefabInstance: {fileID: 0}
  m_PrefabAsset: {fileID: 0}
  serializedVersion: 6
  m_Component:
  - component: {fileID: 484430}
  m_Layer: 0
  m_Name: R_UpperArm
  m_TagString: Untagged
  m_Icon: {fileID: 0}
  m_NavMeshLayer: 0
  m_StaticEditorFlags: 0
  m_IsActive: 1
--- !u!4 &484430
Transform:
  m_ObjectHideFlags: 0
  m_CorrespondingSourceObject: {fileID: 0}
  m_PrefabInstance: {fileID: 0}
  m_PrefabAsset: {fileID: 0}
  m_GameObject: {fileID: 190544}
  serializedVersion: 2
  m_LocalRotation: {x: 0.4901161, y: 0.6614675, z: 0.32743528, w: 0.4637166}
  m_LocalPosition: {x: 5.361254, y: -68.1659, z: 63.2304}
  m_LocalScale: {x: 1, y: 1, z: 1}
  m_ConstrainProportionsScale: 0
  m_Children:
  - {fileID: 438520}
  m_Father: {fileID: 496230}
  m_LocalEulerAnglesHint: {x: 0, y: 0, z: 0}
--- !u!1 &196796
GameObject:
  m_ObjectHideFlags: 0
  m_CorrespondingSourceObject: {fileID: 0}
  m_PrefabInstance: {fileID: 0}
  m_PrefabAsset: {fileID: 0}
  serializedVersion: 6
  m_Component:
  - component: {fileID: 481878}
  m_Layer: 0
  m_Name: Root
  m_TagString: Untagged
  m_Icon: {fileID: 0}
  m_NavMeshLayer: 0
  m_StaticEditorFlags: 0
  m_IsActive: 1
--- !u!4 &481878
Transform:
  m_ObjectHideFlags: 0
  m_CorrespondingSourceObject: {fileID: 0}
  m_PrefabInstance: {fileID: 0}
  m_PrefabAsset: {fileID: 0}
  m_GameObject: {fileID: 196796}
  serializedVersion: 2
  m_LocalRotation: {x: -0.16856094, y: 0.6867221, z: -0.16856094, w: 0.6867221}
  m_LocalPosition: {x: 0, y: 1.681398, z: -0.56901985}
  m_LocalScale: {x: 0.01, y: 0.01, z: 0.01}
  m_ConstrainProportionsScale: 0
  m_Children:
  - {fileID: 472502}
  - {fileID: 464360}
  - {fileID: 431474}
  - {fileID: 452676}
  m_Father: {fileID: 409254}
  m_LocalEulerAnglesHint: {x: 0, y: 0, z: 0}
--- !u!1 &198852
GameObject:
  m_ObjectHideFlags: 0
  m_CorrespondingSourceObject: {fileID: 0}
  m_PrefabInstance: {fileID: 0}
  m_PrefabAsset: {fileID: 0}
  serializedVersion: 6
  m_Component:
  - component: {fileID: 438520}
  m_Layer: 0
  m_Name: R_RowerArm
  m_TagString: Untagged
  m_Icon: {fileID: 0}
  m_NavMeshLayer: 0
  m_StaticEditorFlags: 0
  m_IsActive: 1
--- !u!4 &438520
Transform:
  m_ObjectHideFlags: 0
  m_CorrespondingSourceObject: {fileID: 0}
  m_PrefabInstance: {fileID: 0}
  m_PrefabAsset: {fileID: 0}
  m_GameObject: {fileID: 198852}
  serializedVersion: 2
  m_LocalRotation: {x: -0.5962588, y: -0.26013243, z: -0.062311783, w: 0.7569173}
  m_LocalPosition: {x: -98.02125, y: -2.842171e-14, z: -4.2632564e-14}
  m_LocalScale: {x: 1, y: 1, z: 1}
  m_ConstrainProportionsScale: 0
  m_Children:
  - {fileID: 477292}
  m_Father: {fileID: 484430}
  m_LocalEulerAnglesHint: {x: 0, y: 0, z: 0}
--- !u!1 &199284
GameObject:
  m_ObjectHideFlags: 0
  m_CorrespondingSourceObject: {fileID: 0}
  m_PrefabInstance: {fileID: 0}
  m_PrefabAsset: {fileID: 0}
  serializedVersion: 6
  m_Component:
  - component: {fileID: 441258}
  m_Layer: 0
  m_Name: Head
  m_TagString: Untagged
  m_Icon: {fileID: 0}
  m_NavMeshLayer: 0
  m_StaticEditorFlags: 0
  m_IsActive: 1
--- !u!4 &441258
Transform:
  m_ObjectHideFlags: 0
  m_CorrespondingSourceObject: {fileID: 0}
  m_PrefabInstance: {fileID: 0}
  m_PrefabAsset: {fileID: 0}
  m_GameObject: {fileID: 199284}
  serializedVersion: 2
  m_LocalRotation: {x: -4.250073e-17, y: 5.692062e-19, z: -0.035190642, w: 0.99938065}
  m_LocalPosition: {x: -86.84262, y: -2.5579538e-13, z: 1.0593324e-14}
  m_LocalScale: {x: 1, y: 1, z: 1}
  m_ConstrainProportionsScale: 0
  m_Children:
  - {fileID: 407004}
  - {fileID: 451512}
  - {fileID: 436476}
  - {fileID: 471164}
  - {fileID: 446006}
  m_Father: {fileID: 496230}
  m_LocalEulerAnglesHint: {x: 0, y: 0, z: 0}
