%YAML 1.1
%TAG !u! tag:unity3d.com,2011:
--- !u!65 &5848095901006848340
BoxCollider:
  m_ObjectHideFlags: 0
  m_CorrespondingSourceObject: {fileID: 0}
  m_PrefabInstance: {fileID: 0}
  m_PrefabAsset: {fileID: 0}
  m_GameObject: {fileID: 435251999001210040}
  m_Material: {fileID: 0}
  m_IsTrigger: 0
  m_Enabled: 1
  serializedVersion: 2
  m_Size: {x: 47.784378, y: 18.053555, z: 63.68849}
  m_Center: {x: -3.8310165, y: 8.526777, z: -10.297432}
--- !u!65 &1417406286414963782
BoxCollider:
  m_ObjectHideFlags: 0
  m_CorrespondingSourceObject: {fileID: 0}
  m_PrefabInstance: {fileID: 0}
  m_PrefabAsset: {fileID: 0}
  m_GameObject: {fileID: 435251999001210046}
  m_Material: {fileID: 0}
  m_IsTrigger: 0
  m_Enabled: 1
  serializedVersion: 2
  m_Size: {x: 26.699999, y: 54.70005, z: 85.68024}
  m_Center: {x: 0, y: -0.000003814698, z: 42.840027}
--- !u!1001 &435251999001242136
PrefabInstance:
  m_ObjectHideFlags: 0
  serializedVersion: 2
  m_Modification:
    m_TransformParent: {fileID: 0}
    m_Modifications:
    - target: {fileID: 100008, guid: be5ba49ac4d26634b9703dca14d6b3bc, type: 3}
      propertyPath: m_Name
      value: BloqueCasas
      objectReference: {fileID: 0}
    - target: {fileID: 400008, guid: be5ba49ac4d26634b9703dca14d6b3bc, type: 3}
      propertyPath: m_LocalPosition.x
      value: -334.71347
      objectReference: {fileID: 0}
    - target: {fileID: 400008, guid: be5ba49ac4d26634b9703dca14d6b3bc, type: 3}
      propertyPath: m_LocalPosition.y
      value: -48.69841
      objectReference: {fileID: 0}
    - target: {fileID: 400008, guid: be5ba49ac4d26634b9703dca14d6b3bc, type: 3}
      propertyPath: m_LocalPosition.z
      value: -384.52957
      objectReference: {fileID: 0}
    - target: {fileID: 400008, guid: be5ba49ac4d26634b9703dca14d6b3bc, type: 3}
      propertyPath: m_LocalRotation.x
      value: -0
      objectReference: {fileID: 0}
    - target: {fileID: 400008, guid: be5ba49ac4d26634b9703dca14d6b3bc, type: 3}
      propertyPath: m_LocalRotation.y
      value: -0
      objectReference: {fileID: 0}
    - target: {fileID: 400008, guid: be5ba49ac4d26634b9703dca14d6b3bc, type: 3}
      propertyPath: m_LocalRotation.z
      value: -0
      objectReference: {fileID: 0}
    - target: {fileID: 400008, guid: be5ba49ac4d26634b9703dca14d6b3bc, type: 3}
      propertyPath: m_LocalRotation.w
      value: 1
      objectReference: {fileID: 0}
    - target: {fileID: 400008, guid: be5ba49ac4d26634b9703dca14d6b3bc, type: 3}
      propertyPath: m_RootOrder
      value: 0
      objectReference: {fileID: 0}
    - target: {fileID: 400008, guid: be5ba49ac4d26634b9703dca14d6b3bc, type: 3}
      propertyPath: m_LocalEulerAnglesHint.x
      value: 0
      objectReference: {fileID: 0}
    - target: {fileID: 400008, guid: be5ba49ac4d26634b9703dca14d6b3bc, type: 3}
      propertyPath: m_LocalEulerAnglesHint.y
      value: 0
      objectReference: {fileID: 0}
    - target: {fileID: 400008, guid: be5ba49ac4d26634b9703dca14d6b3bc, type: 3}
      propertyPath: m_LocalEulerAnglesHint.z
      value: 0
      objectReference: {fileID: 0}
    m_RemovedComponents: []
  m_SourcePrefab: {fileID: 100100000, guid: be5ba49ac4d26634b9703dca14d6b3bc, type: 3}
--- !u!1 &435251999001210040 stripped
GameObject:
  m_CorrespondingSourceObject: {fileID: 100000, guid: be5ba49ac4d26634b9703dca14d6b3bc,
    type: 3}
  m_PrefabInstance: {fileID: 435251999001242136}
  m_PrefabAsset: {fileID: 0}
--- !u!1 &435251999001210046 stripped
GameObject:
  m_CorrespondingSourceObject: {fileID: 100006, guid: be5ba49ac4d26634b9703dca14d6b3bc,
    type: 3}
  m_PrefabInstance: {fileID: 435251999001242136}
  m_PrefabAsset: {fileID: 0}
