%YAML 1.1
%TAG !u! tag:unity3d.com,2011:
--- !u!114 &114258553531635856
MonoBehaviour:
  m_ObjectHideFlags: 0
  m_CorrespondingSourceObject: {fileID: 0}
  m_PrefabInstance: {fileID: 0}
  m_PrefabAsset: {fileID: 0}
  m_GameObject: {fileID: 6281760515717817575}
  m_Enabled: 1
  m_EditorHideFlags: 0
  m_Script: {fileID: 11500000, guid: f3838107f87d04c41838af6e0cce17bf, type: 3}
  m_Name: 
  m_EditorClassIdentifier: 
--- !u!1001 &6282176685653599905
PrefabInstance:
  m_ObjectHideFlags: 0
  serializedVersion: 2
  m_Modification:
    m_TransformParent: {fileID: 0}
    m_Modifications:
    - target: {fileID: 1000011797152326, guid: acf39d9f4addf294d93fa56fa373961b, type: 3}
      propertyPath: m_Name
      value: BigExplosionEffect Variant
      objectReference: {fileID: 0}
    - target: {fileID: 4000010212820824, guid: acf39d9f4addf294d93fa56fa373961b, type: 3}
      propertyPath: m_LocalPosition.x
      value: 335.7258
      objectReference: {fileID: 0}
    - target: {fileID: 4000010212820824, guid: acf39d9f4addf294d93fa56fa373961b, type: 3}
      propertyPath: m_LocalPosition.y
      value: 0
      objectReference: {fileID: 0}
    - target: {fileID: 4000010212820824, guid: acf39d9f4addf294d93fa56fa373961b, type: 3}
      propertyPath: m_LocalPosition.z
      value: 288.26132
      objectReference: {fileID: 0}
    - target: {fileID: 4000010212820824, guid: acf39d9f4addf294d93fa56fa373961b, type: 3}
      propertyPath: m_LocalRotation.x
      value: -0.7071068
      objectReference: {fileID: 0}
    - target: {fileID: 4000010212820824, guid: acf39d9f4addf294d93fa56fa373961b, type: 3}
      propertyPath: m_LocalRotation.y
      value: -0
      objectReference: {fileID: 0}
    - target: {fileID: 4000010212820824, guid: acf39d9f4addf294d93fa56fa373961b, type: 3}
      propertyPath: m_LocalRotation.z
      value: -0
      objectReference: {fileID: 0}
    - target: {fileID: 4000010212820824, guid: acf39d9f4addf294d93fa56fa373961b, type: 3}
      propertyPath: m_LocalRotation.w
      value: 0.7071068
      objectReference: {fileID: 0}
    - target: {fileID: 4000010212820824, guid: acf39d9f4addf294d93fa56fa373961b, type: 3}
      propertyPath: m_RootOrder
      value: 0
      objectReference: {fileID: 0}
    - target: {fileID: 4000010212820824, guid: acf39d9f4addf294d93fa56fa373961b, type: 3}
      propertyPath: m_LocalEulerAnglesHint.x
      value: 0
      objectReference: {fileID: 0}
    - target: {fileID: 4000010212820824, guid: acf39d9f4addf294d93fa56fa373961b, type: 3}
      propertyPath: m_LocalEulerAnglesHint.y
      value: 0
      objectReference: {fileID: 0}
    - target: {fileID: 4000010212820824, guid: acf39d9f4addf294d93fa56fa373961b, type: 3}
      propertyPath: m_LocalEulerAnglesHint.z
      value: 0
      objectReference: {fileID: 0}
    - target: {fileID: 198000012777718758, guid: acf39d9f4addf294d93fa56fa373961b,
        type: 3}
      propertyPath: looping
      value: 0
      objectReference: {fileID: 0}
    m_RemovedComponents: []
  m_SourcePrefab: {fileID: 100100000, guid: acf39d9f4addf294d93fa56fa373961b, type: 3}
--- !u!1 &6281760515717817575 stripped
GameObject:
  m_CorrespondingSourceObject: {fileID: 1000011797152326, guid: acf39d9f4addf294d93fa56fa373961b,
    type: 3}
  m_PrefabInstance: {fileID: 6282176685653599905}
  m_PrefabAsset: {fileID: 0}
