{
  "project_info": {
    "project_number": "766748512057",
    "firebase_url": "https://kruger-david-oribe.firebaseio.com",
    "project_id": "kruger-david-oribe",
    "storage_bucket": "kruger-david-oribe.appspot.com"
  },
  "client": [
    {
      "client_info": {
        "mobilesdk_app_id": "1:766748512057:android:54fab75ad8783462aa62e8",
        "android_client_info": {
          "package_name": "cat.itb.kruger_david_oribe"
        }
      },
      "oauth_client": [
        {
          "client_id": "766748512057-7cd423obqf2uvu176ke0taa8ep1bf10s.apps.googleusercontent.com",
          "client_type": 3
        }
      ],
      "api_key": [
        {
          "current_key": "AIzaSyCAJezdIunvOv1IExN9GmSHRyfTF_WRwSM"
        }
      ],
      "services": {
        "appinvite_service": {
          "other_platform_oauth_client": [
            {
              "client_id": "766748512057-7cd423obqf2uvu176ke0taa8ep1bf10s.apps.googleusercontent.com",
              "client_type": 3
            }
          ]
        }
      }
    }
  ],
  "configuration_version": "1"
}