Division,WeightClassKg,Place,Name,Team,BodyweightKg,Best3SquatKg,Best3BenchKg,Best3DeadliftKg,TotalKg,Equipment,Event,Sex
Boys,52,1,Preston Fox,Lampasas,51.07,129.27,83.91,142.88,356.07,Single-ply,SBD,M
Boys,52,2,Benjamin Galindo,Brady,51.17,92.99,63.5,120.2,276.69,Single-ply,SBD,M
Boys,52,3,Kyle Arriola,Lampasas,51.71,97.52,61.23,102.06,260.82,Single-ply,SBD,M
Boys,52,4,Marshall Schmitz,Brownwood,44.81,104.33,45.36,106.59,256.28,Single-ply,SBD,M
Boys,52,5,Jeovanny Navarro,Rockdale,51.53,79.38,61.23,113.4,254.01,Single-ply,SBD,M
Boys,52,6,Gauge Nelson,Copperas Cove,43.73,83.91,43.09,95.25,222.26,Single-ply,SBD,M
Boys,52,7,Hunter Mayo,Stephenville,46.27,72.57,49.9,88.45,210.92,Single-ply,SBD,M
Boys,52,8,Caleb Petty,Lampasas,50.58,68.04,38.56,79.38,185.97,Single-ply,SBD,M
Boys,56,1,Payton Melchor,Liberty Hill,53.16,129.27,61.23,140.61,331.12,Single-ply,SBD,M
Boys,56,2,Noe Martinez,Burnet,55.52,129.27,68.04,124.74,322.05,Single-ply,SBD,M
Boys,56,3,Caleb Galindo,Brady,53.34,102.06,61.23,113.4,276.69,Single-ply,SBD,M
Boys,56,4,Caleb Floyd,Gordon,55.66,102.06,49.9,124.74,276.69,Single-ply,SBD,M
Boys,56,5,Hunter Jackson,Marble Falls,53.34,79.38,45.36,106.59,231.33,Single-ply,SBD,M
Boys,60,1,Dakota Cavazos,Lampasas,59.87,154.22,113.4,170.1,437.72,Single-ply,SBD,M
Boys,60,2,Marwin Perez,Brownwood,57.7,145.15,97.52,158.76,401.43,Single-ply,SBD,M
Boys,60,3,Ty'rus Jones,Brownwood,58.38,145.15,92.99,154.22,392.36,Single-ply,SBD,M
Boys,60,4,Quint Pincelli,Llano,59.65,133.81,88.45,161.03,383.29,Single-ply,SBD,M
Boys,60,5,Jesse Madden,Lampasas,59.87,102.06,74.84,106.59,283.5,Single-ply,SBD,M
Boys,60,6,Fidel Castanada,Bangs,58.29,79.38,52.16,111.13,242.67,Single-ply,SBD,M
Boys,60,7,Dillon Wilson,Burnet,59.83,136.08,,,136.08,Single-ply,S,M
Boys,60,8,Bryce Murphy,Marble Falls,59.1,111.13,,,111.13,Single-ply,S,M
Boys,67.5,1,Sean Williams,Lampasas,66.68,204.12,131.54,213.19,548.85,Single-ply,SBD,M
Boys,67.5,2,Ethan Oakes,Lampasas,66.22,163.29,113.4,172.37,449.06,Single-ply,SBD,M
Boys,67.5,3,Ryan Jackson,Burnet,65.05,151.95,102.06,147.42,401.43,Single-ply,SBD,M
Boys,67.5,4,Kolby Allen,Lampasas,66.04,136.08,86.18,142.88,365.14,Single-ply,SBD,M
Boys,67.5,5,Dante Fredrick,Copperas Cove,65.95,133.81,81.65,147.42,362.87,Single-ply,SBD,M
Boys,67.5,6,Kameron Spruill,Copperas Cove,61.64,113.4,83.91,156.49,353.8,Single-ply,SBD,M
Boys,67.5,7,Anthony Arnold,Lampasas,62.28,113.4,79.38,145.15,337.93,Single-ply,SBD,M
Boys,67.5,8,Chayton Gray,Brady,63.87,113.4,68.04,151.95,333.39,Single-ply,SBD,M
Boys,67.5,9,Logan Evans,Lometa,64.41,115.67,72.57,145.15,333.39,Single-ply,SBD,M
Boys,67.5,10,Jason Andrews,Lampasas,66.77,113.4,77.11,136.08,326.59,Single-ply,SBD,M
Boys,67.5,11,Elijah Tijerina,Brady,64.14,102.06,74.84,142.88,319.78,Single-ply,SBD,M
Boys,67.5,12,Caden Cowan,Stephenville,66.9,117.93,58.97,136.08,312.98,Single-ply,SBD,M
Boys,67.5,13,Joseph Brannon,Stephenville,63.46,102.06,72.57,136.08,310.71,Single-ply,SBD,M
Boys,67.5,14,Jesse Garrison,Marble Falls,66.81,115.67,70.31,124.74,310.71,Single-ply,SBD,M
Boys,67.5,15,Jose Young,Rockdale,63.46,106.59,61.23,136.08,303.91,Single-ply,SBD,M
Boys,67.5,16,Ethan Kanka,Marble Falls,65.59,113.4,63.5,117.93,294.84,Single-ply,SBD,M
Boys,75,1,Brent Greenwood,Llano,71.03,190.51,124.74,176.9,492.15,Single-ply,SBD,M
Boys,75,2,Nolan Keller,Llano,74.25,181.44,108.86,181.44,471.74,Single-ply,SBD,M
Boys,75,3,Vincent Leon,Lampasas,73.84,163.29,86.18,172.37,421.84,Single-ply,SBD,M
Boys,75,4,Ryan Decker,Brady,74.53,145.15,111.13,165.56,421.84,Single-ply,SBD,M
Boys,75,5,Michael Cornish,Lampasas,73.71,158.76,97.52,161.03,417.3,Single-ply,SBD,M
Boys,75,6,Cameron Everetts,Lampasas,70.72,149.69,104.33,158.76,412.77,Single-ply,SBD,M
Boys,75,7,Elroy Castillo,Brownwood,68.04,145.15,90.72,174.63,410.5,Single-ply,SBD,M
Boys,75,8,Hayden Monk,Stephenville,72.57,151.95,88.45,165.56,405.97,Single-ply,SBD,M
Boys,75,9,Clayton Bertrand,Brownwood,71.58,149.69,92.99,158.76,401.43,Single-ply,SBD,M
Boys,75,10,Easton Simpson,Copperas Cove,73.71,161.03,90.72,147.42,399.16,Single-ply,SBD,M
Boys,75,11,Dante Cuffie,Lampasas,69.17,145.15,95.25,145.15,385.55,Single-ply,SBD,M
Boys,75,12,Payden Eason,Bangs,72.53,138.35,97.52,142.88,378.75,Single-ply,SBD,M
Boys,75,13,Kevin Wylie,Lampasas,68.08,136.08,79.38,151.95,367.41,Single-ply,SBD,M
Boys,75,14,Aaron Brown,Llano,70.44,149.69,81.65,136.08,367.41,Single-ply,SBD,M
Boys,75,15,Ismar Gonzales,Lampasas,70.85,120.2,86.18,154.22,360.61,Single-ply,SBD,M
Boys,75,16,Lander Chisolm,Lampasas,68.72,127.01,68.04,149.69,344.73,Single-ply,SBD,M
Boys,75,17,Logan Duggar,Llano,72.26,129.27,74.84,138.35,342.46,Single-ply,SBD,M
Boys,75,18,Eddie Jaimes,Lometa,73.71,117.93,79.38,142.88,340.19,Single-ply,SBD,M
Boys,82.5,1,Mason Greenwood,Llano,80.1,210.92,138.35,226.8,576.06,Single-ply,SBD,M
Boys,82.5,2,Sloan Hall,Liberty Hill,80.83,215.46,117.93,233.6,566.99,Single-ply,SBD,M
Boys,82.5,3,Issac De La Cruz,Stephenville,79.65,190.51,108.86,197.31,496.68,Single-ply,SBD,M
Boys,82.5,4,Landry Bolin,Liberty Hill,79.42,176.9,111.13,197.31,485.34,Single-ply,SBD,M
Boys,82.5,5,John Esparza,Lampasas,77.84,165.56,124.74,183.7,474,Single-ply,SBD,M
Boys,82.5,6,Evan Gravell,Bangs,76.97,154.22,122.47,181.44,458.13,Single-ply,SBD,M
Boys,82.5,7,Marcos Gutierrez,Rockdale,80.97,163.29,117.93,136.08,417.3,Single-ply,SBD,M
Boys,82.5,8,Chase Crider,Gordon,80.24,138.35,90.72,145.15,374.21,Single-ply,SBD,M
Boys,82.5,9,Shawn Hensley,Llano,80.24,113.4,70.31,145.15,328.85,Single-ply,SBD,M
Boys,82.5,10,Damian Cunningham,Marble Falls,76.38,108.86,72.57,145.15,326.59,Single-ply,SBD,M
Boys,82.5,11,Ridic Meraz,Rockdale,78.11,122.47,52.16,122.47,297.1,Single-ply,SBD,M
Boys,82.5,12,Davion Ford,Rockdale,79.7,181.44,,,181.44,Single-ply,S,M
Boys,82.5,13,Landon Irvin,Lampasas,76.7,149.69,,,149.69,Single-ply,S,M
Boys,82.5,14,Ethan Rascoe,Lampasas,79.47,142.88,,,142.88,Single-ply,S,M
Boys,82.5,DQ,Ian Mareno,Brownwood,80.1,,,,,Single-ply,SBD,M
Boys,90,1,Jace Hankins,Lampasas,84.19,217.72,142.88,226.8,587.4,Single-ply,SBD,M
Boys,90,2,Andy Becker,Liberty Hill,89.04,190.51,147.42,204.12,542.04,Single-ply,SBD,M
Boys,90,3,Alexander Myles,Copperas Cove,83.6,192.78,127.01,210.92,530.7,Single-ply,SBD,M
Boys,90,4,Ethan Thom,Liberty Hill,84.5,206.38,124.74,183.7,514.83,Single-ply,SBD,M
Boys,90,5,Gavin Jefferson,Brownwood,88.68,190.51,102.06,204.12,496.68,Single-ply,SBD,M
Boys,90,6,Austin Sansing,Lampasas,84.82,176.9,113.4,185.97,476.27,Single-ply,SBD,M
Boys,90,7,Ben Walling,Llano,87.72,181.44,115.67,179.17,476.27,Single-ply,SBD,M
Boys,90,8,Lakota Lawrence,Liberty Hill,83.37,172.37,115.67,176.9,464.93,Single-ply,SBD,M
Boys,90,9,Taylor Smith,Llano,89.72,147.42,97.52,165.56,410.5,Single-ply,SBD,M
Boys,90,10,Laken Behrens,Burnet,83.32,147.42,86.18,170.1,403.7,Single-ply,SBD,M
Boys,90,11,Jose Uvalle,Lampasas,86.05,131.54,99.79,170.1,401.43,Single-ply,SBD,M
Boys,90,12,Christian Eseroma,Copperas Cove,84.46,140.61,83.91,151.95,376.48,Single-ply,SBD,M
Boys,90,13,Caleb Smith,Stephenville,86.18,133.81,83.91,149.69,367.41,Single-ply,SBD,M
Boys,90,14,Hunter Lawrence,Bangs,83.46,142.88,79.38,142.88,365.14,Single-ply,SBD,M
Boys,90,15,Ben Rogers,Lampasas,87.77,113.4,90.72,145.15,349.27,Single-ply,SBD,M
Boys,90,16,Colby Henry,Lometa,82.64,120.2,88.45,138.35,347,Single-ply,SBD,M
Boys,90,17,Javier Felan,Lometa,84.28,129.27,79.38,138.35,347,Single-ply,SBD,M
Boys,90,18,Jace Maynard,Burnet,84.69,102.06,92.99,127.01,322.05,Single-ply,SBD,M
Boys,90,19,Blaine Goen,Gordon,89.54,102.06,61.23,124.74,288.03,Single-ply,SBD,M
Boys,90,20,Junior Pack,Stephenville,86.27,136.08,95.25,,231.33,Single-ply,SB,M
Boys,90,21,Michael Nguyen,Lampasas,86.36,222.26,,,222.26,Single-ply,S,M
Boys,90,DQ,Cooper Wilson,Marble Falls,84.01,,,,,Single-ply,SBD,M
Boys,100,1,Ragan Wood,Stephenville,93.62,272.16,156.49,229.06,657.71,Single-ply,SBD,M
Boys,100,2,Kody Knowles,Liberty Hill,93.21,231.33,158.76,238.14,628.23,Single-ply,SBD,M
Boys,100,3,Matthew Carter,Liberty Hill,98.16,226.8,129.27,204.12,560.19,Single-ply,SBD,M
Boys,100,4,Roger Craig,Burnet,99.7,183.7,147.42,195.04,526.17,Single-ply,SBD,M
Boys,100,5,Nathan Martin,Stephenville,91.58,195.04,120.2,192.78,508.02,Single-ply,SBD,M
Boys,100,6,Edgar Rodea,Gordon,93.35,174.63,124.74,181.44,480.81,Single-ply,SBD,M
Boys,100,7,Frankie Gutierrez,Burnet,94.62,185.97,104.33,190.51,480.81,Single-ply,SBD,M
Boys,100,8,Jeremy Rodgers,Lampasas,96.57,172.37,95.25,199.58,467.2,Single-ply,SBD,M
Boys,100,9,Bass Myers,Brady,92.22,151.95,124.74,170.1,446.79,Single-ply,SBD,M
Boys,100,10,Ethan Norris,Stephenville,91.63,161.03,102.06,181.44,444.52,Single-ply,SBD,M
Boys,100,11,Justin Veleskey,Copperas Cove,94.21,151.95,99.79,158.76,410.5,Single-ply,SBD,M
Boys,100,12,Zach Fearn,Marble Falls,90.26,136.08,88.45,147.42,371.95,Single-ply,SBD,M
Boys,100,13,Austin Hilgenberg,Lampasas,95.71,140.61,77.11,138.35,356.07,Single-ply,SBD,M
Boys,100,14,Genaro Arreguin,Marble Falls,92.26,136.08,74.84,138.35,349.27,Single-ply,SBD,M
Boys,100,15,Kaai Armour,Stephenville,91.53,127.01,90.72,124.74,342.46,Single-ply,SBD,M
Boys,100,16,Wyatt Pounders,Rockdale,92.12,129.27,72.57,136.08,337.93,Single-ply,SBD,M
Boys,100,DQ,Lane Lewis,Copperas Cove,99.79,,,,,Single-ply,SBD,M
Boys,110,1,Dakoda Trull,Llano,109.04,260.82,136.08,229.06,625.96,Single-ply,SBD,M
Boys,110,2,Bailey Cloughly,Liberty Hill,107.64,235.87,149.69,215.46,601.01,Single-ply,SBD,M
Boys,110,3,Ray Dixon,Llano,105.05,192.78,120.2,226.8,539.77,Single-ply,SBD,M
Boys,110,4,Jaxon Tucker,Brady,106.64,204.12,122.47,208.65,535.24,Single-ply,SBD,M
Boys,110,5,Daniel Sparks,Marble Falls,102.74,174.63,92.99,181.44,449.06,Single-ply,SBD,M
Boys,110,6,Braxton Moore,Rockdale,106.96,176.9,106.59,149.69,433.18,Single-ply,SBD,M
Boys,110,7,Josh Davenport,Rockdale,102.38,163.29,83.91,147.42,394.63,Single-ply,SBD,M
Boys,110,8,Jose Moreno,Lometa,102.15,102.06,65.77,117.93,285.76,Single-ply,SBD,M
Boys,110,9,Wyatt Chambers,Rockdale,109.23,183.7,,,183.7,Single-ply,S,M
Boys,110,10,Blaize Infinger,Brownwood,104.42,176.9,,,176.9,Single-ply,S,M
Boys,110,DQ,Jalen Huggins,Burnet,108,,,,,Single-ply,SBD,M
Boys,125,1,Justin Montgomery,Liberty Hill,116.03,242.67,154.22,226.8,623.69,Single-ply,SBD,M
Boys,125,2,Austin Duenas,Copperas Cove,120.34,215.46,113.4,226.8,555.65,Single-ply,SBD,M
Boys,125,3,Juan Jimenez,Copperas Cove,111.4,206.38,113.4,226.8,546.58,Single-ply,SBD,M
Boys,125,4,Santana Espinoza,Brownwood,122.97,195.04,120.2,204.12,519.36,Single-ply,SBD,M
Boys,125,5,Andrew Diver,Rockdale,118.89,206.38,124.74,179.17,510.29,Single-ply,SBD,M
Boys,125,6,Zac Hudgins,Burnet,112.76,181.44,120.2,199.58,501.22,Single-ply,SBD,M
Boys,125,7,Colby Rogers,Burnet,122.56,195.04,113.4,190.51,498.95,Single-ply,SBD,M
Boys,125,8,Wyatt Jacobs,Brownwood,123.51,170.1,111.13,136.08,417.3,Single-ply,SBD,M
Boys,125,9,Jacob Bernal,Burnet,114.35,154.22,111.13,136.08,401.43,Single-ply,SBD,M
Boys,125,10,Chevaz McHenry,Marble Falls,112.63,140.61,86.18,156.49,383.29,Single-ply,SBD,M
Boys,125,11,Juan Luna,Marble Falls,110.54,133.81,77.11,149.69,360.61,Single-ply,SBD,M
Boys,125,12,Luke Williams,Llano,122.92,86.18,117.93,86.18,290.3,Single-ply,SBD,M
Boys,125+,1,Chris Nix,Lampasas,134.35,208.65,147.42,226.8,582.87,Single-ply,SBD,M
Boys,125+,2,Sam Molina,Rockdale,148.14,192.78,140.61,201.85,535.24,Single-ply,SBD,M
Boys,125+,3,Jared Tippie,Liberty Hill,130.54,226.8,102.06,181.44,510.29,Single-ply,SBD,M
Boys,125+,4,Dale Wright,Copperas Cove,127.5,188.24,83.91,183.7,455.86,Single-ply,SBD,M
Boys,125+,5,Tyler Johnson,Lampasas,133.31,195.04,97.52,156.49,449.06,Single-ply,SBD,M
