Place,WeightClassKg,Name,Equipment,Team,BodyweightKg,Squat1Kg,Squat2Kg,Squat3Kg,Best3SquatKg,Bench1Kg,Bench2Kg,Bench3Kg,Best3BenchKg,Deadlift1Kg,Deadlift2Kg,Deadlift3Kg,Best3DeadliftKg,TotalKg,Division,Sex,Event
1,74,Sigurd Farstad Iversen,Raw,SKA-Fræna,73.90,165,-177.5,-177.5,165.0,107.5,110,112.5,112.5,180,195,-200,195.0,472.5,Junior 19-23,M,SBD
1,105,Svein-Olav Farstad,Single-ply,SKA-Fræna,93.60,,,,,230,,,230.0,,,,,230,Master 50-59,M,B
1,93,Kjell Arne Bøe,Single-ply,SKA-Fræna,83.70,,,,,170,-180,180,180.0,,,,,180,Master 60-69,M,B
