Place,WeightClassKg,CyrillicName,Name,Event,Equipment,Sex,BirthDate,Division,BodyweightKg,Squat1Kg,Squat2Kg,Squat3Kg,Squat4Kg,Best3SquatKg,Bench1Kg,Bench2Kg,Bench3Kg,Bench4Kg,Best3BenchKg,Deadlift1Kg,Deadlift2Kg,Deadlift3Kg,Deadlift4Kg,Best3DeadliftKg,TotalKg
1,75,Евгений Быков,Evgeniy Bykov,SBD,Wraps,M,1984-08-02,Open,74.6,190,202.5,210,,210,130,140,145,,145,225,245,252.5,,252.5,607.5
2,75,Константин Процкий,Konstantin Protskiy,SBD,Wraps,M,1992-12-09,Open,73.9,155,165,-170,,165,127.5,132.5,-135,,132.5,222.5,-240,-240,,222.5,520
3,75,Александр Суханов,Aleksandr Sukhanov,SBD,Wraps,M,1987-03-06,Open,73.1,150,-160,-160,,150,90,100,-110,,100,150,160,-180,,160,410
1,82.5,Алексей Купцов,Aleksey Kuptsov,SBD,Wraps,M,1990-06-21,Open,79.75,215,225,-232.5,,225,122.5,127.5,132.5,,132.5,195,205,212.5,,212.5,570
2,82.5,Дмитрий Малаховский,Dmitriy Malakhovskiy,SBD,Wraps,M,1981-03-23,Open,80.8,180,-190,-190,,180,130,-140,-140,,130,230,-240,-240,,230,540
3,82.5,Евгений Аралов,Evgeniy Aralov,SBD,Wraps,M,1982-03-04,Open,79.5,135,145,155,,155,120,125,130,,130,155,165,175,,175,460
DQ,82.5,Евгений Гончаров,Evgeniy Goncharov,SBD,Wraps,M,1989-07-15,Open,76.3,-165,-165,-170,,,-125,,,,,-215,,,,,
1,110,Михаил Овсянников,Mikhail Ovsyannikov,SBD,Wraps,M,1985-02-23,Open,109.95,192.5,205,210,,210,152.5,160,-162.5,,160,220,-235,-235,,220,590
1,90,Владислав Горецкий,Vladislav Goretskiy,SBD,Wraps,M,1995-09-19,Open,88.8,-220,220,240,,240,145,155,160,,160,260,280,-292.5,,280,680
2,90,Вячеслав Губарев,Vyacheslav Gubarev,SBD,Wraps,M,1976-04-23,Open,86.8,170,180,190,,190,135,145,150,,150,220,230,240,,240,580
3,90,Андрей Мосенко,Andrey Mosenko,SBD,Wraps,M,1981-09-09,Open,88.95,170,180,-185,,180,115,122.5,-125,,122.5,190,200,-210,,200,502.5
4,90,Андрей Сальнаск,Andrey Salnask,SBD,Wraps,M,1979-08-10,Open,89.9,-170,170,-180,,170,130,135,140,,140,190,-200,-200,,190,500
1,67.5,Михаил Лазуткин,Mikhail Lazutkin,SBD,Wraps,M,1995-05-02,Open,65.05,-160,160,172.5,,172.5,100,110,-115,,110,180,-187.5,-187.5,,180,462.5
2,67.5,Андрей Колбин,Andrey Kolbin,SBD,Wraps,M,1984-07-22,Open,67.15,160,-167.5,-167.5,,160,100,110,-112.5,,110,180,-192.5,-195,,180,450
DQ,67.5,Тимофей Ишимов,Timofey Ishimov,SBD,Wraps,M,1990-12-01,Open,67.3,-172.5,-172.5,-172.5,,,-107.5,,,,,-205,,,,,
1,60,Александр Мамаев,Aleksandr Mamaev,SBD,Wraps,M,1985-02-24,Open,60,-75,75,95,,95,65,72.5,77.5,,77.5,140,-160,160,,160,332.5
1,82.5,Николай Ефанов,Nikolay Efanov,SBD,Wraps,M,1958-07-10,Masters 50-59,81.7,170,-182.5,-182.5,,170,100,105,107.5,,107.5,200,207.5,-215,,207.5,485
1,90,Владислав Горецкий,Vladislav Goretskiy,SBD,Wraps,M,1995-09-19,Juniors,88.8,-220,220,240,,240,145,155,160,,160,260,280,-292.5,,280,680
1,110,Евгений Шалимов,Evgeniy Shalimov,SBD,Wraps,M,1995-09-28,Juniors,106.6,180,195,210,,210,130,140,-145,,140,230,250,-270,,250,600
1,100,Владислав Нечахин,Vladislav Nechakhin,SBD,Wraps,M,1996-04-05,Juniors,98.55,160,170,-175,,170,145,-150,-150,,145,200,-210,210,,210,525
1,75,Роман Коротких,Roman Korotkikh,SBD,Wraps,M,1994-08-21,Juniors,72.8,190,195,-200,,195,145,-150,150,,150,220,235,-242.5,,235,580
2,75,Владислав Попов,Vladislav Popov,SBD,Wraps,M,1994-10-02,Juniors,73.1,170,-180,180,,180,115,120,,,120,220,240,,,240,540
3,75,Геннадий Затеев,Gennadiy Zateev,SBD,Wraps,M,1993-05-12,Juniors,73.1,155,170,-172.5,,170,95,-105,-105,,95,180,-195,-195,,180,445
4,75,Леонид Таболкин,Leonid Tabolkin,SBD,Wraps,M,1994-01-06,Juniors,72.4,-150,150,-160,,150,90,-105,-105,,90,165,180,195,,195,435
1,67.5,Михаил Лазуткин,Mikhail Lazutkin,SBD,Wraps,M,1995-05-02,Juniors,65.05,-160,160,172.5,,172.5,100,110,-115,,110,180,-187.5,-187.5,,180,462.5
1,140,Никита Аршанин,Nikita Arshanin,SBD,Wraps,M,1995-03-30,Juniors,133.95,260,275,-285,,275,180,190,-200,,190,250,260,270,,270,735
1,90,Денис Иваньков,Denis Ivankov,SBD,Wraps,M,2000-01-25,Teens 14-16,89.95,-140,-140,140,,140,90,100,-107.5,,100,150,160,170,,170,410
2,90,Руслан Ширяев,Ruslan Shiryaev,SBD,Wraps,M,2000-03-07,Teens 14-16,86.6,100,110,125,,125,85,90,-95,,90,120,130,140,,140,355
1,67.5,Евгений Сыскин,Evgeniy Syskin,SBD,Wraps,M,2002-03-13,Teens 14-16,62.5,45,52.5,57.5,,57.5,40,45,-50,,45,85,97.5,100,,100,202.5
1,60,Сергей Кунгурцев,Sergey Kungurtsev,SBD,Wraps,M,2002-07-27,Teens 14-16,58.2,110,117.5,122.5,,122.5,80,-85,87.5,,87.5,140,-147.5,147.5,,147.5,357.5
2,60,Иван Сафронов,Ivan Safronov,SBD,Wraps,M,2001-07-31,Teens 14-16,57.7,95,107.5,120,,120,75,82.5,-85,,82.5,-120,120,125,,125,327.5
1,56,Александр Шишмарев,Aleksandr Shishmarev,SBD,Wraps,M,2002-08-28,Teens 14-16,55,90,97.5,100,,100,65,72.5,-77.5,,72.5,105,-115,120,,120,292.5
1,110,Андрей Родькин,Andrey Rodkin,SBD,Wraps,M,1970-11-13,Masters 40-49,109.15,105,115,130,,130,-90,100,-105,,100,150,165,175,,175,405
1,100,Дмитрий Кем,Dmitriy Kem,SBD,Wraps,M,1971-12-08,Masters 40-49,96.9,-150,160,172.5,,172.5,100,110,120,,120,180,195,205,,205,497.5
1,90,Вячеслав Губарев,Vyacheslav Gubarev,SBD,Wraps,M,1976-04-23,Masters 40-49,86.8,170,180,190,,190,135,145,150,,150,220,230,240,,240,580
1,100,Никита Любимов,Nikita Lyubimov,SBD,Wraps,M,1998-08-20,Teens 17-19,99.85,195,210,225,,225,120,130,135,,135,212.5,225,-235,,225,585
2,100,Норик Бадеян,Norik Badeyan,SBD,Wraps,M,1999-10-28,Teens 17-19,99.35,180,195,-207.5,,195,110,120,-127.5,,120,185,200,210,,210,525
3,100,Дмитрий Ваганов,Dmitriy Vaganov,SBD,Wraps,M,1997-10-29,Teens 17-19,93.1,155,165,-180,,165,110,-120,120,,120,180,195,205,,205,490
1,67.5,Артем Оганисян,Artem Oganisyan,SBD,Wraps,M,1998-05-06,Teens 17-19,65.45,180,190,200,,200,100,110,-115,,110,200,215,232.5,,232.5,542.5
1,82.5,Николай Козюлин,Nikolay Kozyulin,SBD,Wraps,M,1997-03-12,Teens 17-19,78.55,170,-180,180,,180,120,125,130,,130,230,240,-247.5,,240,550
2,82.5,Владислав Березов,Vladislav Berezov,SBD,Wraps,M,1997-06-24,Teens 17-19,80.15,155,165,172.5,,172.5,100,110,-117.5,,110,175,190,-200,,190,472.5
1,60,Андрей Карелин,Andrey Karelin,SBD,Wraps,M,1998-06-30,Teens 17-19,58,95,100,-105,,100,85,-90,-90,,85,115,125,130,,130,315
1,75,Руслан Цветковский,Ruslan Tsvetkovskiy,SBD,Wraps,M,1998-05-28,Teens 17-19,73.6,170,-182.5,-182.5,,170,85,110,-117.5,,110,225,-240,,,225,505
2,75,Данил Яковлев,Danil Yakovlev,SBD,Wraps,M,1999-11-01,Teens 17-19,73.9,140,145,150,,150,110,115,120,,120,-155,160,165,,165,435
3,75,Данила Корнев,Danila Kornev,SBD,Wraps,M,1999-11-29,Teens 17-19,72.7,135,145,150,,150,75,80,-87.5,,80,180,190,200,,200,430
4,75,Алексей Букин,Aleksey Bukin,SBD,Wraps,M,1999-11-12,Teens 17-19,70.8,80,92.5,100,,100,55,62.5,-67.5,,62.5,100,115,-122.5,,115,277.5
1,90,Илья Андрюхов,Ilya Andryukhov,SBD,Wraps,M,1999-08-04,Teens 17-19,87.8,140,150,160,,160,90,100,107.5,,107.5,165,180,-187.5,,180,447.5
1,56,Павел Бубнов,Pavel Bubnov,SBD,Wraps,M,2003-07-29,Teens 13,54.75,-45,45,55,,55,30,35,37.5,,37.5,65,75,80,,80,172.5
1,60,Дарья Галямова,Darya Galyamova,SBD,Wraps,F,1996-11-19,Open,56.95,110,-115,115,,115,52.5,-55,55,,55,140,155,-160,,155,325
2,60,Полина Иванова,Polina Ivanova,SBD,Wraps,F,1986-09-27,Open,59.4,100,110,117.5,,117.5,57.5,-62.5,-62.5,,57.5,132.5,140,145,,145,320
3,60,Ангелина Калинина,Angelina Kalinina,SBD,Wraps,F,1996-05-29,Open,59.95,110,115,-120,,115,50,55,57.5,,57.5,122.5,135,-142.5,,135,307.5
4,60,Ольга Кузнецова,Olga Kuznetsova,SBD,Wraps,F,1989-08-05,Open,59.6,85,-92.5,95,,95,37.5,-40,40,,40,105,112.5,117.5,,117.5,252.5
5,60,Вера Иванова,Vera Ivanova,SBD,Wraps,F,1992-08-19,Open,56.8,-55,-55,55,,55,35,-40,-40,,35,80,85,90,,90,180
1,67.5,Оксана Чудная,Oksana Chudnaya,SBD,Wraps,F,1977-05-30,Open,65.85,115,-122.5,-122.5,,115,55,62.5,-67.5,,62.5,115,130,137.5,,137.5,315
2,67.5,Татьяна Слепокурова,Tatyana Slepokurova,SBD,Wraps,F,1969-01-07,Open,64.25,-95,95,-100,,95,52.5,57.5,-60,,57.5,120,132.5,-140,,132.5,285
1,48,Надежда Горбунова,Nadezhda Gorbunova,SBD,Wraps,F,1982-04-25,Open,47.6,95,100,105,,105,45,47.5,50,,50,100,110,115,,115,270
1,52,Екатерина Кудрявцева,Ekaterina Kudryavtseva,SBD,Wraps,F,1988-03-08,Open,51.75,95,-102.5,105,,105,45,50,-52.5,,50,95,100,-105,,100,255
2,52,Анна Коропец,Anna Koropets,SBD,Wraps,F,1988-02-03,Open,50.2,67.5,77.5,-82.5,,77.5,35,40,42.5,,42.5,100,115,-122.5,,115,235
1,56,Анна Вишняк,Anna Vishnyak,SBD,Wraps,F,1984-12-12,Open,54.45,110,117.5,-122.5,,117.5,70,77.5,80,,80,140,152.5,-161,,152.5,350
2,56,Ксения Абрамова,Kseniya Abramova,SBD,Wraps,F,1986-10-18,Open,55.8,-70,70,80,,80,47.5,52.5,-55,,52.5,95,105,110,,110,242.5
1,82.5,Наталья Красотка,Natalya Krasotka,SBD,Wraps,F,1978-09-27,Open,77.25,100,105,-110,,105,55,60,-65,,60,120,135,-140,,135,300
1,60,Дарья Галямова,Darya Galyamova,SBD,Wraps,F,1996-11-19,Juniors,56.95,110,-115,115,,115,52.5,-55,55,,55,140,155,-160,,155,325
2,60,Ангелина Калинина,Angelina Kalinina,SBD,Wraps,F,1996-05-29,Juniors,59.95,110,115,-120,,115,50,55,57.5,,57.5,122.5,135,-142.5,,135,307.5
1,52,Кристина Кузьменко,Kristina Kuzmenko,SBD,Wraps,F,1996-03-15,Juniors,51.6,70,80,-90,,80,40,-50,-50,,40,80,87.5,-92.5,,87.5,207.5
1,48,Мария Логвиненко,Mariya Logvinenko,SBD,Wraps,F,1994-10-14,Juniors,48,60,-70,-80,,60,40,50,55,,55,60,75,82.5,,82.5,197.5
1,67.5,Евгения Анисимова,Evgeniya Anisimova,SBD,Wraps,F,1993-06-17,Juniors,63.45,-95,95,100,,100,40,42.5,45,,45,102.5,110,115,,115,260
2,67.5,Елена Мурачева,Elena Muracheva,SBD,Wraps,F,1993-03-15,Juniors,64.5,50,60,70,,70,30,37.5,42.5,,42.5,70,80,90,,90,202.5
1,56,Елена Боровинская,Elena Borovinskaya,SBD,Wraps,F,1995-12-06,Juniors,54.7,105,-115,-115,,105,50,55,-57.5,,55,105,120,-130,,120,280
2,56,Дарья Сафонова,Darya Safonova,SBD,Wraps,F,1995-07-09,Juniors,53,-87.5,87.5,-92.5,,87.5,47.5,-52.5,-52.5,,47.5,100,105,-107.5,,105,240
3,56,Александра Бакланова,Aleksandra Baklanova,SBD,Wraps,F,1995-03-24,Juniors,56,80,-87.5,-87.5,,80,40,-47.5,47.5,,47.5,100,107.5,-115,,107.5,235
1,48,Ангелина Класина,Angelina Klasina,SBD,Wraps,F,1999-10-08,Teens 17-19,46.4,72.5,77.5,80,,80,35,37.5,-40,,37.5,77.5,82.5,85,,85,202.5
1,56,Дарья Приманчук,Darya Primanchuk,SBD,Wraps,F,1998-12-23,Teens 17-19,54.95,95,102.5,-105,,102.5,52.5,55,-57.5,,55,112.5,-122.5,-132.5,,112.5,270
1,60,Светлана Толошева,Svetlana Tolosheva,SBD,Wraps,F,1998-06-30,Teens 17-19,58.05,100,110,-120,,110,45,-50,-50,,45,110,120,130,,130,285
2,60,Анастасия Логинова,Anastasiya Loginova,SBD,Wraps,F,1998-02-26,Teens 17-19,59.95,92.5,-97.5,97.5,,97.5,45,47.5,-50,,47.5,120,132.5,135,,135,280
3,60,Ксения Карпунина,Kseniya Karpunina,SBD,Wraps,F,1998-10-10,Teens 17-19,59.95,90,-100,-100,,90,37.5,-45,-45,,37.5,95,100,102.5,,102.5,230
1,52,Алена Плотникова,Alena Plotnikova,SBD,Wraps,F,1997-09-23,Teens 17-19,50.95,75,-80,-80,,75,45,47.5,50,,50,85,90,95,,95,220
1,60,Анастасия Дорохова,Anastasiya Dorokhova,SBD,Wraps,F,2002-02-18,Teens 14-16,59.8,95,102.5,-107.5,,102.5,55,60,-62.5,,60,115,125,130,,130,292.5
2,60,Ольга Стоянова,Olga Stoyanova,SBD,Wraps,F,2000-08-26,Teens 14-16,59.1,85,90,92.5,,92.5,37.5,40,-42.5,,40,90,-97.5,97.5,,97.5,230
1,44,Наталья Одинцова,Natalya Odintsova,SBD,Wraps,F,2002-08-14,Teens 14-16,42.8,50,57.5,-65,,57.5,35,40,42.5,,42.5,92.5,-100,-100,,92.5,192.5
1,56,Татьяна Пищалко,Tatyana Pishchalko,SBD,Wraps,F,1974-04-23,Masters 40-49,56,55,62.5,-70,,62.5,30,-37.5,37.5,,37.5,70,75,80,,80,180
1,100,Вячеслав Николаев,Vyacheslav Nikolaev,B,Raw,M,1956-07-10,Masters 60-69,97.95,,,,,,140,150,155,,155,,,,,,155
1,90,Алексадр Размахнин,Aleksadr Razmakhnin,B,Raw,M,1951-08-08,Masters 60-69,87.5,,,,,,112.5,122.5,-130,,122.5,,,,,,122.5
1,75,Сергей Григорьев,Sergey Grigorev,B,Raw,M,1954-08-22,Masters 60-69,73.6,,,,,,100,110,-112.5,,110,,,,,,110
1,90,Юрий Рубанов,Yuriy Rubanov,B,Raw,M,1967-11-28,Open,88.35,,,,,,170,180,182.5,,182.5,,,,,,182.5
2,90,Артем Гомолко,Artem Gomolko,B,Raw,M,1987-12-24,Open,87.05,,,,,,160,170,-175,,170,,,,,,170
3,90,Станислав Золотухин,Stanislav Zolotukhin,B,Raw,M,1986-08-21,Open,89.95,,,,,,145,155,162.5,,162.5,,,,,,162.5
4,90,Андрей Фуфаев,Andrey Fufaev,B,Raw,M,1983-02-05,Open,89.05,,,,,,160,-177.5,-177.5,,160,,,,,,160
5,90,Степан слобожанин,Stepan Slobozhanin,B,Raw,M,1988-04-02,Open,88.6,,,,,,-155,155,-157.5,,155,,,,,,155
6,90,Андрей Лаврентьев,Andrey Lavrentev,B,Raw,M,1990-05-25,Open,87.75,,,,,,-135,135,140,,140,,,,,,140
7,90,Валерий Кузнецов,Valeriy Kuznetsov,B,Raw,M,1974-01-23,Open,87.6,,,,,,120,130,-135,,130,,,,,,130
8,90,Алексей Похлебин,Aleksey Pokhlebin,B,Raw,M,1980-08-08,Open,89.1,,,,,,-125,-125,125,,125,,,,,,125
9,90,Алексей Колесников,Aleksey Kolesnikov,B,Raw,M,1986-08-29,Open,89.8,,,,,,125,-135,-135,,125,,,,,,125
DQ,90,Анатолий Зарков,Anatoliy Zarkov,B,Raw,M,1980-05-28,Open,87.25,,,,,,-135,-135,-135,,,,,,,,
DQ,90,Александр Черников,Aleksandr Chernikov,B,Raw,M,1987-08-17,Open,89.55,,,,,,-145,-150,-150,,,,,,,,
1,100,Икромжон Атахонов,Ikromzhon Atakhonov,B,Raw,M,1989-06-18,Open,98.35,,,,,,180,190,197.5,,197.5,,,,,,197.5
2,100,Владимир Винтер,Vladimir Vinter,B,Raw,M,1972-10-24,Open,97.8,,,,,,155,-160,-162.5,,155,,,,,,155
3,100,Алексей Пугачев,Aleksey Pugachev,B,Raw,M,1979-05-23,Open,96.55,,,,,,135,142.5,147.5,,147.5,,,,,,147.5
4,100,Александр Лисицын,Aleksandr Lisitsyn,B,Raw,M,1991-05-15,Open,98.25,,,,,,140,145,-150,,145,,,,,,145
5,100,Николай Лабутин,Nikolay Labutin,B,Raw,M,1984-09-14,Open,98.95,,,,,,132.5,-142.5,-142.5,,132.5,,,,,,132.5
DQ,100,Михаил Киселев,Mikhail Kiselev,B,Raw,M,1976-05-29,Open,98.35,,,,,,-180,-180,-180,,,,,,,,
1,140,Сергей Кураков,Sergey Kurakov,B,Raw,M,1971-04-16,Open,140,,,,,,165,172.5,180,,180,,,,,,180
1,67.5,Евгений Дербенев,Evgeniy Derbenev,B,Raw,M,1990-08-09,Open,66.15,,,,,,120,127.5,-132.5,,127.5,,,,,,127.5
2,67.5,Юрий Жмаев,Yuriy Zhmaev,B,Raw,M,1979-08-27,Open,66.65,,,,,,-125,125,-127.5,,125,,,,,,125
3,67.5,Исмаил Джумаев,Ismail Dzhumaev,B,Raw,M,1996-02-23,Open,66.5,,,,,,105,-115,-115,,105,,,,,,105
DQ,67.5,Андрей Коркин,Andrey Korkin,B,Raw,M,1986-03-14,Open,65.55,,,,,,-102.5,-107.5,-107.5,,,,,,,,
1,110,Алексей Довбня,Aleksey Dovbnya,B,Raw,M,1983-06-12,Open,109.75,,,,,,-185,-185,185,,185,,,,,,185
2,110,Сергей Файлер,Sergey Fayler,B,Raw,M,1984-04-02,Open,108.2,,,,,,-170,170,-175,,170,,,,,,170
3,110,Сергей Петров,Sergey Petrov,B,Raw,M,1980-08-07,Open,106.95,,,,,,160,167.5,-172.5,,167.5,,,,,,167.5
4,110,Александр Осокин,Aleksandr Osokin,B,Raw,M,1982-03-13,Open,108.1,,,,,,160,167.5,-172.5,,167.5,,,,,,167.5
5,110,Михаил Сидоров,Mikhail Sidorov,B,Raw,M,1983-09-06,Open,108.2,,,,,,140,-147.5,,,140,,,,,,140
1,82.5,тимур дудкин,Timur Dudkin,B,Raw,M,1996-03-06,Open,77.85,,,,,,145,152.5,-157.5,,152.5,,,,,,152.5
2,82.5,Алексей Слобожанин,Aleksey Slobozhanin,B,Raw,M,1985-06-20,Open,82,,,,,,147.5,150,-152.5,,150,,,,,,150
3,82.5,Александр токарь,Aleksandr Tokar,B,Raw,M,1985-06-24,Open,77.9,,,,,,130,140,-147.5,,140,,,,,,140
4,82.5,Евгений Аралов,Evgeniy Aralov,B,Raw,M,1982-03-04,Open,79.6,,,,,,120,130,137.5,,137.5,,,,,,137.5
5,82.5,Максим Погорельцев,Maksim Pogoreltsev,B,Raw,M,1985-09-25,Open,79.9,,,,,,135,-140,-140,,135,,,,,,135
6,82.5,Михаил Каргин,Mikhail Kargin,B,Raw,M,1989-05-13,Open,77.05,,,,,,105,110,-117.5,,110,,,,,,110
1,75,Александр Александров,Aleksandr Aleksandrov,B,Raw,M,1979-07-19,Open,74.65,,,,,,167.5,175,182.5,-186,182.5,,,,,,182.5
2,75,Юрий Ногай,Yuriy Nogay,B,Raw,M,1983-05-26,Open,74.55,,,,,,147.5,155,-160,,155,,,,,,155
3,75,Антон Кожедуб,Anton Kozhedub,B,Raw,M,1986-07-11,Open,73.05,,,,,,-130,132.5,137.5,,137.5,,,,,,137.5
4,75,Павел Костюрин,Pavel Kostyurin,B,Raw,M,1989-12-29,Open,73.75,,,,,,-122.5,122.5,-127.5,,122.5,,,,,,122.5
5,75,Денис Погорельцев,Denis Pogoreltsev,B,Raw,M,1987-07-03,Open,73.7,,,,,,115,120,-125,,120,,,,,,120
DQ,75,Виталий Игумнов,Vitaliy Igumnov,B,Raw,M,1978-07-09,Open,74.6,,,,,,-120,-130,-130,,,,,,,,
1,125,Роман Никишин,Roman Nikishin,B,Raw,M,1982-01-19,Open,125,,,,,,185,-195,195,,195,,,,,,195
2,125,Сергей Бабин,Sergey Babin,B,Raw,M,1981-11-18,Open,113.6,,,,,,162.5,172.5,177.5,,177.5,,,,,,177.5
1,56,Батурхан Мухаметов,Baturkhan Mukhametov,B,Raw,M,1999-07-13,Open,55.65,,,,,,130,-140,-140,,130,,,,,,130
1,44,Никита Рубанов,Nikita Rubanov,B,Raw,M,2005-06-09,Teens 13,27.85,,,,,,15,-20,-20,,15,,,,,,15
1,60,Иван Рукин,Ivan Rukin,B,Raw,M,2000-08-14,Teens 14-16,58.95,,,,,,60,70,82.5,,82.5,,,,,,82.5
2,60,Дмитрий Федоров,Dmitriy Fedorov,B,Raw,M,2001-09-01,Teens 14-16,59,,,,,,60,65,67.5,,67.5,,,,,,67.5
1,52,Никита Егишев,Nikita Egishev,B,Raw,M,2002-06-29,Teens 14-16,49.55,,,,,,35,45,-57.5,,45,,,,,,45
1,90,Константин Колачев,Konstantin Kolachev,B,Raw,M,2001-11-20,Teens 14-16,88.55,,,,,,107.5,115,-120,,115,,,,,,115
1,75,Илья Ощепков,Ilya Oshchepkov,B,Raw,M,2000-01-21,Teens 14-16,70,,,,,,70,80,-82.5,,80,,,,,,80
2,75,Эдуард Воробьев,Eduard Vorobev,B,Raw,M,2001-04-20,Teens 14-16,71.4,,,,,,60,72.5,-82.5,,72.5,,,,,,72.5
1,90,Юрий Попа,Yuriy Popa,B,Raw,M,1993-01-10,Juniors,88.05,,,,,,155,165,-177.5,,165,,,,,,165
2,90,Иван Рубанов,Ivan Rubanov,B,Raw,M,1995-01-01,Juniors,89.35,,,,,,130,137.5,-142.5,,137.5,,,,,,137.5
DQ,90,Александр Стрижко,Aleksandr Strizhko,B,Raw,M,1995-06-21,Juniors,90,,,,,,-137.5,-137.5,-142.5,,,,,,,,
1,110,максим ковтун,Maksim Kovtun,B,Raw,M,1996-05-29,Juniors,105.4,,,,,,-140,140,147.5,,147.5,,,,,,147.5
1,82.5,тимур дудкин,Timur Dudkin,B,Raw,M,1996-03-06,Juniors,77.85,,,,,,145,152.5,-157.5,,152.5,,,,,,152.5
2,82.5,Матвей Мишулин,Matvey Mishulin,B,Raw,M,1995-08-24,Juniors,82.3,,,,,,137.5,-145,-145,,137.5,,,,,,137.5
3,82.5,Валерий Лебедев,Valeriy Lebedev,B,Raw,M,1992-12-24,Juniors,80.65,,,,,,-122.5,130,132.5,,132.5,,,,,,132.5
4,82.5,Александр Иванов,Aleksandr Ivanov,B,Raw,M,1996-05-20,Juniors,80.95,,,,,,-125,125,130,,130,,,,,,130
1,75,Роман Коротких,Roman Korotkikh,B,Raw,M,1994-08-21,Juniors,73.1,,,,,,145,150,152.5,,152.5,,,,,,152.5
1,67.5,Исмаил Джумаев,Ismail Dzhumaev,B,Raw,M,1996-02-23,Juniors,66.5,,,,,,105,-115,-115,,105,,,,,,105
1,90,Юрий Рубанов,Yuriy Rubanov,B,Raw,M,1967-11-28,Masters 40-49,88.35,,,,,,170,180,182.5,,182.5,,,,,,182.5
2,90,Сергей Воронец,Sergey Voronets,B,Raw,M,1971-10-16,Masters 40-49,89.95,,,,,,160,170,-175,,170,,,,,,170
3,90,Валерий Кузнецов,Valeriy Kuznetsov,B,Raw,M,1974-01-23,Masters 40-49,87.6,,,,,,120,130,-135,,130,,,,,,130
1,140,Сергей Кураков,Sergey Kurakov,B,Raw,M,1971-04-16,Masters 40-49,140,,,,,,165,172.5,180,,180,,,,,,180
1,75,Юрий Агеев,Yuriy Ageev,B,Raw,M,1975-05-22,Masters 40-49,72.5,,,,,,130,135,-137.5,,135,,,,,,135
2,75,Александр Атаманов,Aleksandr Atamanov,B,Raw,M,1975-10-03,Masters 40-49,73.45,,,,,,107.5,110,-115,,110,,,,,,110
1,100,Вячеслав Кириченко,Vyacheslav Kirichenko,B,Raw,M,1975-01-31,Masters 40-49,98.6,,,,,,145,155,162.5,,162.5,,,,,,162.5
2,100,Владимир Винтер,Vladimir Vinter,B,Raw,M,1972-10-24,Masters 40-49,97.8,,,,,,155,-160,-162.5,,155,,,,,,155
3,100,Михаил Батуков,Mikhail Batukov,B,Raw,M,1972-09-10,Masters 40-49,99.9,,,,,,150,155,-162.5,,155,,,,,,155
4,100,Василий Скляров,Vasiliy Sklyarov,B,Raw,M,1974-12-29,Masters 40-49,96.8,,,,,,125,130,-135,,130,,,,,,130
DQ,100,Михаил Киселев,Mikhail Kiselev,B,Raw,M,1976-05-29,Masters 40-49,98.35,,,,,,-180,-180,-180,,,,,,,,
1,110,Александр Грязнов,Aleksandr Gryaznov,B,Raw,M,1975-06-08,Masters 40-49,108.05,,,,,,145,152.5,160,,160,,,,,,160
DQ,110,Дмитрий Мельков,Dmitriy Melkov,B,Raw,M,1971-03-18,Masters 40-49,108.75,,,,,,-160,-160,-160,,,,,,,,
1,82.5,Максим Михаэлис,Maksim Mikhaelis,B,Raw,M,1974-11-15,Masters 40-49,82.25,,,,,,120,-125,-130,,120,,,,,,120
DQ,82.5,Леонид Александров,Leonid Aleksandrov,B,Raw,M,1971-07-15,Masters 40-49,81.35,,,,,,-155,-155,-155,,,,,,,,
1,110,Данила Сапов,Danila Sapov,B,Raw,M,1999-07-10,Teens 17-19,103.25,,,,,,155,-167.5,-167.5,,155,,,,,,155
1,56,Батурхан Мухаметов,Baturkhan Mukhametov,B,Raw,M,1999-07-13,Teens 17-19,55.65,,,,,,130,-140,-140,,130,,,,,,130
1,140,Сергей Стукалов,Sergey Stukalov,B,Raw,M,1962-07-07,Masters 50-59,127.4,,,,,,-157.5,157.5,162.5,,162.5,,,,,,162.5
1,110,Михаил Ищечкин,Mikhail Ishchechkin,B,Raw,M,1962-01-22,Masters 50-59,105.8,,,,,,140,145,-147.5,,145,,,,,,145
1,60,Людмила Бачинина,Lyudmila Bachinina,B,Raw,F,1985-09-01,Open,60,,,,,,45,50,-52.5,,50,,,,,,50
2,60,Татьяна Чепко,Tatyana Chepko,B,Raw,F,1980-04-10,Open,58.45,,,,,,35,42.5,-45,,42.5,,,,,,42.5
1,56,Анна Вишняк,Anna Vishnyak,B,Raw,F,1984-12-12,Open,54.45,,,,,,77.5,-82.5,-85,,77.5,,,,,,77.5
1,48,Ирина Фарьянова,Irina Faryanova,B,Raw,F,1989-07-30,Open,47.38,,,,,,-52.5,-55,55,,55,,,,,,55
2,48,Валерия Казанцева,Valeriya Kazantseva,B,Raw,F,1992-11-30,Open,47.75,,,,,,45,50,-55,,50,,,,,,50
3,48,Елена Русских,Elena Russkikh,B,Raw,F,1986-06-09,Open,47.25,,,,,,-45,45,-47.5,,45,,,,,,45
1,67.5,Анна Слободчикова,Anna Slobodchikova,B,Raw,F,1981-06-07,Open,66.35,,,,,,75,80,-85,,80,,,,,,80
2,67.5,Валентина Евсюкова,Valentina Evsyukova,B,Raw,F,1992-10-12,Open,66.6,,,,,,67.5,-72.5,72.5,,72.5,,,,,,72.5
3,67.5,Татьяна Гаркунова,Tatyana Garkunova,B,Raw,F,1970-09-24,Open,67.3,,,,,,47.5,52.5,,,52.5,,,,,,52.5
DQ,67.5,Юлия Ряднова,Yuliya Ryadnova,B,Raw,F,1988-10-15,Open,65.2,,,,,,-65,-65,-65,,,,,,,,
1,75,Ирина Панина,Irina Panina,B,Raw,F,1977-05-20,Open,73.3,,,,,,70,75,-80,,75,,,,,,75
1,52,Виктория Шароватова,Viktoriya Sharovatova,B,Raw,F,2000-04-13,Open,51.5,,,,,,60,-70,-70,,60,,,,,,60
2,52,Анна Краснянская,Anna Krasnyanskaya,B,Raw,F,1983-01-21,Open,51.75,,,,,,-50,50,-60,,50,,,,,,50
1,44,Ирина Хвостова,Irina Khvostova,B,Raw,F,1988-11-07,Open,42.1,,,,,,30,35,-42.5,,35,,,,,,35
1,48,Нонна Старостина,Nonna Starostina,B,Raw,F,1969-12-02,Masters 40-49,46.5,,,,,,40,-45,-45,,40,,,,,,40
1,67.5,Татьяна Гаркунова,Tatyana Garkunova,B,Raw,F,1970-09-24,Masters 40-49,67.3,,,,,,47.5,52.5,-55,,52.5,,,,,,52.5
1,82.5,Татьяна Волчкова,Tatyana Volchkova,B,Raw,F,1969-11-07,Masters 40-49,82.25,,,,,,62.5,65,67.5,,67.5,,,,,,67.5
1,56,Анна Броцман,Anna Brotsman,B,Raw,F,2000-03-12,Teens 14-16,55.95,,,,,,35,42.5,-57.5,,42.5,,,,,,42.5
1,52,Виктория Шароватова,Viktoriya Sharovatova,B,Raw,F,2000-04-13,Teens 14-16,51.5,,,,,,60,-70,-70,,60,,,,,,60
2,52,Варвара Лычко,Varvara Lychko,B,Raw,F,2000-11-03,Teens 14-16,48.6,,,,,,-50,52.5,-60,,52.5,,,,,,52.5
1,56,Татьяна Гашникова,Tatyana Gashnikova,B,Raw,F,1994-01-12,Juniors,54.72,,,,,,50,52.5,-55,,52.5,,,,,,52.5
1,48,Ольга Ситкова,Olga Sitkova,B,Raw,F,1994-05-05,Juniors,47.35,,,,,,50,52.5,-55,,52.5,,,,,,52.5
1,67.5,Оксана Чудная,Oksana Chudnaya,S,Wraps,F,1977-05-30,Open,65.85,115,-122.5,-122.5,,115,,,,,,,,,,,115
1,52,Екатерина Кудрявцева,Ekaterina Kudryavtseva,S,Wraps,F,1988-03-08,Open,51.75,95,-102.5,105,,105,,,,,,,,,,,105
1,60,Александр Мамаев,Aleksandr Mamaev,D,Raw,M,1985-02-24,Open,60,,,,,,,,,,,140,-160,160,,160,160
1,75,Евгений Быков,Evgeniy Bykov,D,Raw,M,1984-08-02,Open,74.6,,,,,,,,,,,225,245,252.5,,252.5,252.5
2,75,Павел Костюрин,Pavel Kostyurin,D,Raw,M,1989-12-29,Open,73.3,,,,,,,,,,,170,180,-190,,180,180
1,110,Антон Андреев,Anton Andreev,D,Raw,M,1983-12-18,Open,108.3,,,,,,,,,,,155,-165,170,,170,170
1,82.5,Андрей Томасик,Andrey Tomasik,D,Raw,M,1987-12-14,Open,81.65,,,,,,,,,,,230,240,247.5,,247.5,247.5
2,82.5,Михаил Телембовский,Mikhail Telembovskiy,D,Raw,M,1987-08-06,Open,81.3,,,,,,,,,,,215,225,-232.5,,225,225
3,82.5,Максим Волонтырь,Maksim Volontyr,D,Raw,M,1983-12-30,Open,82.4,,,,,,,,,,,160,-180,-190,,160,160
1,100,Игорь Кощеев,Igor Koshcheev,D,Raw,M,1979-07-23,Open,91.55,,,,,,,,,,,230,240,245,,245,245
2,100,Вячеслав Николаев,Vyacheslav Nikolaev,D,Raw,M,1956-07-10,Open,97.95,,,,,,,,,,,200,220,-232.5,,220,220
1,90,Андрей Мосенко,Andrey Mosenko,D,Raw,M,1981-09-09,Open,88.95,,,,,,,,,,,190,200,-210,,200,200
1,67.5,Тимофей Ишимов,Timofey Ishimov,D,Raw,M,1990-12-01,Open,67.5,,,,,,,,,,,150,205,215,,215,215
1,90,Владислав Горецкий,Vladislav Goretskiy,D,Raw,M,1995-09-19,Juniors,88.8,,,,,,,,,,,260,280,-292.5,,280,280
2,90,Никита Новожилов,Nikita Novozhilov,D,Raw,M,1993-05-17,Juniors,87.55,,,,,,,,,,,225,-232.5,-232.5,,225,225
3,90,Максим Котов,Maksim Kotov,D,Raw,M,1996-10-13,Juniors,89.75,,,,,,,,,,,210,225,-230,,225,225
1,82.5,Иброхимджон Отахонов,Ibrokhimdzhon Otakhonov,D,Raw,M,1994-07-18,Juniors,80.85,,,,,,,,,,,-160,170,180,,180,180
1,67.5,Михаил Лазуткин,Mikhail Lazutkin,D,Raw,M,1995-05-02,Juniors,65.05,,,,,,,,,,,180,,,,180,180
1,100,Дмитрий Кем,Dmitriy Kem,D,Raw,M,1971-12-08,Masters 40-49,96.9,,,,,,,,,,,180,195,205,,205,205
1,56,Никита Шипулин,Nikita Shipulin,D,Raw,M,1999-08-25,Teens 17-19,54.6,,,,,,,,,,,155,-165,-165,,155,155
1,60,Егор Вебер,Egor Veber,D,Raw,M,1997-11-15,Teens 17-19,59.8,,,,,,,,,,,-160,-160,160,,160,160
1,67.5,Евгений Сыскин,Evgeniy Syskin,D,Raw,M,2002-03-13,Teens 14-16,62.5,,,,,,,,,,,85,97.5,100,,100,100
1,56,Павел Бубнов,Pavel Bubnov,D,Raw,M,2003-07-29,Teens 13,54.75,,,,,,,,,,,65,75,80,,80,80
1,100,Вячеслав Николаев,Vyacheslav Nikolaev,D,Raw,M,1956-07-10,Masters 60-69,97.95,,,,,,,,,,,200,220,-232.5,,220,220
1,60,Анна Новоселова,Anna Novoselova,D,Raw,F,1992-10-06,Open,59.4,,,,,,,,,,,112.5,130,-135,,130,130
2,60,Ольга Кузнецова,Olga Kuznetsova,D,Raw,F,1989-08-05,Open,59.6,,,,,,,,,,,105,112.5,117.5,,117.5,117.5
3,60,Ольга Гламаздина,Olga Glamazdina,D,Raw,F,1981-02-28,Open,59.8,,,,,,,,,,,115,-130,-130,,115,115
1,67.5,Оксана Чудная,Oksana Chudnaya,D,Raw,F,1977-05-30,Open,65.85,,,,,,,,,,,115,130,137.5,,137.5,137.5
1,56,Анна Броцман,Anna Brotsman,D,Raw,F,2000-03-12,Teens 14-16,55.95,,,,,,,,,,,-60,60,75,,75,75
1,44,Наталья Одинцова,Natalya Odintsova,D,Raw,F,2002-08-14,Teens 14-16,42.8,,,,,,,,,,,92.5,-100,-100,,92.5,92.5
1,52,Елизавета Горбатова,Elizaveta Gorbatova,D,Raw,F,1995-10-07,Juniors,50.1,,,,,,,,,,,102.5,115,-130,,115,115
1,67.5,Елена Мурачева,Elena Muracheva,D,Raw,F,1993-03-15,Juniors,64.5,,,,,,,,,,,70,80,90,,90,90
1,56,Юлия Босоногова,Yuliya Bosonogova,D,Raw,F,1999-08-24,Teens 17-19,56,,,,,,,,,,,60,75,80,,80,80
1,90,Олег Челубеев,Oleg Chelubeev,B,Raw,M,1984-01-21,Open,89.1,,,,,,85,95,105,,105,,,,,,105
2,90,Дмитрий Иванушкин,Dmitriy Ivanushkin,B,Raw,M,1990-05-23,Open,87.75,,,,,,80,85,-90,,85,,,,,,85
1,82.5,Александр Рогов,Aleksandr Rogov,B,Raw,M,1973-01-24,Open,77.2,,,,,,117.5,120,125,,125,,,,,,125
2,82.5,Михаил Наливанский,Mikhail Nalivanskiy,B,Raw,M,1990-04-04,Open,78.8,,,,,,95,100,110,,110,,,,,,110
1,60,Иван Ревенко,Ivan Revenko,B,Raw,M,1986-04-12,Open,60,,,,,,80,85,90,-92.5,90,,,,,,90
1,75,Сергей Григорьев,Sergey Grigorev,B,Raw,M,1954-08-22,Open,73.6,,,,,,100,110,-112.5,,110,,,,,,110
2,75,Андрей Солодкин,Andrey Solodkin,B,Raw,M,1989-08-25,Open,71.4,,,,,,90,95,100,,100,,,,,,100
3,75,Илья Анисимов,Ilya Anisimov,B,Raw,M,1985-02-19,Open,74.9,,,,,,70,75,-80,,75,,,,,,75
1,100,Владимир Визгин,Vladimir Vizgin,B,Raw,M,1952-04-25,Open,97.35,,,,,,135,142.5,147.5,,147.5,,,,,,147.5
2,100,Максим Чистяков,Maksim Chistyakov,B,Raw,M,1989-08-09,Open,99.7,,,,,,75,-80,-80,,75,,,,,,75
1,67.5,Владислав Быков,Vladislav Bykov,B,Raw,M,1994-09-28,Open,63.4,,,,,,45,55,60,,60,,,,,,60
1,125,Денис Гайдученя,Denis Gayduchenya,B,Raw,M,1980-01-19,Open,119.6,,,,,,130,140,145,,145,,,,,,145
1,75,Сергей Заварухин,Sergey Zavarukhin,B,Raw,M,1973-11-03,Masters 40-49,73.6,,,,,,115,125,132.5,,132.5,,,,,,132.5
1,67.5,Дарья Гараева,Darya Garaeva,SBD,Multi-ply,F,1999-10-07,Teens 17-19,64.7,150,-160,160,,160,80,-90,-90,,80,120,135,140,,140,380
1,90,Артем Быховец,Artem Bykhovets,B,Multi-ply,M,1983-07-19,Open,83.55,,,,,,-212.5,212.5,-222.5,,212.5,,,,,,212.5
2,90,Денис Елисеев,Denis Eliseev,B,Multi-ply,M,1981-08-25,Open,89.7,,,,,,-170,-170,180,,180,,,,,,180
1,82.5,Даниил Ламанов,Daniil Lamanov,B,Multi-ply,M,1987-08-17,Open,80.6,,,,,,215,230,-242.5,,230,,,,,,230
2,82.5,Андрей Томасик,Andrey Tomasik,B,Multi-ply,M,1987-12-14,Open,81.65,,,,,,-180,180,-190,,180,,,,,,180
1,75,Александр Иванов,Aleksandr Ivanov,B,Multi-ply,M,1987-01-18,Open,74.2,,,,,,-180,180,-195,,180,,,,,,180
1,110,Андрей Башков,Andrey Bashkov,B,Multi-ply,M,1981-09-23,Open,109.6,,,,,,240,-260,260,,260,,,,,,260
2,110,Дмитрий Дымов,Dmitriy Dymov,B,Multi-ply,M,1984-07-21,Open,107.8,,,,,,220,230,-240,,230,,,,,,230
1,100,Василий Мандзюк,Vasiliy Mandzyuk,B,Multi-ply,M,1971-08-08,Masters 40-49,98.55,,,,,,190,202.5,-210,,202.5,,,,,,202.5
2,100,Евгений Юдин,Evgeniy Yudin,B,Multi-ply,M,1970-07-07,Masters 40-49,97.75,,,,,,140,-155,-155,,140,,,,,,140
1,90,Кирилл Забурнягин,Kirill Zaburnyagin,B,Multi-ply,M,1995-04-21,Juniors,88.45,,,,,,155,165,-170,,165,,,,,,165
1,100,Владислав Михайлов,Vladislav Mikhaylov,B,Multi-ply,M,1997-07-12,Teens 17-19,98.75,,,,,,-192.5,192.5,-200,,192.5,,,,,,192.5
1,67.5,Максим Ковалёв,Maksim Kovalyov,D,Multi-ply,M,1987-01-28,Open,64,,,,,,,,,,,180,200,-215,,200,200
1,82.5,Сергей Федосеев,Sergey Fedoseev,D,Multi-ply,M,1982-01-18,Open,78.5,,,,,,,,,,,160,175,-180,,175,175
1,90,Дмитрий Шерин,Dmitriy Sherin,B,Single-ply,M,1991-02-17,Open,89.85,,,,,,-220,-220,220,,220,,,,,,220
2,90,Вадим Старостенко,Vadim Starostenko,B,Single-ply,M,1988-03-01,Open,86.95,,,,,,-165,165,172.5,,172.5,,,,,,172.5
DQ,90,Данила омельченко,Danila Omelchenko,B,Single-ply,M,1980-09-27,Open,89.4,,,,,,-197.5,-197.5,-197.5,,,,,,,,
1,100,Иван Фролов,Ivan Frolov,B,Single-ply,M,1988-12-15,Open,90.65,,,,,,200,212.5,-215,,212.5,,,,,,212.5
2,100,Вячеслав Николаев,Vyacheslav Nikolaev,B,Single-ply,M,1956-07-10,Open,97.95,,,,,,-172.5,172.5,187.5,,187.5,,,,,,187.5
DQ,100,Данил Крей,Danil Krey,B,Single-ply,M,1985-02-18,Open,98.85,,,,,,-197.5,-212.5,-212.5,,,,,,,,
1,60,Александр Мамаев,Aleksandr Mamaev,B,Single-ply,M,1985-02-24,Open,60,,,,,,95,105,-120,,105,,,,,,105
1,82.5,Артем Быховец,Artem Bykhovets,B,Single-ply,M,1983-07-19,Open,82.5,,,,,,190,205,225,,225,,,,,,225
2,82.5,Максим Волонтырь,Maksim Volontyr,B,Single-ply,M,1983-12-30,Open,82.4,,,,,,145,162.5,-170,,162.5,,,,,,162.5
3,82.5,Сергей Федосеев,Sergey Fedoseev,B,Single-ply,M,1982-01-18,Open,78.5,,,,,,135,-147.5,-147.5,,135,,,,,,135
DQ,82.5,Артем Алексеев,Artem Alekseev,B,Single-ply,M,1986-06-30,Open,81.4,,,,,,-177.5,-177.5,-177.5,,,,,,,,
1,67.5,Евгений Дербенев,Evgeniy Derbenev,B,Single-ply,M,1990-08-09,Open,66.15,,,,,,157.5,-175,,,157.5,,,,,,157.5
2,67.5,Андрей Колбин,Andrey Kolbin,B,Single-ply,M,1984-07-22,Open,67.15,,,,,,-137.5,137.5,-157.5,,137.5,,,,,,137.5
1,75,Денис Шипулин,Denis Shipulin,B,Single-ply,M,1981-08-07,Open,71.45,,,,,,172.5,180,187.5,,187.5,,,,,,187.5
1,100,Вячеслав Николаев,Vyacheslav Nikolaev,B,Single-ply,M,1956-07-10,Masters 60-69,97.95,,,,,,-172.5,172.5,187.5,,187.5,,,,,,187.5
1,110,Евгений Русаков,Evgeniy Rusakov,B,Single-ply,M,1959-10-14,Masters 50-59,109.65,,,,,,182.5,-195,-195,,182.5,,,,,,182.5
1,60,Екатерина Кузьмичева,Ekaterina Kuzmicheva,B,Single-ply,F,1996-01-23,Open,60,,,,,,105,110,115,,115,,,,,,115
2,60,Алина Дубровина,Alina Dubrovina,B,Single-ply,F,1992-09-01,Open,60,,,,,,97.5,105,112.5,,112.5,,,,,,112.5
3,60,Анна Новоселова,Anna Novoselova,B,Single-ply,F,1992-10-06,Open,59.4,,,,,,80,-90,-90,,80,,,,,,80
4,60,Людмила Бачинина,Lyudmila Bachinina,B,Single-ply,F,1986-09-01,Open,60,,,,,,60,-70,-70,,60,,,,,,60
1,56,Дарья Ялама,Darya Yalama,B,Single-ply,F,1987-03-25,Open,55.8,,,,,,72.5,-82.5,-82.5,,72.5,,,,,,72.5
DQ,82.5,елена Николенко,Elena Nikolenko,B,Single-ply,F,1978-06-15,Open,76.7,,,,,,-105,-105,-105,,,,,,,,
DQ,67.5,Валентина Евсюкова,Valentina Evsyukova,B,Single-ply,F,1992-10-12,Open,66.6,,,,,,-82.5,-82.5,-82.5,,,,,,,,
1,100,Виджай Шаиков,Vidzhay Shaikov,SBD,Wraps,M,1990-07-14,Open,98.25,270,-285,-285,,270,170,185,190,,190,270,285,-300,,285,745
2,100,Расим Юсупов,Rasim Yusupov,SBD,Wraps,M,1992-12-07,Open,99.4,-210,210,235,,235,160,167.5,175,,175,-290,300,315,,315,725
3,100,Кирилл Кузнецов,Kirill Kuznetsov,SBD,Wraps,M,1991-08-26,Open,100,240,255,-270,,255,180,-190,190,,190,-245,-245,245,,245,690
4,100,Виталий Доценко,Vitaliy Dotsenko,SBD,Wraps,M,1981-06-09,Open,98.2,-210,220,230,,230,160,-167.5,-167.5,,160,255,260,-270,,260,650
5,100,Руслан Гулиев,Ruslan Guliev,SBD,Wraps,M,1988-08-09,Open,98.1,180,-190,-190,,180,130,-132.5,-132.5,,130,-200,200,210,,210,520
DQ,100,Роман Юшков,Roman Yushkov,SBD,Wraps,M,1992-06-29,Open,97.2,-210,-210,-210,,,,,,,,,,,,,
1,110,Сергей Денисевич,Sergey Denisevich,SBD,Wraps,M,1986-11-21,Open,104.6,-240,-240,240,,240,180,185,-190,,185,265,280,-290,,280,705
2,110,Иван Каплун,Ivan Kaplun,SBD,Wraps,M,1991-02-17,Open,102,220,230,235,,235,175,185,195,,195,230,250,267.5,,267.5,697.5
3,110,Антон Кацюк,Anton Katsyuk,SBD,Wraps,M,1989-04-20,Open,106.1,-190,190,-220,,190,-150,160,-170,,160,230,240,250,,250,600
4,110,Антон Зотов,Anton Zotov,SBD,Wraps,M,1990-07-13,Open,108.5,210,217.5,222.5,,222.5,110,117.5,-122.5,,117.5,250,-275,-275,,250,590
5,110,Антон Зотов,Anton Zotov,SBD,Wraps,M,1990-07-13,Open,108.5,210,217.5,222.5,,222.5,110,117.5,-122.5,,117.5,250,-275,-275,,250,590
6,110,Александр Бахман,Aleksandr Bakhman,SBD,Wraps,M,1989-07-29,Open,108.2,190,200,-210,,200,160,175,-180,,175,-190,190,210,,210,585
7,110,Денис Исаков,Denis Isakov,SBD,Wraps,M,1982-08-14,Open,109.1,190,200,210,,210,135,-145,145,,145,200,215,225,,225,580
DQ,110,Даниил Баженов,Daniil Bazhenov,SBD,Wraps,M,1990-05-12,Open,102.55,200,210,220,,220,160,-165,-165,,160,-210,-220,,,,
1,90,Вячеслав Алексеев,Vyacheslav Alekseev,SBD,Wraps,M,1990-03-07,Open,90,300,317.5,322.5,,322.5,150,160,-170,,160,290,310,-322.5,,310,792.5
2,90,Сергей Волгин,Sergey Volgin,SBD,Wraps,M,1986-10-11,Open,89.3,155,170,180,,180,140,150,-160,,150,220,240,250,,250,580
3,90,Сергей Богачук,Sergey Bogachuk,SBD,Wraps,M,1989-05-30,Open,89.85,190,-197.5,-197.5,,190,127.5,-132.5,132.5,,132.5,220,240,-245,,240,562.5
1,75,Антон Коропец,Anton Koropets,SBD,Wraps,M,1988-04-30,Open,73.2,160,170,-180,,170,100,112.5,-120,,112.5,-180,192.5,200,,200,482.5
2,75,Владимир Хорев,Vladimir Khorev,SBD,Wraps,M,1991-04-18,Open,75,160,167.5,170,,170,115,122.5,127.5,,127.5,165,172.5,177.5,,177.5,475
3,75,Роман Падерин,Roman Paderin,SBD,Wraps,M,1988-02-16,Open,73.8,95,102.5,110,,110,-70,70,72.5,,72.5,115,130,140,,140,322.5
1,125,Егор Шилов,Egor Shilov,SBD,Wraps,M,1996-12-23,Open,111.7,240,255,-265,,255,130,-137.5,137.5,,137.5,275,287.5,-295,,287.5,680
2,125,Виктор Литвинов,Viktor Litvinov,SBD,Wraps,M,1982-02-07,Open,110.45,230,240,-250,,240,150,160,165,,165,230,240,250,,250,655
3,125,Сергей Фефлер,Sergey Fefler,SBD,Wraps,M,1977-09-12,Open,118.1,170,180,190,,190,105,110,115,,115,200,215,-230,,215,520
4,125,Алексей Боровиков,Aleksey Borovikov,SBD,Wraps,M,1991-09-04,Open,117.5,125,140,-152.5,,140,95,110,117.5,,117.5,195,210,-220,,210,467.5
1,100,Андрей Васильковский,Andrey Vasilkovskiy,SBD,Wraps,M,1994-05-03,Juniors,99.9,-210,210,230,,230,160,170,-175,,170,240,250,-260,,250,650
2,100,Кирилл Яковлев,Kirill Yakovlev,SBD,Wraps,M,1995-02-04,Juniors,98.65,200,210,-217.5,,210,135,142.5,-147.5,,142.5,225,235,-242.5,,235,587.5
DQ,100,Арсений Алиев,Arseniy Aliev,SBD,Wraps,M,1993-06-05,Juniors,93.7,-200,-200,-200,,,-130,,,,,-210,,,,,
1,82.5,Павел Митраков,Pavel Mitrakov,SBD,Wraps,M,1994-07-12,Juniors,82.3,195,207.5,220,,220,110,120,130,,130,220,235,250,,250,600
2,82.5,Владислав Долгополов,Vladislav Dolgopolov,SBD,Wraps,M,1995-07-04,Juniors,79.95,170,-180,180,,180,150,-152.5,-152.5,,150,210,220,230,,230,560
1,110,Александр Клемешов,Aleksandr Klemeshov,SBD,Wraps,M,1995-05-14,Juniors,108.55,230,240,-250,,240,160,-167.5,170,,170,265,-280,,,265,675
1,75,Максим Шаповалов,Maksim Shapovalov,SBD,Wraps,M,1994-05-18,Juniors,72.75,135,140,147.5,,147.5,75,85,-90,,85,130,145,-152.5,,145,377.5
1,90,Роман Фисков,Roman Fiskov,SBD,Wraps,M,1998-04-30,Teens 17-19,86.9,220,230,-235,,230,107.5,112.5,115,,115,220,240,-245,,240,585
2,90,Евгений Распопин,Evgeniy Raspopin,SBD,Wraps,M,1998-02-17,Teens 17-19,88.6,160,167.5,175,,175,105,112.5,117.5,,117.5,180,200,210,,210,502.5
DQ,75,Александр Агафонов,Aleksandr Agafonov,SBD,Wraps,M,1998-06-30,Teens 17-19,73.15,-150,150,-170,,150,-110,110,-115,,110,-210,-210,-210,,,
1,67.5,Евгений Толмачев,Evgeniy Tolmachev,SBD,Wraps,M,1998-04-19,Teens 17-19,67.3,195,200,202.5,-207.5,202.5,120,-130,130,,130,210,227.5,,,227.5,560
2,67.5,Андрей Достовалов,Andrey Dostovalov,SBD,Wraps,M,1997-06-30,Teens 17-19,65.75,105,120,-130,,120,67.5,75,-80,,75,167.5,182.5,192.5,,192.5,387.5
1,125,Егор Шилов,Egor Shilov,SBD,Wraps,M,1996-12-23,Teens 17-19,111.7,240,255,-265,,255,130,-137.5,137.5,,137.5,275,287.5,-295,,287.5,680
1,60,Алексей Старков,Aleksey Starkov,SBD,Wraps,M,1998-05-12,Teens 17-19,59.38,125,140,-150,,140,80,87.5,90,,90,165,180,-190,,180,410
1,67.5,Алексей Кирдячкин,Aleksey Kirdyachkin,SBD,Wraps,M,2000-01-21,Teens 14-16,66.15,115,125,132.5,,132.5,72.5,77.5,-85,,77.5,150,160,-170,,160,370
1,52,Руслан Мандрик,Ruslan Mandrik,SBD,Wraps,M,2002-06-27,Teens 14-16,51.3,85,-95,-95,,85,47.5,52.5,-57.5,,52.5,95,105,110,,110,247.5
1,110,Олег Ефремов-Отченаш,Oleg Efremov-Otchenash,SBD,Wraps,M,1969-12-31,Masters 40-49,106.5,200,210,220,230.5,220,130,135,140,,140,200,215,225,,225,585
1,100,Владимир Пануев,Vladimir Panuev,SBD,Wraps,M,1962-10-22,Masters 50-59,99.6,190,-200,,,190,130,137.5,,,137.5,220,-230,,,220,547.5
1,67.5,Николай Емельянов,Nikolay Emelyanov,SBD,Wraps,M,1963-12-30,Masters 50-59,66.3,110,120,,,120,90,-100,,,90,150,165,,,165,375
1,100,Полина Ефимкина,Polina Efimkina,SBD,Wraps,F,1996-02-06,Juniors,100,80,87.5,-95,,87.5,40,45,50,,50,100,110,120,,120,257.5
1,67.5,Аделина Мингадельшина,Adelina Mingadelshina,SBD,Wraps,F,1995-10-12,Juniors,62.45,50,55,60,,60,30,35,37.5,,37.5,75,80,85,,85,182.5
1,52,Валерия Сойчик,Valeriya Soychik,SBD,Wraps,F,1999-04-02,Open,51.9,-60,60,67.5,,67.5,40,-45,-47.5,,40,-85,85,-95,,85,192.5
1,67.5,Галина Абрамова,Galina Abramova,SBD,Wraps,F,1989-06-19,Open,67.4,170,185,-195,,185,90,100,102.5,-105,102.5,222.5,242.5,255,,255,542.5
2,67.5,Марьяна Ефремова-Отченаш,Maryana Efremova-Otchenash,SBD,Wraps,F,1977-04-09,Open,63.3,65,72.5,77.5,,77.5,37.5,40,42.5,,42.5,85,92.5,95,,95,215
1,82.5,Анастасия Остапенко,Anastasiya Ostapenko,SBD,Wraps,F,1998-04-19,Open,77,120,130,140,,140,70,75,80,,80,140,155,-165,,155,375
1,90,Наталья Дубровских,Natalya Dubrovskikh,SBD,Wraps,F,1985-01-29,Open,88,87.5,95,-100,,95,50,-55,55,,55,100,105,110,,110,260
1,60,Анна Османкина,Anna Osmankina,SBD,Wraps,F,1984-03-11,Open,59.3,60,67.5,-75,,67.5,32.5,35,-37.5,,35,100,-107.5,107.5,,107.5,210
1,75,Ирина Макашер,Irina Makasher,SBD,Wraps,F,1990-02-24,Open,75,95,-105,-105,,95,55,62.5,67.5,,67.5,115,125,-130,,125,287.5
1,52,Дарья Ковичка,Darya Kovichka,SBD,Wraps,F,1999-03-05,Teens 17-19,51.25,70,75,82.5,,82.5,35,37.5,40,,40,80,90,95,,95,217.5
1,56,Ирина Кочина,Irina Kochina,SBD,Wraps,F,1999-05-12,Teens 17-19,54.35,57.5,-62.5,-62.5,,57.5,32.5,35,-37.5,,35,60,70,-72.5,,70,162.5
1,48,Алина Захарова,Alina Zakharova,SBD,Wraps,F,2001-11-15,Teens 14-16,48,45,52.5,60,,60,30,-35,35,,35,65,75,85,,85,180
1,60,Софья Клыкова,Sofya Klykova,SBD,Wraps,F,2000-06-24,Teens 14-16,56.5,47.5,55,60,,60,25,30,-35,,30,50,60,-67.5,,60,150
1,75,Сергей Никонов,Sergey Nikonov,B,Raw,M,1986-06-17,Open,73.95,,,,,,155,160,-165,,160,,,,,,160
2,75,Илья Дугушкин,Ilya Dugushkin,B,Raw,M,1986-04-11,Open,71.9,,,,,,155,-165,-165,,155,,,,,,155
3,75,Михаил Гутиков,Mikhail Gutikov,B,Raw,M,1987-05-30,Open,73,,,,,,-150,155,-162.5,,155,,,,,,155
1,110,Иван Васюнин,Ivan Vasyunin,B,Raw,M,1983-08-01,Open,102.55,,,,,,207.5,215,-235,,215,,,,,,215
2,110,Александр Духинский,Aleksandr Dukhinskiy,B,Raw,M,1982-11-29,Open,105.5,,,,,,200,-207.5,-207.5,,200,,,,,,200
3,110,Александр Берло,Aleksandr Berlo,B,Raw,M,1976-01-06,Open,110,,,,,,190,195,-200,,195,,,,,,195
4,110,Михаил Яблонский,Mikhail Yablonskiy,B,Raw,M,1981-12-22,Open,107.25,,,,,,167.5,175,180,,180,,,,,,180
5,110,Александр Бахман,Aleksandr Bakhman,B,Raw,M,1989-07-29,Open,108.2,,,,,,170,180,-185,,180,,,,,,180
1,125,Владимир Самойлов,Vladimir Samoylov,B,Raw,M,1991-05-09,Open,119.9,,,,,,202.5,212.5,220,,220,,,,,,220
2,125,Николай Бойков,Nikolay Boykov,B,Raw,M,,Open,122.9,,,,,,210,220,-225,,220,,,,,,220
3,125,Алексей Бородулин,Aleksey Borodulin,B,Raw,M,1983-02-03,Open,118,,,,,,-175,175,185,,185,,,,,,185
1,82.5,Евгений Братцев,Evgeniy Brattsev,B,Raw,M,1989-06-26,Open,78.4,,,,,,140,152.5,-157.5,,152.5,,,,,,152.5
2,82.5,Алексей Тотмянин,Aleksey Totmyanin,B,Raw,M,1983-04-01,Open,81.45,,,,,,-145,145,-150,,145,,,,,,145
3,82.5,Александр Литвиненко,Aleksandr Litvinenko,B,Raw,M,1983-02-24,Open,81.8,,,,,,90,105,-107.5,,105,,,,,,105
1,100,Иван Калининский,Ivan Kalininskiy,B,Raw,M,1990-06-15,Open,97.2,,,,,,210,222.5,227.5,,227.5,,,,,,227.5
2,100,Максим Медведев,Maksim Medvedev,B,Raw,M,1981-05-16,Open,94.9,,,,,,190,,,,190,,,,,,190
1,125,Николай Бойков,Nikolay Boykov,B,Raw,M,,Masters 40-49,122.9,,,,,,210,220,-225,,220,,,,,,220
1,110,Александр Берло,Aleksandr Berlo,B,Raw,M,1976-01-06,Masters 40-49,110,,,,,,190,195,-200,,195,,,,,,195
1,90,Александр Зимин,Aleksandr Zimin,B,Raw,M,1969-08-29,Masters 40-49,89.25,,,,,,160,170,-175,,170,,,,,,170
DQ,90,Сергей Скалозуб,Sergey Skalozub,B,Raw,M,1970-08-25,Masters 40-49,89.85,,,,,,-75,,,,,,,,,,
1,100,Евгений Мамунов,Evgeniy Mamunov,B,Raw,M,1975-07-16,Masters 40-49,94.7,,,,,,155,-160,-160,,155,,,,,,155
2,100,Игорь Фокин,Igor Fokin,B,Raw,M,1969-09-15,Masters 40-49,91.45,,,,,,-135,140,-155,,140,,,,,,140
1,82.5,Сергей Скалозуб,Sergey Skalozub,B,Raw,M,1970-08-25,Masters 40-49,78.8,,,,,,-75,75,90,,90,,,,,,90
1,90,Алексей Коробов,Aleksey Korobov,B,Raw,M,1959-03-21,Masters 50-59,89,,,,,,155,-165,165,,165,,,,,,165
1,75,Алексей Ячнев,Aleksey Yachnev,B,Raw,M,1961-09-06,Masters 50-59,73.7,,,,,,127.5,137.5,-145,,137.5,,,,,,137.5
1,82.5,Сергей Каштанов,Sergey Kashtanov,B,Raw,M,1958-06-27,Masters 50-59,82.5,,,,,,130,135,-140,,135,,,,,,135
1,100,Сергей Анненков,Sergey Annenkov,B,Raw,M,1958-04-11,Masters 50-59,97,,,,,,155,162.5,-167.5,,162.5,,,,,,162.5
1,75,Константин Шестопалов,Konstantin Shestopalov,B,Raw,M,2003-03-20,Teens 13,72.75,,,,,,45,-50,-50,,45,,,,,,45
1,56,Назар Мурашко,Nazar Murashko,B,Raw,M,2002-12-25,Teens 13,55.3,,,,,,47.5,52.5,-57.5,,52.5,,,,,,52.5
1,125,Александр Курмашов,Aleksandr Kurmashov,B,Raw,M,1993-07-13,Juniors,115.25,,,,,,185,202.5,-205,,202.5,,,,,,202.5
1,100,Михаил Васильев,Mikhail Vasilev,B,Raw,M,1986-04-10,Juniors,99.5,,,,,,175,185,-195,,185,,,,,,185
1,90,Александр Воробьев,Aleksandr Vorobev,B,Raw,M,1993-11-29,Juniors,85.8,,,,,,165,-175,-175,,165,,,,,,165
1,82.5,Дмитрий Горбатовский,Dmitriy Gorbatovskiy,B,Raw,M,2000-04-12,Teens 14-16,78.05,,,,,,75,80,-85,,80,,,,,,80
1,60,Сергей Сынков,Sergey Synkov,B,Raw,M,2001-11-26,Teens 14-16,60,,,,,,-90,90,95,,95,,,,,,95
1,67.5,Егор Пашков,Egor Pashkov,B,Raw,M,2000-06-08,Teens 14-16,62.5,,,,,,80,85,90,,90,,,,,,90
1,67.5,Владимир Зимин,Vladimir Zimin,B,Raw,M,1999-09-16,Teens 17-19,66.9,,,,,,80,85,90,,90,,,,,,90
1,67.5,Надежда Каверина,Nadezhda Kaverina,B,Raw,F,1996-06-06,Juniors,62.5,,,,,,40,-42.5,-42.5,,40,,,,,,40
1,60,Ирина Музыка,Irina Muzyka,B,Raw,F,1992-06-28,Open,57.54,,,,,,37.5,-42.5,-45,,37.5,,,,,,37.5
1,67.5,Дарья Топоркова,Darya Toporkova,B,Raw,F,1984-12-08,Open,67,,,,,,-80,90,-100,,90,,,,,,90
1,82.5,Анастасия Остапенко,Anastasiya Ostapenko,B,Raw,F,1998-04-19,Open,77.5,,,,,,75,-85,,,75,,,,,,75
1,110,Денис Исаков,Denis Isakov,D,Raw,M,1982-08-14,Open,109.1,,,,,,,,,,,200,215,225,,225,225
1,82.5,Владимир Лущай,Vladimir Lushchay,D,Raw,M,1975-02-03,Open,82.5,,,,,,,,,,,215,225,235,245,235,235
1,90,Сергей Богачук,Sergey Bogachuk,D,Raw,M,1989-05-30,Open,89.85,,,,,,,,,,,220,240,-245,,240,240
1,100,Максим Медведев,Maksim Medvedev,D,Raw,M,1981-05-16,Open,94.9,,,,,,,,,,,260,280,-292.5,,280,280
1,67.5,Андрей Достовалов,Andrey Dostovalov,D,Raw,M,1997-06-30,Teens 17-19,65.75,,,,,,,,,,,167.5,182.5,192.5,,192.5,192.5
1,100,Владимир Пануев,Vladimir Panuev,D,Raw,M,1962-10-22,Masters 50-59,99.6,,,,,,,,,,,220,-230,,,220,220
1,82.5,Валерий Смирнов,Valeriy Smirnov,D,Raw,M,1959-03-24,Masters 50-59,75.25,,,,,,,,,,,200,222.5,,,222.5,222.5
1,82.5,Владимир Лущай,Vladimir Lushchay,D,Raw,M,1975-02-03,Masters 40-49,82.5,,,,,,,,,,,215,225,235,245,235,235
1,100,Николай Векшарев,Nikolay Veksharev,D,Raw,M,1993-07-24,Juniors,96,,,,,,,,,,,-240,240,-250,,240,240
1,90,Александр Мальцев,Aleksandr Maltsev,SBD,Multi-ply,M,1989-10-16,Open,90,250,270,280,,280,-235,235,-245,,235,265,275,285,,285,800
2,90,Евгений Дорошенко,Evgeniy Doroshenko,SBD,Multi-ply,M,1983-02-01,Open,89,-270,300,-310,,300,180,190,200,,200,270,280,-290,,280,780
1,100,Павел Брындин,Pavel Bryndin,SBD,Multi-ply,M,1981-12-11,Open,98.3,285,315,330,,330,182.5,195,205,,205,260,-285,-290,,260,795
1,110,Иван Васюнин,Ivan Vasyunin,B,Multi-ply,M,1983-08-01,Open,102.55,,,,,,-305,-305,305,,305,,,,,,305
DQ,110,Александрр Иванов,Aleksandrr Ivanov,B,Multi-ply,M,1976-04-10,Open,108.75,,,,,,-285,-290,-290,,,,,,,,
1,90,Дмитрий Савченко,Dmitriy Savchenko,B,Multi-ply,M,1981-08-03,Open,85.75,,,,,,190,200,210,,210,,,,,,210
2,90,Артем Уродов,Artem Urodov,B,Multi-ply,M,1991-09-29,Open,88.7,,,,,,177.5,-192.5,-192.5,,177.5,,,,,,177.5
1,100,Дмитрий Башкиров,Dmitriy Bashkirov,B,Multi-ply,M,1991-11-24,Open,100,,,,,,-225,225,-235,,225,,,,,,225
1,125,Карим Кананов,Karim Kananov,B,Multi-ply,M,1994-05-17,Open,124.95,,,,,,-225,225,235,,235,,,,,,235
1,90,Артем Уродов,Artem Urodov,B,Single-ply,M,1991-09-29,Open,88.7,,,,,,165,182.5,,,182.5,,,,,,182.5
1,82.5,Алексей Усманов,Aleksey Usmanov,B,Single-ply,M,1973-02-27,Open,82.4,,,,,,180,-190,-190,,180,,,,,,180
2,82.5,Александр Литвиненко,Aleksandr Litvinenko,B,Single-ply,M,1983-02-24,Open,81.8,,,,,,100,120,-137.5,,120,,,,,,120
1,100,Антон Епихин,Anton Epikhin,B,Single-ply,M,1988-10-11,Open,97.65,,,,,,245,260,-270,,260,,,,,,260
2,100,Александр Багаев,Aleksandr Bagaev,B,Single-ply,M,1986-04-18,Open,98.3,,,,,,220,235,242.5,,242.5,,,,,,242.5
1,110,Василий Сынков,Vasiliy Synkov,B,Single-ply,M,1972-09-07,Open,103.5,,,,,,280,300,-315,,300,,,,,,300
2,110,Павел Бердин,Pavel Berdin,B,Single-ply,M,1991-05-28,Open,108.8,,,,,,250,-262.5,-262.5,,250,,,,,,250
3,110,Антон Кацюк,Anton Katsyuk,B,Single-ply,M,1989-04-20,Open,106.1,,,,,,180,200,207.5,,207.5,,,,,,207.5
1,125,Александр Курмашов,Aleksandr Kurmashov,B,Single-ply,M,1993-07-13,Open,115.2,,,,,,220,240,260,,260,,,,,,260
DQ,125,Алексей Бородулин,Aleksey Borodulin,B,Single-ply,M,1983-02-03,Open,118,,,,,,-230,-250,-250,,,,,,,,
1,82.5,Алексей Усманов,Aleksey Usmanov,B,Single-ply,M,1973-02-27,Masters 40-49,82.4,,,,,,180,-190,-190,,180,,,,,,180
1,100,Игорь Кирюхин,Igor Kiryukhin,B,Single-ply,M,1970-03-22,Masters 40-49,99.05,,,,,,220,230,-252.5,,230,,,,,,230
1,100,Николай Кузнецов,Nikolay Kuznetsov,B,Single-ply,M,1960-12-28,Masters 50-59,93,,,,,,190,200,-212.5,,200,,,,,,200
1,90,Алексей Коробов,Aleksey Korobov,B,Single-ply,M,1959-03-21,Masters 50-59,89,,,,,,170,180,-190,,180,,,,,,180
1,82.5,Сергей Каштанов,Sergey Kashtanov,B,Single-ply,M,1958-06-27,Masters 50-59,82.5,,,,,,-190,190,-200,,190,,,,,,190
