WeightClassKg,Division,Name,Age,State,BodyweightKg,Place,Best3SquatKg,Best3BenchKg,Best3DeadliftKg,TotalKg,Event,Equipment,Sex
44,Pre-Teen,Avram Lear,12,IN,43.91,1,113.4,52.16,120.2,285.76,SBD,Wraps,M
67.5,Teenage 16-17,Allison Herrick,16,IN,65.77,1,117.93,56.7,124.74,299.37,SBD,Wraps,F
82.5,Teenage 16-17,Keith Hanson,17,IN,81.65,1,165.56,115.67,181.44,462.66,SBD,Wraps,M
110,Teenage 18-19,Christopher Zapata,18,IN,105.23,1,174.63,115.67,226.8,517.1,SBD,Wraps,M
56,Juniors,Linzi Mattingly,21,KY,54.88,2,72.57,40.82,88.45,201.85,SBD,Wraps,F
56,Juniors,Madison Thompson,21,IL,54.43,1,95.25,52.16,129.27,276.69,SBD,Wraps,F
100,Juniors,Tyler Rodman,23,KS,99.79,2,235.87,172.37,251.74,659.98,SBD,Wraps,M
100,Juniors,Craig Ayers,21,IL,96.62,1,260.82,179.17,278.96,718.94,SBD,Wraps,M
110,Juniors,Sydney Gates,20,KY,102.51,1,147.42,61.23,147.42,356.07,SBD,Wraps,M
75,Open,Kyle Reel,30,IN,72.57,1,117.93,72.57,145.15,335.66,SBD,Wraps,F
75,Open,Stephanie Jenkins,33,IN,74.39,1,68.04,36.29,92.99,197.31,SBD,Wraps,F
82.5,Open,Kori Bridgewater,28,IN,78.47,1,124.74,65.77,156.49,347,SBD,Wraps,F
100,Open,Tyler Oldham,27,IN,96.62,2,299.37,151.95,297.1,748.43,SBD,Wraps,M
100,Open,Drew Bingham,26,KY,98.43,1,254.01,206.38,306.17,766.57,SBD,Wraps,M
100,Open,Joshua Winiger,26,IN,99.34,4,219.99,154.22,235.87,610.08,SBD,Wraps,M
100,Open,Jason St. Clair,26,IN,97.07,3,247.21,181.44,238.14,666.78,SBD,Wraps,M
110,Open,John Byrd,30,KY,100.24,2,251.74,183.7,290.3,725.75,SBD,Wraps,M
110,Open,Dusty Miller,27,Ky,105.69,1,333.39,163.29,276.69,773.37,SBD,Wraps,M
110,Open,Chaz Cable,32,Ky,102.06,3,242.67,158.76,260.82,662.24,SBD,Wraps,M
118,Open,Logan Teagardener,24,KY,116.57,1,233.6,142.88,258.55,635.03,SBD,Wraps,M
118,Open,Sam Clark,26,IN,114.31,2,147.42,92.99,183.7,424.11,SBD,Wraps,M
125,Open,Jarrod Burke,25,KY,124.74,1,303.91,197.31,317.51,818.73,SBD,Wraps,M
125,Open,Drew Buckman,25,Ky,123.83,2,265.35,215.46,299.37,780.18,SBD,Wraps,M
125,Open,Jared Ell,26,IN,121.11,3,167.83,120.2,188.24,476.27,SBD,Wraps,M
140,Open,Johnathan Janes,30,KY,138.35,1,197.31,145.15,213.19,555.65,SBD,Wraps,M
140+,Open,Michael Aders,29,IN,146.96,1,183.7,102.06,229.06,514.83,SBD,Wraps,M
140+,Open,Joshua Jenkins,35,IN,141.97,2,158.76,124.74,181.44,464.93,SBD,Wraps,M
56,Sub-Masters,Mandi Escott,39,IN,53.52,1,122.47,68.04,120.2,310.71,SBD,Wraps,F
60,Sub-Masters,Stacey Loudermilk,33,IN,58.06,1,122.47,63.5,136.08,322.05,SBD,Wraps,F
60,Sub-Masters,Nichole Nilah Bonham,36,IN,58.51,2,86.18,47.63,117.93,251.74,SBD,Wraps,F
82.5,Sub-Masters,Justin Fehn,36,IN,79.38,1,151.95,102.06,170.1,424.11,SBD,Wraps,M
100,Sub-Masters,Mike Wheaten,34,KY,97.98,1,226.8,147.42,249.48,623.69,SBD,Wraps,M
125,Sub-Masters,Dan Mason #3,33,IN,124.74,1,242.67,208.65,281.23,732.55,SBD,Wraps,M
90,Masters 40-44,Hilary Clark,42,IN,84.82,1,120.2,56.7,158.76,335.66,SBD,Wraps,F
52,Masters 50-54,Bonnie Douthitt,51,IN,50.8,1,74.84,49.9,120.2,244.94,SBD,Wraps,F
90,Masters 50-54,Derek Wallace,53,IN,89.81,1,102.06,151.95,102.06,356.07,SBD,Wraps,M
140,Military,A.J. Alma Flowers,36,IN,136.53,1,113.4,65.77,111.13,290.3,SBD,Wraps,M
82.5,Teenage 16-17,Trevor Kennard,16,IL,78.93,1,,136.08,219.99,356.07,BD,Raw,M
48,Open,Sarah Gray,37,IN,47.63,1,,58.97,111.13,170.1,BD,Raw,F
60,Open,Dana Forzley,32,IN,58.97,1,,49.9,106.59,156.49,BD,Raw,F
67.5,Open,Amanda Smith,36,IN,63.05,1,,65.77,145.15,210.92,BD,Raw,F
75,Open,Katey Hughes,25,IN,72.57,1,,54.43,124.74,179.17,BD,Raw,F
100,Open,Jason Davis,40,TN,92.53,1,,188.24,303.91,492.15,BD,Raw,M
140,Open,James Dunn,27,KY,126.55,1,,174.63,235.87,410.5,BD,Raw,M
48,Sub-Masters,Sarah Gray,37,IN,47.63,1,,58.97,111.13,170.1,BD,Raw,F
67.5,Sub-Masters,Amanda Smith,36,IN,63.05,1,,65.77,145.15,210.92,BD,Raw,F
100,Sub-Masters,Grant Smith,36,IN,93.44,1,,104.33,158.76,263.08,BD,Raw,M
140+,Sub-Masters,Chris Crisman,37,IN,182.34,1,,208.65,272.16,480.81,BD,Raw,M
75,Masters 40-44,Stephen Orsburn,42,IN,73.94,1,,86.18,136.08,222.26,BD,Raw,M
140,Masters 45-49,Derrick Hill,45,IN,128.82,1,,154.22,238.14,392.36,BD,Raw,M
67.5,Masters 50-54,Darlene Wallace,52,IN,65.32,1,,38.56,111.13,149.69,BD,Raw,F
125,Masters 40-44,Hanz Hoag,43,IN,124.74,1,,226.8,,226.8,B,Single-ply,M
110,Open,Rudy Wernz,25,IN,109.77,1,,283.5,,283.5,B,Single-ply,M
140,Masters 40-44,Jason Lawson,41,TN,130.18,1,,326.59,,326.59,B,Multi-ply,M
140+,Open,Julius Maddox,28,KY,190.06,1,,299.37,,299.37,B,Raw,M
90+,Masters 40-44,Jodey Reisz,40,IN,119.29,1,,95.25,,95.25,B,Raw,F
67.5,Sub-Masters,Stacey Godbold,34,IN,64.41,1,,58.97,,58.97,B,Raw,F
90,Masters 50-54,Larry Ulrich,54,IN,89.36,1,,167.83,,167.83,B,Raw,M
118,Sub-Masters,Andrew Willams,37,KY,114.31,1,,142.88,,142.88,B,Raw,M
67.5,Military,Joey Woodke,26,TN,65.77,1,,149.69,,149.69,B,Raw,M
67.5,Sub-Masters,Stacey Godbold,34,IN,64.41,1,102.06,,,102.06,S,Wraps,F
90,Sub-Masters,James Godbold,35,IN,89.81,1,195.04,,,195.04,S,Wraps,M
90,Sub-Masters,James Godbold,35,IN,89.81,1,,,233.6,233.6,D,Raw,M
