Event,Sex,Name,State,BodyweightKg,WeightClassKg,Division,Best3SquatKg,Best3BenchKg,Best3DeadliftKg,TotalKg,Equipment,Place
SBD,M,Rob Snow,MB,139.4,125+,Open,207.5,150,240,597.5,Single-ply,1
SBD,M,Steve Powell,MB,97.4,100,Open,220,172.5,290,682.5,Single-ply,1
SBD,M,Harvey Hanec,MB,97.7,100,Master 3,120,160,90,370,Single-ply,1
SBD,M,Trevor Winfield,MB,115.2,125,Master 1,225,260,235,720,Single-ply,1
SBD,M,Brock Haywood,MB,122.5,125,Master 1,235,155,250,640,Single-ply,2
SBD,M,Matthew McKellar,SK,87.7,90,Junior,155,125,170,450,Single-ply,1
