WeightClassKg,BodyweightKg,Name,State,Squat1Kg,Squat2Kg,Squat3Kg,Best3SquatKg,Bench1Kg,Bench2Kg,Bench3Kg,Best3BenchKg,Deadlift1Kg,Deadlift2Kg,Deadlift3Kg,Best3DeadliftKg,TotalKg,Event,Equipment,Division,Sex,Place
59,53.85,Jesús Manuel Rivas,Chihuahua,110,120,130,130,80,87.5,90,90,130,,,130,350,SBD,Single-ply,Special Olympics,M,1
74,72.6,Jesús Pérez Martínez,Guerrero,80,90,100,100,50,60,70,70,90,100,105,105,275,SBD,Raw,Special Olympics,M,1
53,52.7,Eduardo Florencio,Edo Mex,,,,,50,55,57.5,57.5,,,,,57.5,B,Raw,Wheelchair,M,1
66,59.7,Simon Jimenez Rodriguez,Edo Mex,,,,,50,55,60,60,,,,,60,B,Raw,Wheelchair,M,1
74,66.45,Rene Martinez Santiago,Edo Mex,,,,,75,80,85,85,,,,,85,B,Raw,Wheelchair,M,1
83,78,Antonio Cruz Arredondo,Edo Mex,,,,,90,95,102.5,102.5,,,,,102.5,B,Raw,Wheelchair,M,1
47,46.8,Karina Jazmin Chino,Estado De Mexico,75,-80,-80,75,30,35,-40,35,100,110,-120,110,220,SBD,Raw,Open,F,3
47,46.5,Andrea Altamirano,UNAM,-70,70,-80,70,40,45,-47.5,45,90,110,-120,110,225,SBD,Raw,Open,F,2
47,46.9,Ariana Hernández,UNAM,60,-70,-70,60,35,40,-50,40,90,-110,120,120,220,SBD,Raw,Open,F,4
47,45.8,Alondra Arredondo,Nuevo Leon,80,-90,-90,80,-40,42.5,-45,42.5,100,107.5,110,110,232.5,SBD,Raw,Open,F,1
52,48.2,Gloria Madriz,Sonora,70,-80,80,80,25,-35,-35,25,80,90,110,110,215,SBD,Raw,Open,F,7
52,51.9,Karla Espinoza,Baja California,90,95,97.5,97.5,47.5,-52.5,52.5,52.5,110,115,120,120,270,SBD,Raw,Open,F,4
52,50.7,Citlaly Che Gonzalez,Tamaulipas,-90,90,-95,90,40,45,-50,45,100,110,120,120,255,SBD,Raw,Open,F,5
52,51.1,Adriana Gonzalez,Tamaulipas,100,105,-110,105,47.5,-52.5,-52.5,47.5,125,130,140,140,292.5,SBD,Raw,Open,F,3
52,51.9,Daniela Cywiak,Guanajuato,70,-77.5,77.5,77.5,40,-45,45,45,100,110,117.5,117.5,240,SBD,Raw,Open,F,6
52,51.7,Aline Falcon,Baja California Sur,90,100,-105,100,50,55,-57.5,55,140,150,-157.5,150,305,SBD,Raw,Open,F,1
52,51.5,Jessica Reyes,Estado Mexico,90,100,-107.5,100,70,-75,75,75,100,110,120,120,295,SBD,Raw,Open,F,2
57,56.7,Faridi Saavedra,Guanajuato,115,125,132.5,132.5,55,60,-62.5,60,130,140,-142.5,140,332.5,SBD,Raw,Open,F,1
57,55.3,Argelia Holguin,Nuevo Leon,82.5,-87.5,87.5,87.5,45,-47.5,47.5,47.5,115,122.5,130,130,265,SBD,Raw,Open,F,6
57,56.5,Yuridia Perales,Tamaulipas,110,117.5,-122.5,117.5,60,-65,65,65,130,140,-145,140,322.5,SBD,Raw,Open,F,2
57,54.7,Gabriela Franco,Coahuila,120,130,-140,130,-60,60,-65,60,120,-125,,120,310,SBD,Raw,Open,F,3
57,53.7,Paola Saavedra,Sonora,-100,100,115,115,-50,-50,50,50,100,110,130,130,295,SBD,Raw,Open,F,4
57,52.6,Cherry Scarllet,UNAM,100,110,-120,110,45,52.5,-57.5,52.5,110,120,-135,120,282.5,SBD,Raw,Open,F,5
63,59.6,Clara Baldenegro,Sonora,-85,90,95,95,45,-50,-50,45,85,90,100,100,240,SBD,Raw,Open,F,5
63,62.85,Katia Paola Crespo,UNAM,90,-105,105,105,-50,-57.5,-57.5,,120,130,-140,130,235,SBD,Raw,Open,F,6
63,60.95,Ana Karen Valenzuela,Tamaulipas,130,135,-140,135,57.5,60,65,65,140,155,-165,155,355,SBD,Raw,Open,F,1
63,62.45,Magdalena Avendaño,Baja California,82.5,87.5,-90,87.5,57.5,65,67.5,67.5,115,125,130,130,285,SBD,Raw,Open,F,2
63,59.95,Maria del Scorro Pérez,Jalisco,50,60,70,70,80,-82.5,-82.5,80,100,110,115,115,265,SBD,Raw,Open,F,3
72,63.65,Yaremi Buitron,Coahuila,100,-110,-110,100,45,-50,50,50,125,-135,-135,125,275,SBD,Raw,Open,F,4
72,71.15,Isadora Fragoso,Sonora,90,95,105,105,50,-52.5,52.5,52.5,95,100,110,110,267.5,SBD,Raw,Open,F,6
72,70.05,Luisa Torres,Hidalgo,95,100,105,105,60,65,70,70,130,,,130,305,SBD,Raw,Open,F,2
63,61,Laura Rosales,Baja California,80,90,-100,90,45,50,55,55,110,115,120,120,265,SBD,Raw,Open,F,4
72,70.65,Alba de Arrizon,Baja California,-82.5,-82.5,82.5,82.5,37.5,42.5,-45,42.5,92.5,110,125,125,250,SBD,Raw,Open,F,7
72,67.05,Patricia Colio,Baja California,80,90,100,100,45,47.5,-50,47.5,110,115,120,120,267.5,SBD,Raw,Open,F,5
72,70,Norma Rodríguez,Chihuahua,-102.5,102.5,-107.5,102.5,55,57.5,60,60,125,135,-142.5,135,297.5,SBD,Raw,Open,F,3
72,63.8,Aurora Pérez,Baja California,-130,135,145,145,70,75,-80,75,140,155,-170,155,375,SBD,Raw,Open,F,1
84,84,Maria Luisa Juarez,Sonora,110,,,110,55,,,55,115,,,115,280,SBD,Raw,Open,F,2
84,77.85,Amor Arce,Baja California,100,110,115,115,50,65,-75,65,110,120,130,130,310,SBD,Raw,Open,F,1
84+,111.75,Grecia Torres,Guanajuato,-190,200,215,215,95,105,115,115,220,235,-245,235,565,SBD,Raw,Open,F,1
84+,,Shauri Hellmer,CDMX,-180,-180,-180,,-40,,,,110,,,110,,SBD,Raw,Open,F,DQ
47,45.55,Isabel Hernández,Baja California,82.5,87.5,-92.5,87.5,37.5,-40,-40,37.5,77.5,82.5,85,85,210,SBD,Single-ply,Open,F,1
57,56,Jessica Chino,Estado De Mexico,140,150,-157.5,150,70,-75,75,75,140,160,170,170,395,SBD,Single-ply,Open,F,2
57,55.35,Alejandrina Santos,Chihuahua,150,160,170,170,75,82.5,87.5,87.5,150,165,170,170,427.5,SBD,Single-ply,Open,F,1
57,53.2,Yesenia Mendez,Baja California,82.5,-87.5,87.5,87.5,37.5,42.5,45,45,82.5,87.5,92.5,92.5,225,SBD,Single-ply,Open,F,3
63,61.8,Carolina Flores,Guanajuato,-140,-140,-140,,-70,70,75,75,125,135,140,140,215,SBD,Single-ply,Open,F,1
72,64.95,Malillanitzi Porras,CDMX,140,150,-157.5,150,70,,,70,100,140,147.5,147.5,367.5,SBD,Single-ply,Open,F,1
72,64.7,Rocío Saavedra,Sonora,135,145,155,155,50,-70,-70,50,120,140,-155,140,345,SBD,Single-ply,Open,F,2
84,72.8,Angelica Marin,CDMX,165,-175,180,180,50,-55,60,60,140,-150,-150,140,380,SBD,Single-ply,Open,F,2
84,80.3,Florencia Soberanes,Baja California,135,142.5,145,145,87.5,92.5,97.5,97.5,135,140,150,150,392.5,SBD,Single-ply,Open,F,1
84,80.3,Diana Lopez,Baja California,-165,-165,-165,,85,87.5,90,90,155,,,155,245,SBD,Single-ply,Open,F,3
84+,85,Alejandra Matus,Chihuahua,140,-155,-165,140,65,-75,-75,65,160,170,180,180,385,SBD,Single-ply,Open,F,1
59,58.5,Wilhem Guido,CDMX,130,140,160,160,100,110,-112.5,110,180,190,200,200,470,SBD,Raw,Open,M,1
59,58.9,Cesar Pacheco,UNAM,110,130,-145,130,85,100,-105,100,180,200,-210,200,430,SBD,Raw,Open,M,2
59,58.65,Jaime Barrera,Nuevo Leon,130,140,-147.5,140,105,-107.5,-107.5,105,170,-182.5,-182.5,170,415,SBD,Raw,Open,M,3
59,58.75,Jairos Castillo,Sonora,115,120,127.5,127.5,92.5,97.5,-100,97.5,165,-170,-175,165,390,SBD,Raw,Open,M,4
59,58.55,Martin Adrian,UNAM,100,110,-120,110,70,80,-90,80,135,145,155,155,345,SBD,Raw,Open,M,5
66,65.85,Marco Belmont,UNAM,160,180,-190,180,105,-115,115,115,180,200,-210,200,495,SBD,Raw,Open,M,1
66,64.8,Arnulfo Hernández,Nuevo Leon,150,-160,-160,150,-120,-120,120,120,185,195,202.5,202.5,472.5,SBD,Raw,Open,M,2
66,62.85,Alberto Mcgregor,CDMX,155,-165,172.5,172.5,100,-105,-105,100,170,185,-197.5,185,457.5,SBD,Raw,Open,M,4
66,65.8,Poncho Pardo Jr,Chihuahua,130,140,147.5,147.5,115,120,-125,120,185,195,205,205,472.5,SBD,Raw,Open,M,3
66,63.9,Cesar Rodríguez,Nuevo Leon,145,160,-172.5,160,105,110,-115,110,165,180,-190,180,450,SBD,Raw,Open,M,5
66,63.8,David Osiris Landa,Quintana Roo,130,-135,135,135,-95,95,-105,95,190,200,-205,200,430,SBD,Raw,Open,M,7
66,64.75,Luis Omar Garcia,UNAM,135,145,155,155,75,85,92.5,92.5,160,175,185,185,432.5,SBD,Raw,Open,M,6
66,63.65,Sebastian Villafuerte,CDMX,120,-132.5,132.5,132.5,92.5,-97.5,97.5,97.5,170,185,195,195,425,SBD,Raw,Open,M,8
66,61.3,Enrique Lara Rodriguez,Guanajuato,130,-140,150,150,80,-85,-85,80,180,-190,-190,180,410,SBD,Raw,Open,M,9
66,65.2,Christian Navarro #2,Baja California,,,,,105,-125,125,125,,,,,125,B,Raw,Open,M,1
74,70.7,Giovanni Arredondo,Nuevo Leon,190,195,-200,195,147.5,-150,150,150,210,-217.5,-217.5,210,555,SBD,Raw,Open,M,1
74,71.5,Gabriel Jimenez,Sonora,170,180,190,190,130,140,145,145,190,200,210,210,545,SBD,Raw,Open,M,2
74,72.9,Manuel Gasca,Baja California,142.5,152.5,170,170,102.5,112.5,-122.5,112.5,225,235,245,245,527.5,SBD,Raw,Open,M,3
74,71.5,Cesar Cabrera,Baja California Sur,165,-180,-187.5,165,-115,-115,115,115,215,-225,-227.5,215,495,SBD,Raw,Open,M,4
74,72.2,Oscar Barrera,Nuevo Leon,160,170,-180,170,110,115,-117.5,115,205,210,-215,210,495,SBD,Raw,Open,M,5
74,71.8,Erick Rodriguez,Sinaloa,150,160,172.5,172.5,85,90,92.5,92.5,190,205,212.5,212.5,477.5,SBD,Raw,Open,M,6
74,73.9,Armando Gutierrez,Aguascalientes,-150,160,170,170,90,-100,-100,90,200,215,-225,215,475,SBD,Raw,Open,M,7
74,73.5,Abraham Amado,Baja California,115,130,-140,130,90,100,-105,100,180,190,205,205,435,SBD,Raw,Open,M,8
74,67.5,Leonardo Lozano,Sonora,140,-145,150,150,75,80,90,90,145,160,-175,160,400,SBD,Raw,Open,M,9
74,73.2,Hernán Herrera,Quintana Roo,170,-175,-175,170,-125,-125,-125,,180,190,200,200,370,SBD,Raw,Open,M,10
74,69.9,Karlo Ivan Hernande,Baja California,,,,,-110,110,115,115,,,,,115,B,Raw,Open,M,1
74,71.1,Erick Nunez,Baja California,,,,,105,107.5,110,110,,,,,110,B,Raw,Open,M,2
83,81.3,Marco Perez,Jalisco,160,170,190,190,120,130,135,135,220,240,-260,240,565,SBD,Raw,Open,M,1
83,79.6,Hernan Leal,Nuevo Leon,165,177.5,187.5,187.5,105,110,-112.5,110,215,227.5,232.5,232.5,530,SBD,Raw,Open,M,2
83,82.8,William Trujillo,CDMX,180,185,190,190,130,-135,-135,130,200,205,210,210,530,SBD,Raw,Open,M,3
83,81.7,Ivan Gomez Blas,Tamaulipas,192.5,197.5,-202.5,197.5,95,-100,-100,95,220,230,-232.5,230,522.5,SBD,Raw,Open,M,4
83,81.5,Rodrigo Estrada,Baja California Sur,180,-185,-185,180,110,-117.5,-120,110,180,-190,,180,470,SBD,Raw,Open,M,5
83,81.2,Rodrigo Aguilar,CDMX,200,210,215,215,-140,-145,-145,,230,232.5,-260,232.5,447.5,SBD,Raw,Open,M,6
83,76.7,Ernesto Palomo,Sinaloa,125,135,140,140,105,110,-115,110,-150,-150,150,150,400,SBD,Raw,Open,M,7
83,75,Samuel Espinoza,Baja California,70,120,-130,120,80,-90,-90,80,140,-150,160,160,360,SBD,Raw,Open,M,8
83,74.2,Francisco Sandoval,Baja California,80,100,110,110,80,90,-92.5,90,100,110,125,125,325,SBD,Raw,Open,M,9
83,82.9,Rodrigo Sandoval,Baja California,-160,-160,-165,,-100,-100,100,100,200,-210,-210,200,300,SBD,Raw,Open,M,10
83,81.5,Isael Higuera,Sonora,,,,,160,170,-180,170,,,,,170,B,Raw,Open,M,1
83,81.6,David Salgado,Chihuahua,,,,,142.5,147.5,-152.5,147.5,,,,,147.5,B,Raw,Open,M,2
93,85.4,Jorge Martinez,Baja California,200,210,222.5,222.5,170,180,-187.5,180,260,280,-290,280,682.5,SBD,Raw,Open,M,1
93,93,Carlos Saavedra,Guanajuato,220,230,235,235,150,155,-160,155,250,260,-265,260,650,SBD,Raw,Open,M,2
93,89.5,Jesus Ramirez,Sinaloa,200,-212.5,-212.5,200,140,150,-157.5,150,250,262.5,-267.5,262.5,612.5,SBD,Raw,Open,M,3
93,89.3,Carlos Dominguez,Baja California,215,-225,-225,215,125,130,135,135,225,260,-267.5,260,610,SBD,Raw,Open,M,4
93,91.4,Luis Mendoza,Chihuahua,-230,-230,230,230,140,150,-160,150,220,-240,-240,220,600,SBD,Raw,Open,M,5
93,90,Adrian Parra,UNAM,-210,230,-250,230,115,125,-135,125,210,240,-250,240,595,SBD,Raw,Open,M,6
93,87.2,Ivan Serrano,Sonora,185,195,205,205,115,125,-130,125,195,200,-210,200,530,SBD,Raw,Open,M,7
93,91.1,Jaime Gomez,CDMX,145,155,165,165,77.5,85,-90,85,180,195,205,205,455,SBD,Raw,Open,M,8
93,90.4,Javier Castillo,Baja California,120,-140,150,150,105,-120,-122.5,105,160,165,175,175,430,SBD,Raw,Open,M,9
93,91.9,Maximilian Isa,Jalisco,180,190,-200,190,-115,-115,-115,,225,240,-245,240,430,SBD,Raw,Open,M,10
93,86.9,Raul Cabrera,Tamaulipas,-170,-170,-170,,110,-117.5,-117.5,110,205,-207.5,-207.5,205,315,SBD,Raw,Open,M,11
93,89.2,Antonio Reyes,Baja California,,,,,130,140,145,145,,,,,145,B,Raw,Open,M,1
105,103.8,Luis Gonzalez,Coahuila,280,300,-310,300,175,185,-195,185,250,270,290,290,775,SBD,Raw,Open,M,1
105,97.5,Samuel Rodriguez,Chihuahua,-250,250,265,265,175,-185,185,185,280,300,-320,300,750,SBD,Raw,Open,M,2
105,104.1,Mauricio Rodriguez #1,Jalisco,230,-235,-235,230,145,-150,-150,145,275,-285,-285,275,650,SBD,Raw,Open,M,3
105,104.2,Carlos Aviles,Sonora,230,-240,245,245,150,160,-170,160,215,230,-250,230,635,SBD,Raw,Open,M,4
105,105,Bernabe Cubas,Tamaulipas,240,-245,-245,240,130,135,140,140,230,235,-240,235,615,SBD,Raw,Open,M,5
105,101.9,Omar Carrillo,Jalisco,-205,205,-210,205,120,125,130,130,250,260,-270,260,595,SBD,Raw,Open,M,6
105,98.7,Miguel Villavicencio,UNAM,200,-220,-230,200,140,-147.5,-147.5,140,220,230,-235,230,570,SBD,Raw,Open,M,7
105,103.5,Helios Hellmer,CDMX,,,,,165,175,-182.5,175,,,,,175,B,Raw,Open,M,2
105,103.1,Carlos Mora,Baja California,,,,,180,-190,-190,180,,,,,180,B,Raw,Open,M,1
105,100.8,Rafael Saldaña,Estado Mexico,,,,,125,130,-140,130,,,,,130,B,Raw,Open,M,3
120,118.5,Victor Galvez,Estado Mexico,220,222.5,240,240,160,165,-170,165,230,250,262.5,262.5,667.5,SBD,Raw,Open,M,1
120,113,Jonhatan Macias,CDMX,235,242.5,-245,242.5,155,160,165,165,240,245,250,250,657.5,SBD,Raw,Open,M,2
120,115.4,Aniano Nunez,Baja California,225,-235,-235,225,130,140,-145,140,280,-290,-292,280,645,SBD,Raw,Open,M,3
120,110,Alberto Flores,Slp,180,-200,200,200,147.5,152.5,-157.5,152.5,265,-275,-275,265,617.5,SBD,Raw,Open,M,4
120,118.3,Juan Arrizon,Baja California,185,195,205,205,135,140,145,145,215,225,235,235,585,SBD,Raw,Open,M,5
120,107.3,Xavier Leyva,Baja California,-170,,,,135,140,-147.5,140,-190,190,,190,330,SBD,Raw,Open,M,6
120,109.4,Manuel Espinoza,Baja California,,,,,130,145,150,150,,,,,150,B,Raw,Open,M,1
120+,153.8,Jorge Free,Sinaloa,-270,-270,-270,,-150,,,,330,,,330,,SBD,Raw,Open,M,DQ
120+,139.4,Alejandro Cedillo,CDMX,,,,,200,210,-212.5,210,,,,,210,B,Raw,Open,M,1
120+,123,Juan Urzua,Baja California,,,,,120,125,130,130,,,,,130,B,Raw,Open,M,2
66,65.75,Javier Flores,Baja California,-190,190,205,205,100,-110,-110,100,215,227.5,242.5,242.5,547.5,SBD,Single-ply,Open,M,1
66,65.2,Oscar Mejía,Hidalgo,-200,-200,-210,,105,-110,110,110,200,210,220,220,330,SBD,Single-ply,Open,M,4
66,66,Edgardo Soto,CDMX,175,195,205,205,110,125,130,130,180,210,-225,210,545,SBD,Single-ply,Open,M,2
66,65.85,Ángel Alejandro Castillo,Chihuahua,120,140,160,160,80,-90,90,90,150,170,190,190,440,SBD,Single-ply,Open,M,3
74,73.5,Abelardo Moreno,Sonora,180,187.5,-200,187.5,142.5,-170,-170,142.5,187.5,-195,195,195,525,SBD,Single-ply,Open,M,5
74,71.7,Eduardo Canizales,Baja California,205,210,215,215,142.5,147.5,152.5,152.5,210,225,232.5,232.5,600,SBD,Single-ply,Open,M,1
74,71.7,Jesús Enciso,Sonora,205,215,-220,215,100,-125,125,125,220,230,-235,230,570,SBD,Single-ply,Open,M,4
74,71.9,Jonathan Venegas,Baja California,215,230,240,240,-172.5,172.5,-185,172.5,-175,185,-192.5,185,597.5,SBD,Single-ply,Open,M,2
74,71.5,Adrian Reyes,CDMX,-240,-250,-250,,-140,,,,-220,,,,,SBD,Single-ply,Open,M,DQ
74,72.6,Marcos Martinez,Estado Mexico,,,,,110,115,120,120,,,,,120,B,Single-ply,Open,M,1
74,74,Samuel Leucona,Baja California,-215,215,-225,215,-132.5,132.5,142.5,142.5,215,225,-232.5,225,582.5,SBD,Single-ply,Open,M,3
83,82.7,Ricardo Aguilar,Baja California,162.5,172.5,177.5,177.5,115,-125,-125,115,152.5,-162.5,-167.5,152.5,445,SBD,Single-ply,Open,M,5
83,76.4,Gabriel Colima,Baja California,205,-215,-215,205,-160,-160,-160,,180,190,-210,190,395,SBD,Single-ply,Open,M,6
83,81.4,Manuel Lucero,Chihuahua,210,230,-245,230,150,160,165,165,220,240,260,260,655,SBD,Single-ply,Open,M,1
83,82,Adán Escobar,UNAM,210,-230,-230,210,150,-160,-165,150,240,260,-275,260,620,SBD,Single-ply,Open,M,2
83,82.3,Gadiel Villavicencio,Baja California,220,-230,240,240,162.5,170,172.5,172.5,200,-210,-210,200,612.5,SBD,Single-ply,Open,M,3
83,81,Alfredo Hernandez,Baja California,240,260,-275,260,110,120,-130,120,220,,,220,600,SBD,Single-ply,Open,M,4
83,82.8,Irving Marin,CDMX,-250,-250,-250,,170,-175,-175,170,220,-230,-230,220,390,SBD,Single-ply,Open,M,7
93,90.6,Marco Reyes,Estado Mexico,240,250,260,260,-170,170,172.5,172.5,210,220,230,230,662.5,SBD,Single-ply,Open,M,1
93,89.7,Adolfo Moreno,Chihuahua,240,-260,-280,240,-145,-145,145,145,260,-280,-280,260,645,SBD,Single-ply,Open,M,2
93,85.1,David Soto,Sonora,-190,190,200,200,125,130,,130,-190,-190,190,190,520,SBD,Single-ply,Open,M,3
93,89.8,Adir Manzano,Estado Mexico,,,,,180,-190,-190,180,,,,,180,B,Single-ply,Open,M,1
105,99.1,Nemuel Perez,Baja California,145,150,155,155,132.5,137.5,-142.5,137.5,180,190,-195,190,482.5,SBD,Single-ply,Open,M,7
105,94.2,Pedro Lara,Hidalgo,-220,-220,220,220,100,110,115,115,180,-200,-220,180,515,SBD,Single-ply,Open,M,6
105,101.5,Ramses Canett,Baja California,225,245,-260,245,185,-190,-195,185,235,250,255,255,685,SBD,Single-ply,Open,M,3
105,94.1,Gabriel García,CDMX,310,-322.5,-322.5,310,200,-207.5,,200,255,270,-280,270,780,SBD,Single-ply,Open,M,2
105,99.5,Oscar Ojeda,Sonora,317.5,-330,340,340,225,-232.5,232.5,232.5,290,307.5,317.5,317.5,890,SBD,Single-ply,Open,M,1
105,101.5,Claudio Perez,Sonora,210,220,,220,200,210,,210,190,,,190,620,SBD,Single-ply,Open,M,5
105,103.3,Alfonso Mayoral,Baja California,-250,250,-260,250,170,185,187.5,187.5,210,-225,225,225,662.5,SBD,Single-ply,Open,M,4
120,113,Jhonatan Ramírez,CDMX,-180,190,-200,190,160,180,-190,180,220,-240,,220,590,SBD,Single-ply,Open,M,5
120,119,Hector Gallardo,Chihuahua,-200,-220,-220,,150,160,170,170,,,,,,SBD,Single-ply,Open,M,DQ
120,110.8,Luis Ramírez,CDMX,240,-250,-257.5,240,190,205,-207.5,205,210,215,-220,215,660,SBD,Single-ply,Open,M,4
120,115.9,Fernando Lopez,Baja California,-265,265,-280,265,155,-157.5,-225,155,265,290,-300,290,710,SBD,Single-ply,Open,M,3
120,106.5,Gabriel Orantes,Sonora,280,290,,290,240,250,-260,250,210,230,,230,770,SBD,Single-ply,Open,M,2
120,120,Marco Porras,CDMX,-330,330,350,350,235,-245,,235,220,230,,230,815,SBD,Single-ply,Open,M,1
120+,145.2,Edgard Galvan,Sonora,,,,,200,210,-215,210,,,,,210,B,Single-ply,Open,M,1
