Place,Name,Division,Country,BodyweightKg,Best3SquatKg,Best3BenchKg,Best3DeadliftKg,TotalKg,WeightClassKg,Sex,Event,Equipment
1,Natalia Frolova,O,Canada,47.7,140,72.5,120,332.5,48,F,SBD,Multi-ply
1,Loreen Brooks,M1,Canada,50.3,127.5,50,90,267.5,52,F,SBD,Multi-ply
1,Lucia Montens,M1,Canada,54.9,85,45,107.5,237.5,56,F,SBD,Multi-ply
1,Lora Greco,M2,Canada,54.1,145,55,150,350,56,F,SBD,Multi-ply
1,Cindy Irving,M1,Canada,59,95,40,115,250,60,F,SBD,Multi-ply
1,Wendy Greig,M2,Canada,55.9,165,70,155,390,60,F,SBD,Multi-ply
1,Melissa Ortega,O,USA,67.1,230,140,197.5,567.5,67.5,F,SBD,Multi-ply
2,Sonji Baldwin,O,USA,67.5,192.5,105,190,487.5,67.5,F,SBD,Multi-ply
3,Shari Spencer,O,Canada,65.4,180,115,167.5,462.5,67.5,F,SBD,Multi-ply
4,Mishel Neufeld,O,Canada,67.2,182.5,67.5,175,425,67.5,F,SBD,Multi-ply
5,Karen Watson,O,Canada,66,122.5,72.5,132.5,327.5,67.5,F,SBD,Multi-ply
1,Bernice Green,M2,Canada,67.5,167.5,112.5,155,435,67.5,F,SBD,Multi-ply
1,Lisa Denison,O,USA,72.4,205,95,172.5,472.5,75,F,SBD,Multi-ply
1,Kimberly Packer,M1,USA,75,200,85,155,440,75,F,SBD,Multi-ply
2,Kate McLean,M1,Canada,72.2,130,62.5,150,342.5,75,F,SBD,Multi-ply
1,Jill Mills,O,USA,80,272.5,175,250,697.5,82.5,F,SBD,Multi-ply
2,Krista Ford,O,USA,82.5,252.5,122.5,252.5,627.5,82.5,F,SBD,Multi-ply
1,Linda Belenczuk,M2,Canada,86,180,65,167.5,412.5,90,F,SBD,Multi-ply
1,Becca Swanson,O,USA,103.5,337.5,192.5,288,818,90+,F,SBD,Multi-ply
1,Maris Anne,M4,USA,95.2,192.5,102.5,192.5,487.5,100,F,SBD,Multi-ply
1,Leslie Miller,M3,Canada,103.5,210,100,162.5,472.5,110,F,SBD,Multi-ply
1,Reno Karkuschke,O,Germany,55.9,155,110,167.5,432.5,56,M,SBD,Multi-ply
1,Gary Bobrovitz,M3,Canada,59.4,190,120,137.5,447.5,60,M,SBD,Multi-ply
1,Blake Sumner,T1,USA,66.6,165,107.5,142.5,415,67.5,M,SBD,Multi-ply
1,Cory Schollmeyer,T2,USA,67.5,227.5,102.5,187.5,517.5,67.5,M,SBD,Multi-ply
1,Nick Hatch,T3,USA,66.9,277.5,182.5,215,675,67.5,M,SBD,Multi-ply
1,Tim Judge,M1,USA,67.2,220,157.5,217.5,595,67.5,M,SBD,Multi-ply
1,Max Bigby,M4,USA,66.85,192.5,92.5,182.5,467.5,67.5,M,SBD,Multi-ply
1,Herb Glossbrenner,M5,USA,67.2,160,110.5,162.5,433,67.5,M,SBD,Multi-ply
1,Brandon Clement,T2,USA,75,192.5,92.5,190,475,75,M,SBD,Multi-ply
2,Kevin McMahon,T2,USA,73,192.5,100,177.5,470,75,M,SBD,Multi-ply
1,Jason Balon,T3,Canada,74.2,210,92.5,210,512.5,75,M,SBD,Multi-ply
1,Juha Jaakkola,O,Finland,74.3,280,192.5,250,722.5,75,M,SBD,Multi-ply
2,Gordon Olson,O,USA,74.8,285,145,257.5,687.5,75,M,SBD,Multi-ply
DQ,Igor Shestakov,O,Russia,74.1,,175,290,,75,M,SBD,Multi-ply
DQ,Andrey Chesnokov,O,Russia,74.35,,230,160,,75,M,SBD,Multi-ply
1,Vincent Graham,M1,Canada,74.8,312.5,190,260,762.5,75,M,SBD,Multi-ply
2,Steven Lumpe,M1,USA,73.7,252.5,140,217.5,610,75,M,SBD,Multi-ply
DQ,James Sluk,M1,Canada,74.5,105,,,,75,M,SBD,Multi-ply
1,Arthur Little,M2,USA,73.2,275,142.5,277.5,695,75,M,SBD,Multi-ply
1,Richard Flores,M6,USA,73.7,231,120,207.5,558.5,75,M,SBD,Multi-ply
1,Brian Miller,T2,USA,78.85,227.5,112.5,182.5,522.5,82.5,M,SBD,Multi-ply
1,Sean Baker,O,USA,82.3,282.5,175,240,697.5,82.5,M,SBD,Multi-ply
2,Dave Hansen,O,Canada,82.5,130,162.5,180,472.5,82.5,M,SBD,Multi-ply
1,Robert Benedix,M1,USA,81.9,320,197.5,235,752.5,82.5,M,SBD,Multi-ply
2,Ken Allen,M1,Canada,81.8,260,175,257.5,692.5,82.5,M,SBD,Multi-ply
1,Douglas Peterson,M2,USA,81.1,252.5,142.5,247.5,642.5,82.5,M,SBD,Multi-ply
2,Greg Sumner,M2,USA,81.9,260,137.5,217.5,615,82.5,M,SBD,Multi-ply
3,Archie Ulry,M2,Canada,81,230,125,237.5,592.5,82.5,M,SBD,Multi-ply
1,Roy Mitchell,M7,Canada,80.4,125,95,160,380,82.5,M,SBD,Multi-ply
1,Anthony Gianetti,T2,USA,90,282.5,220,240,742.5,90,M,SBD,Multi-ply
1,Tyler Tessler,T3,Canada,85.05,287.5,152.5,252.5,692.5,90,M,SBD,Multi-ply
1,Tatu Avola,O,Finland,89.5,380,225,335,940,90,M,SBD,Multi-ply
2,Ilkka Mursu,O,Finland,86.4,370,235,320,925,90,M,SBD,Multi-ply
3,Corey Evans,O,Canada,89.5,365,230,272.5,867.5,90,M,SBD,Multi-ply
4,Shawn Frankl,O,USA,89.1,367.5,145,307.5,820,90,M,SBD,Multi-ply
5,Brian Johnston,O,Canada,89.6,330,160,272.5,762.5,90,M,SBD,Multi-ply
6,Jason Zalewski,O,USA,88.6,275,145,305,725,90,M,SBD,Multi-ply
1,Keith McNeish,M1,USA,90,287.5,172.5,295,755,90,M,SBD,Multi-ply
2,Andy Fisher,M1,Canada,88.8,205,120,245,570,90,M,SBD,Multi-ply
3,Dale Fuller,M1,Canada,89.9,230,112,180,522,90,M,SBD,Multi-ply
1,Mark Caplan,M2,USA,88.2,342.5,205,275,822.5,90,M,SBD,Multi-ply
1,Birchmans Pereira,M4,Canada,87.3,225,57.5,220,502.5,90,M,SBD,Multi-ply
1,Mitch Sperling,M5,USA,87.4,215,160,205,580,90,M,SBD,Multi-ply
1,Pete Wilson,M6,USA,89.3,230,157.5,192.5,580,90,M,SBD,Multi-ply
1,Todd Kowal,T3,USA,98.4,292.5,205,277.5,775,100,M,SBD,Multi-ply
1,Benji Hill,O,USA,99.9,347.5,227.5,320,895,100,M,SBD,Multi-ply
2,Warren Rozen,O,Australia,99.8,352.5,200,325,877.5,100,M,SBD,Multi-ply
3,James Griggs,O,USA,99.8,335,212.5,312.5,860,100,M,SBD,Multi-ply
4,Joe Burlew,O,USA,95.5,317.5,237.5,300,855,100,M,SBD,Multi-ply
5,Ossi Huhlanki,O,Finland,97.5,300,215,320,835,100,M,SBD,Multi-ply
6,Tim Ironside,O,Canada,97.1,352.5,217.5,240,810,100,M,SBD,Multi-ply
7,Marc Burthiaum,O,Canada,99.8,285,205,230,720,100,M,SBD,Multi-ply
DQ,Mike Fessenden,O,USA,99.8,,,,,100,M,SBD,Multi-ply
DQ,Dan Federra,O,Canada,98.5,365,,,,100,M,SBD,Multi-ply
1,Randy Etsell,M1,Canada,96.2,335,197.5,305,837.5,100,M,SBD,Multi-ply
2,Trevor Andrus,M1,Canada,97.4,300,227.5,230,757.5,100,M,SBD,Multi-ply
3,Jody Armstrong,M1,Canada,96.85,315,122.5,235,672.5,100,M,SBD,Multi-ply
4,Gregory Hayes,M1,USA,99.9,,220,,220,100,M,B,Multi-ply
1,Dennis Montembault,M2,USA,99.9,375,200,260,835,100,M,SBD,Multi-ply
2,Ruben Arredondo,M2,USA,97.9,250,172.5,230,652.5,100,M,SBD,Multi-ply
1,Richard Zenzen,M3,USA,97.8,315,170,250,735,100,M,SBD,Multi-ply
2,Robert Olinger,M3,USA,95.7,255,165,230,650,100,M,SBD,Multi-ply
3,Norm Lambert,M3,Canada,96.4,212.5,162.5,252.5,627.5,100,M,SBD,Multi-ply
1,Harold Russell,M30-34,Canada,94.5,110,97.5,150,357.5,100,M,SBD,Multi-ply
1,John Burgard,M4,USA,97.5,257.5,145,227.5,630,100,M,SBD,Multi-ply
2,Wayne Furris,M4,Canada,98.5,220,125,205,550,100,M,SBD,Multi-ply
1,Robert Bassman,M6,USA,92.4,205,155,197.5,557.5,100,M,SBD,Multi-ply
1,Darwin Miller,M9,Canada,91.5,160,80,160,400,100,M,SBD,Multi-ply
1,Toivo Ihalainen Jani,O,Finland,107.2,380,240,315,935,110,M,SBD,Multi-ply
2,Blaine Stussey,O,USA,108.2,342.5,282.5,290,915,110,M,SBD,Multi-ply
3,Kari Pöntinen,O,Finland,108.2,375,227.5,305,907.5,110,M,SBD,Multi-ply
4,Tony Correia,O,South Africa,110,335,235,300,870,110,M,SBD,Multi-ply
5,Jason Patrick,O,USA,109.7,,235,335,570,110,M,BD,Multi-ply
6,Jim Gorrell,O,USA,108,,212.5,320,532.5,110,M,BD,Multi-ply
1,Randall Ward,M1,USA,105.2,307.5,177.5,230,715,110,M,SBD,Multi-ply
2,Brent Stradeski,M1,Canada,102.4,300,105,200,605,110,M,SBD,Multi-ply
1,Duane Fuss,M2,Canada,106.8,347.5,215,272.5,835,110,M,SBD,Multi-ply
2,Jeffrey Anderson,M2,USA,107.1,332.5,185,250,767.5,110,M,SBD,Multi-ply
1,AJ Henderson,M3,USA,107.15,337.5,195,255,787.5,110,M,SBD,Multi-ply
1,Bob Packe,M4,USA,108.8,227.5,,182.5,410,110,M,SD,Multi-ply
1,Skip Sandberg Larry,M5,USA,109.1,300,195,285,780,110,M,SBD,Multi-ply
1,Scott Cummin,T3,Canada,119.1,277.5,200,272.5,750,125,M,SBD,Multi-ply
1,Jason Patrick,O,USA,111.9,422.5,255,335,1012.5,125,M,SBD,Multi-ply
2,Jim Grandick,O,USA,117,390,287.5,322.5,1000,125,M,SBD,Multi-ply
3,Ted Forbes,O,USA,124.7,425,232.5,327.5,985,125,M,SBD,Multi-ply
4,Mika Virtanen,O,Finland,124.5,400,225,340,965,125,M,SBD,Multi-ply
5,David Gratton,O,Canada,123,402.5,255,302.5,960,125,M,SBD,Multi-ply
DQ,Tommy Fannon,O,USA,124.2,365,,282.5,,125,M,SBD,Multi-ply
DQ,Alexander Skachko,O,Russia,124.3,100,,65,,125,M,SBD,Multi-ply
1,Thomas Brooks,M1,Canada,120.5,350,,320,670,125,M,SD,Multi-ply
2,Matt Hrycha,M1,USA,119.5,325,,317.5,642.5,125,M,SD,Multi-ply
1,John Ford,M2,USA,123.8,383,207.5,300,890.5,125,M,SBD,Multi-ply
2,Pekka Juhani,M2,Finland,120.8,340,200,250,790,125,M,SBD,Multi-ply
3,Jeff King,M2,USA,118,330,170,280,780,125,M,SBD,Multi-ply
1,Ian Visser,M3,South Africa,123.5,310,200,240,750,125,M,SBD,Multi-ply
2,Garry Ridgeway,M3,USA,123,277.5,197.5,247.5,722.5,125,M,SBD,Multi-ply
3,Delmar Brown,M3,USA,121.1,272.5,190,240,702.5,125,M,SBD,Multi-ply
1,Brian Meek,M4,USA,124.9,350,192.5,265,807.5,125,M,SBD,Multi-ply
2,Colin Bonneau,M4,Canada,120.6,200,225,200,625,125,M,SBD,Multi-ply
1,Scott Weech,T3,USA,125.9,350,237.5,275,862.5,140,M,SBD,Multi-ply
1,Allan Meehan,O,Canada,130.45,460,272.5,315,1047.5,140,M,SBD,Multi-ply
2,Tim Griffith,O,Canada,137.6,370,247.5,337.5,955,140,M,SBD,Multi-ply
3,Jim Thompson,O,USA,133.7,365,247.5,332.5,945,140,M,SBD,Multi-ply
4,Vladimir Kravtsov,O,Russia,127.2,100,320,150,570,140,M,SBD,Multi-ply
1,Markku Kalliola Kari,M1,Finland,138.8,425,275.5,285,985.5,140,M,SBD,Multi-ply
1,Brent Mikesell,O,USA,145,517.5,260,357.5,1135,140+,M,SBD,Multi-ply
2,Mags Schultz,O,Canada,168.25,400,272.5,300,972.5,140+,M,SBD,Multi-ply
3,William Baker,O,Canada,148.6,365,215,300,880,140+,M,SBD,Multi-ply
DQ,Chad Aichs,O,USA,155.15,,,,,140+,M,SBD,Multi-ply
1,Natalia Frolova,O,Canada,47.7,,75,,75,48,F,B,Multi-ply
1,Sandy Miller,M4,USA,55.3,,47.5,,47.5,56,F,B,Multi-ply
1,Bernice Green,M2,Canada,64,,105,,105,67.5,F,B,Multi-ply
1,Shari Spencer,O,Canada,69.4,,112.5,,112.5,75,F,B,Multi-ply
1,Tarja Rantanen,O,Finland,88.8,,165,,165,90,F,B,Multi-ply
1,Adam Blasetti,J,Canada,131.5,,217.5,,217.5,140,M,B,Multi-ply
1,Reno Karkuschke,O,Germany,55.5,,110,,110,56,M,B,Multi-ply
1,Gary Bobrovitz,M3,Canada,58.7,,113.5,,113.5,60,M,B,Multi-ply
1,Andrey Chesnokov,O,Russia,74.3,,246,,246,75,M,B,Multi-ply
2,Jamie Lee,O,Canada,74.5,,165,,165,75,M,B,Multi-ply
1,Nick Marinis,M1,USA,74.9,,185,,185,75,M,B,Multi-ply
1,Randy Deminick,M3,Canada,74.65,,165,,165,75,M,B,Multi-ply
1,Dave Hansen,O,Canada,82,,160,,160,82.5,M,B,Multi-ply
1,Ken Allen,M1,Canada,80.9,,170,,170,82.5,M,B,Multi-ply
1,Tyler Tessler,T3,Canada,84.7,,150,,150,90,M,B,Multi-ply
1,Lars Nyblin,O,Finland,89.9,,270,,270,90,M,B,Multi-ply
2,Andrey Butenko,O,Canada,89.9,,247.5,,247.5,90,M,B,Multi-ply
3,Jeff Klassen,O,Canada,89.9,,240,,240,90,M,B,Multi-ply
4,Yuriy Ustinov,O,Russia,89.8,,180,,180,90,M,B,Multi-ply
1,Peter Jakobowski,M1,Canada,90,,175,,175,90,M,B,Multi-ply
1,Birchmans Pereira,M4,Canada,85.7,,132.5,,132.5,90,M,B,Multi-ply
1,Jay Arnold,O,Canada,97.6,,252.5,,252.5,100,M,B,Multi-ply
2,Tatu Avola,O,Finland,95.1,,240,,240,100,M,B,Multi-ply
3,Frederick Woodson,O,USA,99.3,,222.5,,222.5,100,M,B,Multi-ply
4,Mark Plescia,O,Canada,99.9,,220,,220,100,M,B,Multi-ply
5,Tim Ironside,O,Canada,96.3,,215,,215,100,M,B,Multi-ply
1,Mark Will,M1,USA,99.9,,247.5,,247.5,100,M,B,Multi-ply
2,Tony Tomra,M1,Canada,99.7,,227.5,,227.5,100,M,B,Multi-ply
1,Bradley Hein,J,USA,106.9,,287.5,,287.5,110,M,B,Multi-ply
1,John Wardell,O,USA,104.05,,302.5,,302.5,110,M,B,Multi-ply
2,Alexander Skachko,O,Russia,109.75,,260,,260,110,M,B,Multi-ply
3,Toivo Ihalainen Jani,O,Finland,109.5,,235,,235,110,M,B,Multi-ply
4,Tony Correia,O,South Africa,109.8,,220,,220,110,M,B,Multi-ply
5,Shayne Parker,O,Canada,106.3,,192.5,,192.5,110,M,B,Multi-ply
DQ,Juha Mentula,O,Finland,109.9,,,,,110,M,B,Multi-ply
1,Duane Fuss,M2,Canada,109.9,,21,,21,110,M,B,Multi-ply
1,Lynbert Merriman,M4,Canada,106.6,,165,,165,110,M,B,Multi-ply
1,Vladimir Kravtsov,O,Russia,124.2,,302.5,,302.5,125,M,B,Multi-ply
2,Tom Holzapfel,O,USA,119.6,,282.5,,282.5,125,M,B,Multi-ply
3,Ron Miller,O,USA,122.9,,235,,235,125,M,B,Multi-ply
1,Tomi Rantanen,J,Finland,127.5,,310,,310,140,M,B,Multi-ply
1,Dan Cummings,O,USA,135.8,,310,,310,140,M,B,Multi-ply
2,Brad Kleefeld,O,Canada,127.3,,260,,260,140,M,B,Multi-ply
1,Markku Kalliola Kari,M1,Finland,139.8,,273,,273,140,M,B,Multi-ply
1,Ian Visser,M3,South Africa,125.9,,200,,200,140,M,B,Multi-ply
1,Sergey Popov,O,Russia,162.25,,305,,305,140+,M,B,Multi-ply
2,Mags Schultz,O,Canada,165.1,,267.5,,267.5,140+,M,B,Multi-ply
3,Mario Piattelli,O,Canada,140.9,,260,,260,140+,M,B,Multi-ply
4,Leonard Desjarlais,O,Canada,160.95,,240,,240,140+,M,B,Multi-ply
5,William Baker,O,Canada,149.3,,217.5,,217.5,140+,M,B,Multi-ply
