﻿                                                    Bundesverband Deutscher Kraftdreikäm
'4%., VDK                                           Wettkampfprotokoll LM Bank Männer 17.
                                   Klassen mit Equipment


                                                                                        Bankdrücken
NR         Name, Vorname             KG    Coef. 'Geb.              Verein            1.     2.     3.        SUB.     TOT.     Wilk's
  1   Aktive           -105kg
  2   Schröder, Ronny               93,8   0,6257   26 10 79   Blau-Weiß-Bergen     200,0    210,0   -220,0   210,0    210,0    131,4
  3
  4   Aktive             -120kg
  5   Neuendorf, Sven              113,8   0,5827 07 06 90        Motor Barth        175,0    182,5 187,5      187,5    187,5   109,3
  6   Grambow, Daniel              110,3   0,5880 14 04 89        Brüeler SV        -125,0   -125,0 -125,0    -125,0   -125,0   -73,5
  7
10
11    Aktive 1           -105kg
12    Vahl, Mirko                  102,1   0,6037 15 02 77     Greifenpower e.V.    230,0    240,0   -245,0   240,0    240,0    144,9
13    Grambow, Karsten             100,0   0,6086 13 09 77        Brüeler SV        185,0    190,0   -200,0   190,0    190,0    115,6
14
 15   Aktive 1           +120kg
16    Herder, Sandrino             130,5   0,5652 28 04 78     Greifenpower e.V.    -217,5   217,5   225,0    225,0    225,0    127,2
17
18    Aktive 11          +120kg
 19   Meyer, Bernd                 124,6   0,5702 16 03 61     Greifenpower e.V.    210,0    -225,0 -225,0    210,0    210,0    119,7
 20
21    Aktive III           -74kg
22    Decker, Harald                72,7   0,7285 05 03 55     TSV 1860 Stralsund   110,0    120,0   127,5    127,5    127,5     92,9
23



Hauptkampfrichter
NAME:
KR-Ausweisnummer:
                                                     Bundesverband Deutscher Kraftdreik
`4•44, VDK                                           Wettkampfprotokoll LM Bank Männer
                                  Klasse Jugend+Junioren


                                                                                       Bankdrücken
NR         Name, Vorname             KG     Coef. Geb.              Verein           1. 1 2.       3.             SUB.    TOT.    Wilk's
  1   Jugend             -66kg
  2   Hadschi, Rustam               64,45   0,8004   13 03 00     Motor Barth       85,0     90,0         95,0    95,0    95,0    76,0
  3   Platinat, Tim Hajo            65,05   0,7942   27 12 00     Motor Barth       60,0     67,5         72,5    72,5    72,5    57,6
  4
  5   Jugend              -93kg
  6   Winter, Johannes              91,55   0,6328   01 10 00     Motor Barth       92,5     97,5     100,0       100,0   100,0   63,3
  7
  8   Jugend             -105kg
  9   Kicikowski, Albert            99,80   0,6091 23 09 01        Motor Barth      95,0    102,5     107,5       107,5   107,5   65,5
10    Schilling, Torben Hans        97,50   0,6150 12 10 01     Greifenpower e,V.   90,0    95,0      -97,5       95,0     95,0   58,4
11
12    Jugend             -120kg
13    Jahn, Tobias                 106,60   0,5945   09 11 01     Motor Barth       75,0     82,5         -87,5   82,5    82,5    49,0
 14
 15   Junioren            -83kg
 16   Urbrock, Andy                 77,05   0,6993 21 10 96     Greifenpower e.V.    120,0   125,0     -130,5      125,0   125,0    87,4 id
 17
 20
 21   Junioren           -120kg
 22   Krohm, Marion                107,25   0,5932   14 11 98   Greifenpower e.V.   105,0    112,5    -120,0      112,5   112,5    66,7
 23
 24



Hauptkampfrichter
NAME:
KR-Ausweisnummer:
                                                   Bundesverband Deutscher Kraftdreik
CBVDK                                              Wettkampfprotokoll LM Bank Frauen

                                                                                      Bankdrücken
NR        Name, Vorname            KG     Coef. Geb.               Verein           1.     2.     3.          SUB.   TOT,   Wilk's
  1   Jugend             -72kg
  2   Kretschmann, Aenne                  1,0306   01 07 00    Greifenpower e.V.   55,0     57,5   60,0           60,0   60,0    61,8
                                  66,60
  3
  4   Jugend             -84kg
  5   Maier, Elisa                81,35   0,9064 04 04 00      Greifenpower e.V.   45.0  50,0  -55,0              50,0   50,0    45,3
  6
  7   Junioren           -63kg
  8   Bördecker, Nora             60,20   1,1120 15 07 97      Greifenpower e.V.   47,5     52,5     55,0             55,0   55,0    61,2
  9   Berauer, Paula              62,20   1,0844 15 10 97      Greifenpower e.V.   47,5    50,0       -52,5   50,0   50,0    54,2
 10
 13
 14   Aktive              -52kg
 15   Wagner, Isabel              50,35   1,2769 05 04 94      Greifenpower e.V    50,0    52,5     -55,0        52,5   52,5    67,0
 16
 17   Aktive              -63kg
 18   Lipinski, Mandy             59,45   1,1221 20 01 84      Greifenpower e.V.   50,0    55,0     -60,0   55,0   55,0    61,7
 19
 20   Aktive              -72kg
 21   Brandt Katharina            69,80   0,9968 20 03 84      Greifenpower e.V.   75,0    -80,0    -80,0       75,0   75,0    74,8
 22
 23   Aktive I            -63kg
 24   Possel, Zaneta              60,50   1,1078   03 07 77,   Greifenpower e.V.   -57,5   57,5     -65,0          57,5   57,5    63,7
 25
 26   Aktive I            -72kg
 27   Stubbe, Ramona              70,90   0,9862   17 04 75    Greifenpower e.V.   -30,0   35,0       -40,0   35,0   35,0    34,5
 28
 29   Aktive I           ü 84kg
 30   Denz, Jeanette              89,00   0,8681 01 05 75      Greifenpower e.V.   65,0    70,0       72,5    72,5   72,5    62,9
 31



Hauptkampfrichter
NAME:
KR-Ausweisnummer:
                                                          Bundesverband Deutscher Kraftdreik
                                                          Wettkampfprotokoll LM Bank Männer
                                  Klasse Aktive


                                                                                              Bankdrücken
NR        Name, Vorname                  KG      Coef. Geb.               Verein            1.     2.     3.        SUB.    TOT.    Wilk's
 1                            -74kg
 2   Münn, Steve                       72,65     0,7285 06 10 89     Greifenpower e.V.    120,0    127,5    133,0   133,0   133,0   96,9 V
 3   Lück, Clemens                     70,50     0,7453 19 10 91     Blau-Weiß-Bergen     120,0    125,0   130,0 130,0      130,0   96,9
 5
 6                            -93kg
 7    Birr, Hannes                     86,30     0,6528   07 10 93   TSV 1860 Stralsund 120,0      130,0   -135,0   130,0   130,0   84,9
 9
10                           -105kg
11   Steffan, Rene                    103,50     0,6006   25 09 86   Greifenpower e.V.     180,0   -190,0 -190,0    180,0   180,0   108,1
12   Dupke, Janick                    101,50     0,6050   23 01 93      Brüeler SV         130,0    135,0 -140,0    135,0   135,0    81,7
13   Papke, Tobias                     95,10     0,6217   26 03 86   Greifenpower e.V.    -120,0    120,0 -125.0    120,0   120,0    74,6
14   Bessler, Felix                   104,20     0,5992   29 12 88     Preetzer TSV        177,5    182,5  190,5    190,5   190,5   114,1 I
15
16                           -120kg
17   Falber, Matthias                 119,25     0,5757 05 08 85      Greifenpower e.V.   160,0    165,0 -170,0     165,0   165,0   95,0
18   Hoyer, Frank                     107,00     0,5937 20 07 80     TSV 1860 Stralsund   140,0     150,0 160,0     160,0   160,0   95,0
19   Eberhardt, Christoph             109,00 ,   0,5902 27 06 93     Grün-Weiß-Usedom     155,0    -160,0 -160,0    155,0   155,0   91,5
20   Harloff, Sven                    114,501    0,5817 19 12 81      Greifenpower e.V.   130,0    140,0 -150,0     140,0   140,0   81,4



Hauptkampfrichter
NAME:
KR-Ausweisnummer:
                                                      Bundesverband Deutscher Kraftdreik
                                                      Wettkampfprotokoll LM Bank Männer
                                  Klasse Aktive I, II, III, IV


                                                                                                 Bankdrücken
NR         Name, Vorname             KG     Coef.     Geb.              Verein                 1.     2.     3.                     SUB.    TOT.    Wilk's
  1   Aktive I          -83kg
  2   Wodtke, Axel                  80,80   0,6785    11 08 70    TSV 1860 Stralsund        110,0       115,0         -120,0        115,0   115,0   78,0
  3   Wendlandt, Jens               77,40   0,6975    04 06 72     Greifenpower e.V.        -100,0      105,0          107,5        107,5   107,5   75,0
  4
  5   Aktive I           -93kg
  6   Freyer, Ronny                 91,50   0,6331    18 01 73     Greifenpower e.V.         115,0      120,0         130,0         130,0   130,0    82,3
  7
  8   Aktive I           -105kg
  9   Engel, Swen                  103,95   0,5996    21 02 72    AC Lauchhammer             150,0      155,0         160,0         160,0   160,0    95,9
11
12    Aktive 1           -120kg                                                                                   
13    Beug Daniel                  11570    0,5801 14 01 74        Greifenpower e.V.         170,0      180,0       190,0                190,0   190,0   110,2 
14    Bandelin, Frank              109,45   0,5893 20 06 74          Motor Wolgast           160,0      170,0    172,5                 172,5   172,5   101,7
 15   Dähling, Karsten             114,67   0,5815 10 05 73         Herrnburger AV           135,0      -140,0   -140,0               135,0   135,0    78,5
 16   Schröter, Thomas             114,45   0,5817 19 07 70        Blau-Weiß-Bergen          120,0       125,0   132,5                132,5   132,5    77,1
 17
 18   Aktive 1          +120kg
 19   Krohm, Moden             131,30       0,5646     12 04 72    Greifenpower e.V.         120,0      -127,5        127,5         127,5   127,5    72,0
 20   Brunnenkref, Thomas      127,35       0,5677     13 05 77    Greifenpower e.V.         155,0     160,0         -165,0         160,0    160,0    90,8
 21
 22   Aktive II           -93kg
 23   Deeth, Knut                   88,90   0,6424     03 11 62    Blau-Weiß-Bergen          115,0       120,0        125,0         125,0   125,0    80,3
 24
    Aktive II           -105kg
    Klöhn, Olaf                   95,80     0,6197     06 05 68    Greifenpower e.V.         140,0      -145,0   -145,0               140,0   140,0    86,8
 27 Wudtke, Martin               101,40     0,6053     24 01 67    Greifenpower e.V.         147,5       150,5      -                 150,5   150,5    91,1
 28 Ahrens, Torsten               97,70     0,6144     27 09 59    Greifenpower e.V.         125,0      -130,0   -130,0               125,0   125,0    76,8
 29
 30 Aktive II          -120kg
 31 Bailleu, Dirk                116,15     0,5795     01 04 65    Greifenpower e.V.         150,0      -155,0   -155,0             150,0      150,0    86,9
 32 Waehnke, Olaf                117,35     0,5780     08 03 64    Greifenpower e.V.         150,0       155,0     158,5             158,5     158,5    91,6
 33
 34 Aktive III            -93kg
 35 Krüger, Detlef                84,45     0,6606     29 12 53    Blau-Weiß-Bergen           110,0      115,0     -117,5           115,0         115,0    76,0
 36 Latzke, Werner                91,10     0,6345     24 06 53       ESV Waren               112,5      117,5      121,0             121,0     121,0    76,8
 37
 38 Aktive III          -105kg
 39 Thürk, Hans-Joachim          101,25     0,6055     31 10 49    Greifenpower e.V.          125,0      -130,0       -130,0        125,0   125,0    75,7
 40 Falk, Hans-Peter             103,45     0,6006     10 12 51     Herrnburger AV             140,0      145,0      147,5          147,5   147,5    88,6
 41
 42 Aktive III          -120kg
 43 Heiden, Jürgen               107,80     0,5923 15 02 55          Motor Wolgast            140,0      145,0        150,0         150,0   150,0    88,8
 44 Syska, Norbert               116,40     0,5792 09 11 55          Preetzer TSV             100,0      105,0        -107,5        105,0   105,0    60,8
 45
 46 Aktive IV             -83kg
 47 Warnke Peter                  7435       0,7166    19 11 46       ESV Waren                75,0    80,0    82,5      82,5             82,5    59,1 V
 48
 49 Aktive IV              -93kg
 50 Wiechert, Hartmut             90,60      0,6363    23 10 46   TSV 1860 Stralsund    75,0   80,0    87,5    87,5    87,5    55,7
 51 Kolditz, Wolfgang             85,40      0,6566    07 04 40     Herrnburger AV     60,0        67,5         72,5                  72,5    47,6
 52



Hauptkampfrichter
NAME:
KR-Ausweisnummer:
