WeightClassKg,Equipment,Division,Name,Sex,BodyweightKg,Best3SquatKg,Best3BenchKg,Best3DeadliftKg,TotalKg,Deadlift4Kg,Event,Place
56,Raw,Amateur Open,Patty Coulter,F,53.8,90.72,54.43,136.08,281.23,137.21,SBD,1
60,Raw,Amateur Open,Sophie Munoz,F,59.87,36.29,38.56,79.38,154.22,,SBD,1
67.5,Raw,Amateur Submaster 33-39,Amanda Mullany,F,66.86,70.31,45.36,106.59,222.26,,SBD,1
75,Raw,Amateur Open,Samantha Stewartz,F,72.03,113.4,61.23,127.01,301.64,,SBD,1
90,Raw,Amateur Open,Rebecca Tucker,F,88.36,131.54,90.72,158.76,381.02,,SBD,1
100,Wraps,Amateur Open,Nikita Halteman,F,94.98,138.35,70.31,174.63,383.29,,SBD,1
67.5,Single-ply,Amateur Open,Tim Kingure,M,66.95,215.46,111.13,195.04,521.63,,SBD,1
75,Raw,Amateur Open,Ian Wylie,M,74.3,195.04,136.08,244.94,576.06,,SBD,1
75,Raw,Amateur Open,Dylan Edward Dotson,M,74.66,147.42,138.35,190.51,476.27,,SBD,1
75,Single-ply,Amateur Master 55-59,Greg Ruth,M,71.76,174.63,108.86,174.63,458.13,,SBD,1
82.5,Raw,Amateur Teen 18-19,Elijah Ruth,M,81.01,129.27,108.86,181.44,419.57,,SBD,1
82.5,Raw,Amateur Open,John Crowther,M,81.1,161.03,124.74,215.46,501.22,,SBD,1
90,Raw,Amateur Junior 20-23,Eric Mannes,M,86.36,201.85,127.01,224.53,553.38,,SBD,1
90,Raw,Amateur Open,John Schooley Jr,M,87.91,165.56,140.61,229.06,535.24,,SBD,1
90,Raw,Amateur Open,Aron Duncan,M,88.99,170.1,102.06,257.41,529.57,,SBD,2
90,Raw,Amateur Open,Aaron Brophy,M,88.81,158.76,120.2,240.4,519.36,,SBD,3
90,Raw,Amateur Open,Stephen Lacey,M,84.91,170.1,124.74,231.33,526.17,,SBD,1
90,Multi-ply,Amateur Open,Blair Decker,M,87.54,285.76,192.78,247.21,725.75,,SBD,1
100,Single-ply,Amateur Teen 18-19,Gabriel Starcher,M,96.71,199.58,172.37,229.06,601.01,,SBD,1
110,Multi-ply,Pro Open,Nick Tsourounis,M,108.32,385.55,272.16,297.1,954.81,,SBD,2
110,Multi-ply,Pro Open,Mike Johnston,M,109.32,455.86,260.82,353.8,1070.48,,SBD,1
125,Multi-ply,Pro Open,Jay Denton,M,116.48,374.21,249.48,260.82,884.51,,SBD,2
140,Multi-ply,Pro Open,Brandon Lilly,M,139.25,442.25,362.87,342.46,1147.59,,SBD,1
82.5,Raw,Amateur Master 55-59,Thomas Lewis,M,79.11,,145.15,,145.15,,B,1
82.5,Raw,Amateur Submaster 33-39,Chritopher Pratt,M,81.92,,142.88,,142.88,,B,1
82.5,Raw,Amateur Open,Mike Easter,M,82.19,,90.72,,90.72,,B,1
56,Raw,Amateur Master 50-54,Dawn Christ,M,53.89,,49.9,102.06,151.95,,BD,1
75,Raw,Amateur Teen 16-17,Grant Olinger,M,74.57,,90.72,181.44,272.16,,BD,1
75,Raw,Amateur Teen 18-19,Nate Miriello,M,74.93,,122.47,219.99,342.46,,BD,1
75,Raw,Amateur Junior 20-23,Patrick Hagen,M,74.57,,136.08,167.83,303.91,,BD,1
82.5,Raw,Amateur Submaster 33-39,Jon Mullany,M,81.19,,165.56,192.78,358.34,,BD,1
82.5,Raw,Amateur Open,Ed Harrington,M,82.19,,165.56,204.12,369.68,,BD,1
82.5,Multi-ply,Pro Open,Mike Kemper,M,80.38,,195.04,276.69,471.74,,BD,1
90,Raw,Amateur Junior 20-23,Patrick Campion,M,87.54,165.56,,213.19,,,SBD,DQ
100,Wraps,Amateur Open,Aaron Utermahlen,M,97.89,238.14,163.29,242.67,644.1,,SBD,1
100,Raw,Amateur Open,Matthew Ginion,M,93.44,229.06,138.35,197.31,564.72,,SBD,1
100,Multi-ply,Amateur Open,Chuck Brightbill,M,99.79,324.32,163.29,294.84,782.45,,SBD,1
100,Multi-ply,Pro Open,Rusty Pugh,M,99.43,310.71,272.16,233.6,816.47,,SBD,1
100,Multi-ply,Pro Master 40-44,Rusty Pugh,M,99.43,310.71,272.16,233.6,816.47,,SBD,1
100,Multi-ply,Pro Master 45-49,Chuck Blough,M,99.43,303.91,208.65,297.1,809.66,,SBD,1
110,Raw,Amateur Open,David Gutshall,M,107.41,208.65,176.9,249.48,635.03,,SBD,1
110,Raw,Amateur Junior 20-23,John Durner,M,104.6,249.48,181.44,299.37,730.28,,SBD,1
110,Raw,Amateur Submaster 33-39,Mark Gallo,M,107.77,226.8,163.29,247.21,637.3,,SBD,1
110,Raw,Pro Open,Seth Abrahams,M,101.51,183.7,170.1,235.87,589.67,,SBD,1
110,Wraps,Amateur Open,Brad Hartlaub,M,108.68,181.44,158.76,226.8,566.99,,SBD,1
110,Wraps,Amateur Master 50-54,Randal Olinger,M,103.15,188.24,117.93,206.38,512.56,,SBD,1
110,Multi-ply,Police Pro Open,Kyle Decker,M,108.59,378.75,215.46,299.37,893.58,,SBD,1
110,Multi-ply,Pro Open,Jim Jones,M,106.41,385.55,281.23,285.76,952.54,,SBD,3
110,Multi-ply,Pro Open,Jesse Jayne,M,109.13,408.23,272.16,272.16,952.54,,SBD,4
125,Raw,Amateur Open,Sidney Maffett,M,120.02,192.78,136.08,195.04,523.9,,SBD,1
125,Raw,Pro Open,Ryan McVearry,M,120.47,251.74,192.78,256.28,700.8,,SBD,1
125,Wraps,Amateur Open,David Maffet,M,121.38,210.92,142.88,249.48,603.28,,SBD,1
125,Wraps,Amateur Submaster 33-39,David Maffet,M,121.38,210.92,142.88,249.48,603.28,,SBD,1
125,Wraps,Police Pro Open,Tim Reese,M,123.1,217.72,136.08,215.46,569.26,,SBD,1
125,Multi-ply,Amateur Open,Matthew Vangeli,M,122.56,317.51,215.46,294.84,827.81,,SBD,1
125,Multi-ply,Amateur Open,Tim Davis,M,121.65,317.51,226.8,254.01,798.32,,SBD,2
125,Multi-ply,Amateur Open,Matt Jackosky,M,115.76,283.5,142.88,260.82,687.19,,SBD,3
125,Multi-ply,Pro Open,Brian Reed,M,116.12,408.23,235.87,319.78,963.88,,SBD,1
140,Raw,Pro Open,Jesse Hudson,M,131.09,310.71,201.85,303.91,816.47,,SBD,1
140,Multi-ply,Amateur Open,George Underwood,M,137.62,356.07,283.5,281.23,920.79,,SBD,1
140,Multi-ply,Pro Open,Andrew Cuenco,M,126.1,385.55,281.23,303.91,970.69,,SBD,2
140+,Raw,Amateur Junior 20-23,Joseph Sharp,M,144.24,226.8,192.78,226.8,646.37,,SBD,1
100,Raw,Amateur Master 55-59,Craig Carole,M,99.7,,129.27,,129.27,,B,1
100,Multi-ply,Pro Submaster 33-39,Deon Brauer,M,99.79,,183.7,,183.7,,B,1
110,Raw,Amateur Master 55-59,Dennis Burns,M,107.23,,165.56,,165.56,,B,1
110,Raw,Pro Master 40-44,Darrell Capps,M,108.86,,,,,,B,DQ
110,Multi-ply,Pro Junior 20-23,Scott Hanna,M,105.6,,249.48,,249.48,,B,1
110,Raw,Amateur Open,Pat Murphy,M,107.23,,149.69,,149.69,,B,1
125,Raw,Pro Open,Barry Calhoun,M,121.56,,229.06,,229.06,,B,1
125,Raw,Police Pro Open,Barry Calhoun,M,121.56,,229.06,,229.06,,B,1
125,Raw,Pro Master 40-44,Barry Calhoun,M,121.56,,229.06,,229.06,,B,1
100,Multi-ply,Amateur Open,Ian Decker,M,99.25,,183.7,272.16,455.86,,BD,1
110,Raw,Amateur Junior 20-23,Tyler McCloskey,M,108.23,,138.35,229.06,367.41,,BD,1
110,Multi-ply,Amateur Submaster 33-39,Matt McDonnell,M,103.51,,226.8,272.16,498.95,,BD,1
125,Raw,Amateur Submaster 33-39,Bill King,M,123.38,,136.08,204.12,340.19,,BD,1
