Sex,Equipment,Division,WeightClassKg,Name,BodyweightKg,Best3SquatKg,Best3BenchKg,Best3DeadliftKg,TotalKg,Event,Place
F,Raw,Crossfit,60,Emily Wagner,58.69,111.13,56.7,120.2,288.03,SBD,1
F,Raw,Amateur Junior 20-23,75,Eliana Kim,73.48,102.06,54.43,127.01,283.5,SBD,1
F,Raw,Amateur Open,75,Megan McDonald,73.57,124.74,63.5,136.08,324.32,SBD,1
F,Wraps,Amateur Junior 20-23,75,Neso Shteiwi,73.48,111.13,61.23,129.27,301.64,SBD,1
F,Raw,Amateur Junior 20-23,82.5,Elise Stephens,80.74,142.88,79.38,161.03,383.29,SBD,1
F,Wraps,Amateur Open,100,Sarah Clark,99.34,151.95,70.31,170.1,392.36,SBD,1
F,Wraps,Amateur Open,100,Alison Crowdus,98.43,129.27,99.79,158.76,387.82,SBD,2
F,Wraps,Amateur Open,100,Ashley Ross,94.89,102.06,52.16,108.86,263.08,SBD,3
M,Wraps,Amateur Junior 20-23,67.5,Branden Bergen,65.68,167.83,117.93,213.19,498.95,SBD,1
M,Raw,Crossfit,75,Deante Lamb,74.39,170.1,124.74,213.19,508.02,SBD,1
M,Raw,Crossfit,75,Steven Nelson,74.39,170.1,131.54,181.44,483.08,SBD,2
M,Wraps,Amateur Open,75,Thomas Sodini,74.03,235.87,142.88,258.55,637.3,SBD,1
M,Wraps,Amateur Teen 18-19,75,Liam Bowser,69.4,142.88,83.91,183.7,410.5,SBD,1
M,Wraps,Pro Junior 20-23,75,Nick Henwood,74.57,235.87,147.42,226.8,610.08,SBD,1
M,Raw,Amateur Junior 20-23,82.5,Corey Berlant,82.1,158.76,124.74,201.85,485.34,SBD,1
M,Wraps,Amateur Junior 20-23,82.5,Ethan Lenn,80.2,197.31,120.2,206.38,523.9,SBD,1
M,Wraps,Amateur Open,82.5,Ben Siegel,80.74,192.78,138.35,288.03,619.15,SBD,1
M,Wraps,Pro Open,82.5,Brett Good,82.01,278.96,161.03,263.08,703.07,SBD,1
M,Raw,Amateur Junior 20-23,90,Cody Tormoehlen,89.36,192.78,142.88,226.8,562.45,SBD,1
M,Raw,Amateur Junior 20-23,90,David Wieten,86.18,176.9,113.4,208.65,498.95,SBD,2
M,Raw,Amateur Junior 20-23,90,Gurneet Sangha,88.9,167.83,90.72,195.04,453.59,SBD,3
M,Raw,Amateur Open,90,Clifton Lucius,89.81,183.7,133.81,226.8,544.31,SBD,1
M,Raw,Amateur Open,90,Chris Billups,88.9,163.29,131.54,226.8,521.63,SBD,2
M,Raw,Amateur Open,90,Michael Perlmutter,88.72,163.29,113.4,197.31,474,SBD,3
M,Raw,Amateur Submaster 33-39,90,Clifton Lucius,89.81,183.7,133.81,226.8,544.31,SBD,1
M,Wraps,Amateur Junior 20-23,90,Cameron Tuck,88.99,167.83,117.93,204.12,489.88,SBD,1
M,Wraps,Amateur Open,90,Kyle Hoyt,87.54,281.23,174.63,244.94,700.8,SBD,1
M,Wraps,Amateur Open,90,Joe Cassidy,88.9,204.12,136.08,206.38,546.58,SBD,2
M,Wraps,Pro Open,90,Matt Wilkes,89.36,208.65,172.37,254.01,635.03,SBD,1
M,Raw,Amateur Open,100,David Franco,95.71,192.78,129.27,215.46,537.51,SBD,1
M,Wraps,Amateur Open,100,Alex McCoy,96.62,190.51,127.01,204.12,521.63,SBD,1
M,Wraps,Amateur Submaster 33-39,100,Shane Thiel,98.88,204.12,142.88,238.14,585.13,SBD,1
M,Wraps,Pro Open,100,Justin Sowers,99.34,310.71,210.92,308.44,830.07,SBD,1
M,Wraps,Pro Open,100,Bryan Doberdruk,99.34,288.03,195.04,331.12,814.2,SBD,2
M,Wraps,Pro Open,100,Jonathan Cornwell,99.52,278.96,190.51,301.64,771.11,SBD,3
M,Raw,Police Pro Open,110,Oran Smith,109.77,288.03,249.48,278.96,816.47,SBD,1
M,Wraps,Amateur Open,110,Justin Straight,105.69,238.14,151.95,276.69,666.78,SBD,1
M,Wraps,Amateur Open,110,James Eshleman,108.59,249.48,131.54,272.16,653.17,SBD,2
M,Wraps,Amateur Open,110,Josh Lytle,106.59,226.8,142.88,242.67,612.35,SBD,3
M,Wraps,Amateur Open,110,KC Burrows,109.23,181.44,122.47,229.06,532.97,SBD,4
M,Wraps,Pro Junior 20-23,110,Drew Othersen,108.41,288.03,219.99,288.03,796.05,SBD,1
M,Wraps,Pro Junior 20-23,110,Joe Koenig,109.77,260.82,158.76,272.16,691.73,SBD,2
M,Wraps,Pro Open,110,Drew Othersen,108.41,288.03,219.99,288.03,796.05,SBD,1
M,Raw,Amateur Open,125,Eric Cotter,113.4,183.7,129.27,226.8,539.77,SBD,1
M,Raw,Amateur Submaster 33-39,125,Joe Baxter,122.92,226.8,151.95,244.94,623.69,SBD,1
M,Wraps,Amateur Open,125,Luke Carnell,117.48,210.92,147.42,226.8,585.13,SBD,1
M,Wraps,Pro Junior 20-23,125,Mason Bremke,124.56,263.08,161.03,249.48,673.58,SBD,1
M,Wraps,Pro Master 40-44,125,Rogers Saunders,117.93,210.92,174.63,226.8,612.35,SBD,1
M,Wraps,Pro Open,125,Joe Abston,124.28,226.8,170.1,238.14,635.03,SBD,1
M,Wraps,Amateur Open,140,AJ Pearson,136.53,260.82,170.1,303.91,734.82,SBD,1
M,Wraps,Amateur Open,140,Craig Bush,125.46,256.28,161.03,229.06,646.37,SBD,2
M,Wraps,Amateur Open,140,Joe Connor,133.81,195.04,149.69,229.06,573.79,SBD,3
M,Wraps,Amateur Submaster 33-39,140+,Joe Robinette,146.96,204.12,158.76,222.26,585.13,SBD,1
M,Wraps,Pro Junior 20-23,140+,Tyler Scott O'Bringer,157.4,369.68,226.8,333.39,929.86,SBD,1
M,Wraps,Pro Open,140+,Tyler Scott O'Bringer,157.4,369.68,226.8,333.39,929.86,SBD,1
M,Raw,Police Pro Open,110,Oran Smith,109.77,,249.48,,249.48,B,1
M,Raw,Pro Open,67.5,Luke Starnes,64.86,,145.15,,145.15,B,1
M,Raw,Amateur Teen 18-19,110,David Brockmeier,100.7,,140.61,,140.61,B,1
M,Raw,Pro Open,100,Jonathan Cornwell,99.52,,190.51,301.64,492.15,BD,1
