Place,WeightClassKg,Name,Equipment,Team,BodyweightKg,Squat1Kg,Squat2Kg,Squat3Kg,Best3SquatKg,Bench1Kg,Bench2Kg,Bench3Kg,Best3BenchKg,Deadlift1Kg,Deadlift2Kg,Deadlift3Kg,Best3DeadliftKg,TotalKg,Division,Sex,Event
1,84+,Marit Gråbak,Raw,Melhus IL,93.60,,,,,72.5,-77.5,-77.5,72.5,,,,,72.5,Open,F,B
1,84,Hilde Wahl Berg,Raw,Trøndertun SK,79.00,75,90,-105,90.0,55,62.5,-65,62.5,110,125,137.5,137.5,290,Master 50-59,F,SBD
1,93,Øystein Andre Gimnes,Raw,Trøndertun SK,93.00,90,100,110,110.0,75,85,-92.5,85.0,140,150,160,160.0,355,Open,M,SBD
1,120+,Erlend Skorstad,Single-ply,Trøndertun SK,122.00,,,,,257.5,-270,-280,257.5,,,,,257.5,Open,M,B
1,120+,Åge Berntsen,Single-ply,Trøndertun SK,150.10,,,,,260,-280,-300,260.0,,,,,260,Master 40-49,M,B
