Place,Name,CyrillicName,Sex,WeightClassKg,Division,BirthYear,BirthDate,Age,BodyweightKg,Bench1Kg,Bench2Kg,Bench3Kg,Best3BenchKg,Deadlift1Kg,Deadlift2Kg,Deadlift3Kg,Best3DeadliftKg,TotalKg,Event,Equipment
1,Mariya Suzdaltseva,Мария Суздальцева,F,60,Open,,1992-12-11,23,59.5,60,65,70,70,,,,,70,B,Raw
2,Lyudmila Ryamaeva,Людмила Рямаева,F,67.5,Open,,1980-01-12,36,64.5,60,65,-67.5,65,,,,,65,B,Raw
3,Evgeniya Prokhorenko,Евгения Прохоренко,F,67.5,Open,,1985-12-25,30,63.3,60,62.5,-65,62.5,,,,,62.5,B,Raw
4,Anna Riznik,Анна Ризник,F,56,Open,,1992-10-27,,55.9,57.5,60,-62.5,60,,,,,60,B,Raw
5,Yuliya Nenartovich,Юлия Ненартович,F,56,Open,,1988-01-03,28,52.5,50,55,-57.5,55,,,,,55,B,Raw
6,Yuliya Vodolazova,Юлия Водолазова,F,67.5,Open,,,,66,-52.5,55,-65,55,,,,,55,B,Raw
7,Olga Franchuk,Ольга Франчук,F,67.5,Open,,1997-05-12,19,61.1,50,-55,-55,50,,,,,50,B,Raw
8,Yuliya Ivanova,Юлия Иванова,F,75,Open,,1982-06-14,34,69.9,45,47.5,-52.5,47.5,,,,,47.5,B,Raw
9,Natalya Bakina,Наталья Бакина,F,67.5,Open,,1985-03-29,,64,45,47.5,-50,47.5,,,,,47.5,B,Raw
1,Aleksey Kuleshov,Алексей Кулешов,M,75,Open,,1977-09-06,39,73.8,155,160,165,165,,,,,165,B,Raw
2,Roman Galeev,Роман Галеев,M,75,Open,,,,74.8,105,110,-115,110,,,,,110,B,Raw
3,Aleksey Shcherbakov,Алексей Щербаков,M,67.5,Open,,1997-08-08,19,65,75,85,,85,,,,,85,B,Raw
4,Artem Averin,Артем Аверин,M,75,Open,,2002-07-06,14,73.5,50,52.5,-60,52.5,,,,,52.5,B,Raw
5,Vladislav Kozunov,Владислав Козунов,M,52,Open,,2000-07-19,16,51.5,45,50,-57.5,50,,,,,50,B,Raw
1,Aleksey Belov,Алексей Белов,M,90,Open,,1994-07-14,22,89,157.5,160,165,165,,,,,165,B,Raw
2,Gennadiy Postanogov,Геннадий Постаногов,M,90,Open,,1984-04-26,32,89.3,152.5,160,-165,160,,,,,160,B,Raw
3,Lev Drozdenko,Лев Дрозденко,M,90,Open,,1985-04-15,31,86.2,-157.5,-157.5,157.5,157.5,,,,,157.5,B,Raw
4,Anatoliy Popov,Анатолий Попов,M,90,Open,1970,,46,82.8,135,147.5,155,155,,,,,155,B,Raw
5,Nikita Polyakov,Никита Поляков,M,90,Open,,1991-01-18,25,88.2,142.5,145,150,150,,,,,150,B,Raw
6,Sergey Zotov,Сергей Зотов,M,90,Open,,1983-09-14,33,88.5,130,140,147.5,147.5,,,,,147.5,B,Raw
7,Andrey Savinov,Андрей Савинов,M,90,Open,,1980-03-26,36,88.7,-142.5,147.5,-152.5,147.5,,,,,147.5,B,Raw
8,Dmitriy Pakhomov,Дмитрий Пахомов,M,90,Open,,1970-07-30,,88.3,130,135,140,140,,,,,140,B,Raw
9,Dmitriy Evdokimov,Дмитрий Евдокимов,M,82.5,Open,,1986-09-18,30,82.5,127.5,-132.5,-132.5,127.5,,,,,127.5,B,Raw
10,Kirill Boyko,Кирилл Бойко,M,90,Open,,1993-05-31,23,82.7,-110,127.5,-142.5,127.5,,,,,127.5,B,Raw
11,Pavel Pechnikov,Павел Печников,M,82.5,Open,,1994-07-06,22,80.4,110,125,-127.5,125,,,,,125,B,Raw
12,Vladislav Shinvari,Владислав Шинвари,M,90,Open,,1997-10-13,19,87,120,-130,-130,120,,,,,120,B,Raw
13,Artem Khalikov,Артем Халиков,M,90,Open,,,,86.5,110,117.5,-120,117.5,,,,,117.5,B,Raw
14,Mikhail Kushchuk,Михаил Кущук,M,82.5,Open,,1974-03-03,42,82.5,110,-120,-120,110,,,,,110,B,Raw
DQ,Vladislav Gas,Владислав Гась,M,82.5,Open,,1987-05-05,29,81.1,-120,-120,-120,,,,,,,B,Raw
G,Yury Belkin,Юрий Белкин,M,110,Open,,1990-12-05,25,102.7,230,240,-250,240,,,,,240,B,Raw
1,Egor Gridchenkov,Егор Гридченков,M,110,Open,,1990-09-24,26,105.8,140,145,150,150,,,,,150,B,Raw
2,Sergey Zavadskiy,Сергей Завадский,M,110,Open,,1986-09-23,30,103,145,-150,-150,145,,,,,145,B,Raw
3,Vasiliy Uzdyaev,Василий Уздяев,M,110,Open,,1998-06-18,18,101.2,120,-135,135,135,,,,,135,B,Raw
4,Artem Panov,Артем Панов,M,100,Open,,1990-09-01,26,95.5,125,-135,-140,125,,,,,125,B,Raw
1,Kirill Bulatov,Кирилл Булатов,M,125,Open,,1989-12-30,26,122,165,175,180,180,,,,,180,B,Raw
2,Vladislav Troyanov,Владислав Троянов,M,140,Open,,1999-12-26,16,136.2,90,100,110,110,,,,,110,B,Raw
DQ,Evgeniy Lapin-Kratasyuk,Евгений Лапин-Кратасюк,M,140,Open,,1980-09-13,,127,-190,-190,-190,,,,,,,B,Raw
1,Lyudmila Ryamova,Людмила Рямова,F,67.5,Open,,1980-01-12,36,64.5,,,,,135,142.5,145,145,145,D,Raw
2,Svetlana Limushkina,Светлана Лимушкина,F,60,Open,,1979-04-02,37,58.8,,,,,122.5,127.5,-130,127.5,127.5,D,Raw
3,Elena Zemerova,Елена Земерова,F,48,Open,,1980-01-01,36,47.3,,,,,92.5,100,105,105,105,D,Raw
4,Mariya Suzdaltseva,Мария Суздальцева,F,60,Open,,1992-02-11,,59.5,,,,,90,100,-102.5,100,100,D,Raw
5,Natalya Bakina,Наталья Бакина,F,67.5,Open,,1985-03-29,31,64,,,,,90,95,100,100,100,D,Raw
1,Rodion Tarasov,Родион Тарасов,M,75,Open,,1999-03-12,17,71.4,,,,,200,215,-222.5,215,215,D,Raw
2,Aleksandr Sushkov,Александр Сушков,M,75,Open,,,,74.6,,,,,160,170,-180,170,170,D,Raw
3,Daniil Sushkov,Даниил Сушков,M,75,Open,,,,67.5,,,,,120,130,,130,130,D,Raw
4,Artem Averin,Артем Аверин,M,75,Open,,2002-07-06,14,73.6,,,,,80,100,-110,100,100,D,Raw
1,Sergey Zotov,Сергей Зотов,M,90,Open,,1987-05-11,29,83.5,,,,,210,220,225,225,225,D,Raw
2,Sergey Zotov,Сергей Зотов,M,90,Open,,1983-09-14,33,88.5,,,,,200,212.5,222.5,222.5,222.5,D,Raw
3,Vladimir Belyaev,Владимир Беляев,M,90,Open,,,,87.6,,,,,170,180,190,190,190,D,Raw
4,Denis Suchkov,Денис Сучков,M,90,Open,,1990-01-24,26,88.9,,,,,160,170,175,175,175,D,Raw
5,Valentin Nazarov,Валентин Назаров,M,82.5,Open,,1988-05-16,28,76.5,,,,,155,157.5,160,160,160,D,Raw
6,Sergey Nesterov,Сергей Нестеров,M,82.5,Open,,1990-08-08,26,78.2,,,,,145,152.5,157.5,157.5,157.5,D,Raw
7,Vladislav Gas,Владислав Гась,M,82.5,Open,,,,81.1,,,,,145,-157.5,157.5,157.5,157.5,D,Raw
8,Pavel Pechnikov,Павел Печников,M,82.5,Open,,1994-07-06,22,80.4,,,,,125,140,-160,140,140,D,Raw
1,Viktor Kushnirev,Виктор Кушнирев,M,110,Open,,1978-05-08,38,109,,,,,230,252.5,-260,252.5,252.5,D,Raw
2,Konstantin Pylaev,Константин Пылаев,M,110,Open,,1972-11-01,44,108.2,,,,,215,230,240,240,240,D,Raw
3,Egor Gridchenkov,Егор Гридченков,M,110,Open,,1990-09-24,26,105.8,,,,,210,215,220,220,220,D,Raw
4,Evgeniy Kovalenko,Евгений Коваленко,M,100,Open,,1992-01-26,24,92,,,,,160,170,175,175,175,D,Raw
1,Evgeniy Lapin-Kratasyuk,Евгений Лапин-Кратасюк,M,140,Open,,1980-09-13,36,127.5,,,,,260,-270,270,270,270,D,Raw
2,Boris Nikolaev,Борис Николаев,M,125,Open,,1987-03-09,29,112,,,,,210,225,235,235,235,D,Raw
3,Vladislav Troyanov,Владислав Троянов,M,140,Open,,1999-12-26,16,136,,,,,140,165,187.5,187.5,187.5,D,Raw
