{
  "name": "ratasenlasparedes",
  "title": "Ratas en las paredes",
  "description": "Ratas en las paredes para FoundryVTT!",
  "version": "0.9.6",
  "minimumCoreVersion": "0.6.5",
  "compatibleCoreVersion": "0.7.5",
  "templateVersion": 2,
  "author": "jvir",
  "esmodules": ["module/ratasenlasparedes.js"],
  "styles": ["css/ratasenlasparedes.css"],
  "scripts": [],
  "packs": [
        {
			"name": "armas",
			"label": "Armas",
			"system": "ratasenlasparedes",
			"path": "./packs/armas.db",
			"entity": "Item"
		},
		{
			"name": "ayudas",
			"label": "Ayudas",
			"system": "ratasenlasparedes",
			"path": "./packs/ayudas.db",
			"entity": "JournalEntry"
		},
		{
			"name": "equipo",
			"label": "Equipo",
			"system": "ratasenlasparedes",
			"path": "./packs/equipo.db",
			"entity": "Item"
		},
		{
			"name": "profesiones",
			"label": "Profesiones",
			"system": "ratasenlasparedes",
			"path": "./packs/profesiones.db",
			"entity": "Item"
		},
		{
			"name": "reputaciones",
			"label": "Reputaciones",
			"system": "ratasenlasparedes",
			"path": "./packs/reputaciones.db",
			"entity": "Item"
		},
		{
			"name": "hechizos",
			"label": "Hechizos",
			"system": "ratasenlasparedes",
			"path": "./packs/hechizos.db",
			"entity": "Item"
		},
		{
			"name": "experiencia",
			"label": "Experiencia",
			"system": "ratasenlasparedes",
			"path": "./packs/experiencia.db",
			"entity": "Item"
		},
		{
			"name": "tablas",
			"label": "Tablas",
			"system": "ratasenlasparedes",
			"path": "./packs/tablas.db",
			"entity": "RollTable"
		},
		{
			"name": "antagonistas",
			"label": "Antagonistas",
			"system": "ratasenlasparedes",
			"path": "./packs/antagonistas.db",
			"entity": "Actor"
		},
        {
			"name": "horrores-tras-los-muros-de-la-cordura",
			"label": "Horrores tras los muros de la cordura",
			"system": "ratasenlasparedes",
			"path": "./packs/horrores-tras-los-muros-de-la-cordura.db",
			"entity": "Actor"
		}
  ],
  "languages": [
    {
      "lang": "es",
      "name": "Spanish",
      "path": "lang/es.json"
    }
  ],
  "gridDistance": 2,
  "gridUnits": "m",
  "primaryTokenAttribute": "pv",
  "secondaryTokenAttribute": "pc",
  "url": "https://gitlab.com/jvir/foundry-ratasenlasparedes/",
  "manifest": "https://gitlab.com/jvir/foundry-ratasenlasparedes/-/raw/master/system.json",
  "download": "https://gitlab.com/jvir/foundry-ratasenlasparedes/-/archive/master/foundry-ratasenlasparedes-master.zip",
  "license": "LICENSE.txt"
}
