<?php 
    /**
     * describe a skill
     */
    final class Skill {
        private $_id;
        private $_logoLink;
        private $_name;
        private $_content;

        public function __construct($data)
        {
            /* call all the setter */
            $this->_hydrate($data[0]);
        }

        /**
         * call all the setter
         * 
         * @param array $data from the database
         */
        private function _hydrate(array $data)
        {
            /* for each attributs in the database */
            foreach($data as $key => $value){
                //get the setter name of the attributs
                $method = 'set'.ucfirst($key);
                //if the setter exist 
                if(method_exists($this,$method)){
                    $this->$method($value);
                }
            }
        }
       
        /**
         * Get the value of _id
         */ 
        public function getId()
        {
            return $this->_id;
        }

        /**
         * Set the value of _id
         */ 
        public function setId($id)
        {
            $this->_id = $id;
        }

        /**
         * Get the value of _logoLink
         */ 
        public function getLogoLink()
        {
            return $this->_logoLink;
        }

        /**
         * Set the value of _logoLink
         */ 
        public function setLogoLink($logoLink)
        {
            $this->_logoLink = $logoLink;
        }

        /**
         * Get the value of _name
         */ 
        public function getName()
        {
            return $this->_name;
        }

        /**
         * Set the value of _name
         */ 
        public function setName($name)
        {
            $this->_name = $name;
        }

        /**
         * Get the value of _content
         */ 
        public function getContent()
        {
            return $this->_content;
        }

        /**
         * Set the value of _content
         */ 
        public function setContent($content)
        {
            $this->_content = $content;
        }

    }
?>

