%YAML 1.1
%TAG !u! tag:unity3d.com,2011:
--- !u!1 &6995046272744306100
GameObject:
  m_ObjectHideFlags: 0
  m_CorrespondingSourceObject: {fileID: 0}
  m_PrefabInstance: {fileID: 0}
  m_PrefabAsset: {fileID: 0}
  serializedVersion: 6
  m_Component:
  - component: {fileID: 7070133148945494008}
  - component: {fileID: 3736118625656842818}
  m_Layer: 31
  m_Name: Blocs individuals Lvl 1
  m_TagString: Untagged
  m_Icon: {fileID: 0}
  m_NavMeshLayer: 0
  m_StaticEditorFlags: 0
  m_IsActive: 1
--- !u!4 &7070133148945494008
Transform:
  m_ObjectHideFlags: 0
  m_CorrespondingSourceObject: {fileID: 0}
  m_PrefabInstance: {fileID: 0}
  m_PrefabAsset: {fileID: 0}
  m_GameObject: {fileID: 6995046272744306100}
  m_LocalRotation: {x: 0, y: 0, z: 0, w: 1}
  m_LocalPosition: {x: 0, y: 0, z: 0}
  m_LocalScale: {x: 1, y: 1, z: 1}
  m_Children:
  - {fileID: 2467094381204107899}
  m_Father: {fileID: 0}
  m_RootOrder: 0
  m_LocalEulerAnglesHint: {x: 0, y: 0, z: 0}
--- !u!156049354 &3736118625656842818
Grid:
  m_ObjectHideFlags: 0
  m_CorrespondingSourceObject: {fileID: 0}
  m_PrefabInstance: {fileID: 0}
  m_PrefabAsset: {fileID: 0}
  m_GameObject: {fileID: 6995046272744306100}
  m_Enabled: 1
  m_CellSize: {x: 1, y: 1, z: 0}
  m_CellGap: {x: 0, y: 0, z: 0}
  m_CellLayout: 0
  m_CellSwizzle: 0
--- !u!1 &8338218783793237935
GameObject:
  m_ObjectHideFlags: 0
  m_CorrespondingSourceObject: {fileID: 0}
  m_PrefabInstance: {fileID: 0}
  m_PrefabAsset: {fileID: 0}
  serializedVersion: 6
  m_Component:
  - component: {fileID: 2467094381204107899}
  - component: {fileID: 8221463960908511538}
  - component: {fileID: 1032265238758582232}
  m_Layer: 31
  m_Name: Layer1
  m_TagString: Untagged
  m_Icon: {fileID: 0}
  m_NavMeshLayer: 0
  m_StaticEditorFlags: 0
  m_IsActive: 1
--- !u!4 &2467094381204107899
Transform:
  m_ObjectHideFlags: 0
  m_CorrespondingSourceObject: {fileID: 0}
  m_PrefabInstance: {fileID: 0}
  m_PrefabAsset: {fileID: 0}
  m_GameObject: {fileID: 8338218783793237935}
  m_LocalRotation: {x: -0, y: -0, z: -0, w: 1}
  m_LocalPosition: {x: 0, y: 0, z: 0}
  m_LocalScale: {x: 1, y: 1, z: 1}
  m_Children: []
  m_Father: {fileID: 7070133148945494008}
  m_RootOrder: 0
  m_LocalEulerAnglesHint: {x: 0, y: 0, z: 0}
--- !u!1839735485 &8221463960908511538
Tilemap:
  m_ObjectHideFlags: 0
  m_CorrespondingSourceObject: {fileID: 0}
  m_PrefabInstance: {fileID: 0}
  m_PrefabAsset: {fileID: 0}
  m_GameObject: {fileID: 8338218783793237935}
  m_Enabled: 1
  m_Tiles:
  - first: {x: -4, y: -2, z: 0}
    second:
      m_TileIndex: 5
      m_TileSpriteIndex: 16
      m_TileMatrixIndex: 0
      m_TileColorIndex: 0
      m_ObjectToInstantiate: {fileID: 0}
      m_TileFlags: 1
      m_ColliderType: 1
  - first: {x: -3, y: -2, z: 0}
    second:
      m_TileIndex: 4
      m_TileSpriteIndex: 4
      m_TileMatrixIndex: 0
      m_TileColorIndex: 0
      m_ObjectToInstantiate: {fileID: 0}
      m_TileFlags: 1
      m_ColliderType: 1
  - first: {x: -2, y: -2, z: 0}
    second:
      m_TileIndex: 6
      m_TileSpriteIndex: 13
      m_TileMatrixIndex: 0
      m_TileColorIndex: 0
      m_ObjectToInstantiate: {fileID: 0}
      m_TileFlags: 1
      m_ColliderType: 1
  - first: {x: 0, y: -2, z: 0}
    second:
      m_TileIndex: 13
      m_TileSpriteIndex: 14
      m_TileMatrixIndex: 0
      m_TileColorIndex: 0
      m_ObjectToInstantiate: {fileID: 0}
      m_TileFlags: 1
      m_ColliderType: 1
  - first: {x: 3, y: -2, z: 0}
    second:
      m_TileIndex: 14
      m_TileSpriteIndex: 2
      m_TileMatrixIndex: 0
      m_TileColorIndex: 0
      m_ObjectToInstantiate: {fileID: 0}
      m_TileFlags: 1
      m_ColliderType: 1
  - first: {x: -4, y: -1, z: 0}
    second:
      m_TileIndex: 1
      m_TileSpriteIndex: 0
      m_TileMatrixIndex: 0
      m_TileColorIndex: 0
      m_ObjectToInstantiate: {fileID: 0}
      m_TileFlags: 1
      m_ColliderType: 1
  - first: {x: -3, y: -1, z: 0}
    second:
      m_TileIndex: 0
      m_TileSpriteIndex: 5
      m_TileMatrixIndex: 0
      m_TileColorIndex: 0
      m_ObjectToInstantiate: {fileID: 0}
      m_TileFlags: 1
      m_ColliderType: 1
  - first: {x: -2, y: -1, z: 0}
    second:
      m_TileIndex: 3
      m_TileSpriteIndex: 6
      m_TileMatrixIndex: 0
      m_TileColorIndex: 0
      m_ObjectToInstantiate: {fileID: 0}
      m_TileFlags: 1
      m_ColliderType: 1
  - first: {x: 0, y: -1, z: 0}
    second:
      m_TileIndex: 12
      m_TileSpriteIndex: 15
      m_TileMatrixIndex: 0
      m_TileColorIndex: 0
      m_ObjectToInstantiate: {fileID: 0}
      m_TileFlags: 1
      m_ColliderType: 1
  - first: {x: -4, y: 0, z: 0}
    second:
      m_TileIndex: 16
      m_TileSpriteIndex: 1
      m_TileMatrixIndex: 0
      m_TileColorIndex: 0
      m_ObjectToInstantiate: {fileID: 0}
      m_TileFlags: 1
      m_ColliderType: 1
  - first: {x: -3, y: 0, z: 0}
    second:
      m_TileIndex: 2
      m_TileSpriteIndex: 7
      m_TileMatrixIndex: 0
      m_TileColorIndex: 0
      m_ObjectToInstantiate: {fileID: 0}
      m_TileFlags: 1
      m_ColliderType: 1
  - first: {x: -2, y: 0, z: 0}
    second:
      m_TileIndex: 15
      m_TileSpriteIndex: 12
      m_TileMatrixIndex: 0
      m_TileColorIndex: 0
      m_ObjectToInstantiate: {fileID: 0}
      m_TileFlags: 1
      m_ColliderType: 1
  - first: {x: 0, y: 0, z: 0}
    second:
      m_TileIndex: 11
      m_TileSpriteIndex: 9
      m_TileMatrixIndex: 0
      m_TileColorIndex: 0
      m_ObjectToInstantiate: {fileID: 0}
      m_TileFlags: 1
      m_ColliderType: 1
  - first: {x: 2, y: 0, z: 0}
    second:
      m_TileIndex: 7
      m_TileSpriteIndex: 10
      m_TileMatrixIndex: 0
      m_TileColorIndex: 0
      m_ObjectToInstantiate: {fileID: 0}
      m_TileFlags: 1
      m_ColliderType: 1
  - first: {x: 3, y: 0, z: 0}
    second:
      m_TileIndex: 10
      m_TileSpriteIndex: 8
      m_TileMatrixIndex: 0
      m_TileColorIndex: 0
      m_ObjectToInstantiate: {fileID: 0}
      m_TileFlags: 1
      m_ColliderType: 1
  - first: {x: 4, y: 0, z: 0}
    second:
      m_TileIndex: 18
      m_TileSpriteIndex: 18
      m_TileMatrixIndex: 0
      m_TileColorIndex: 0
      m_ObjectToInstantiate: {fileID: 0}
      m_TileFlags: 1
      m_ColliderType: 1
  - first: {x: 5, y: 0, z: 0}
    second:
      m_TileIndex: 17
      m_TileSpriteIndex: 17
      m_TileMatrixIndex: 0
      m_TileColorIndex: 0
      m_ObjectToInstantiate: {fileID: 0}
      m_TileFlags: 1
      m_ColliderType: 1
  - first: {x: 6, y: 0, z: 0}
    second:
      m_TileIndex: 9
      m_TileSpriteIndex: 11
      m_TileMatrixIndex: 0
      m_TileColorIndex: 0
      m_ObjectToInstantiate: {fileID: 0}
      m_TileFlags: 1
      m_ColliderType: 1
  m_AnimatedTiles: {}
  m_TileAssetArray:
  - m_RefCount: 1
    m_Data: {fileID: 11400000, guid: 09aac6a8eec4b735581231a5513f6784, type: 2}
  - m_RefCount: 1
    m_Data: {fileID: 11400000, guid: d8ad7232faa0fbcb9b29f42129385169, type: 2}
  - m_RefCount: 1
    m_Data: {fileID: 11400000, guid: 919c75decaf52d3238734eca660862c4, type: 2}
  - m_RefCount: 1
    m_Data: {fileID: 11400000, guid: 190a3b852cd80b5058c0e16fba390ad9, type: 2}
  - m_RefCount: 1
    m_Data: {fileID: 11400000, guid: 87632f14bf79376b3ba1a237320b85f8, type: 2}
  - m_RefCount: 1
    m_Data: {fileID: 11400000, guid: 072fc37e70b1c0d89bbe88468f802ece, type: 2}
  - m_RefCount: 1
    m_Data: {fileID: 11400000, guid: 780d1809689df8166a3cc378dc3eabff, type: 2}
  - m_RefCount: 1
    m_Data: {fileID: 11400000, guid: ddf602005cf38a0849c843fabe562333, type: 2}
  - m_RefCount: 0
    m_Data: {fileID: 0}
  - m_RefCount: 1
    m_Data: {fileID: 11400000, guid: bf90194926544d4eda670504dd0a6598, type: 2}
  - m_RefCount: 1
    m_Data: {fileID: 11400000, guid: b54ffd1d81af234bc95fa2c7a2ab60c3, type: 2}
  - m_RefCount: 1
    m_Data: {fileID: 11400000, guid: e32fdadb0d43e1f8490cd8dbecb9b203, type: 2}
  - m_RefCount: 1
    m_Data: {fileID: 11400000, guid: d816cce88c01d86d3990c8094caeedd5, type: 2}
  - m_RefCount: 1
    m_Data: {fileID: 11400000, guid: 3beb991bd688dd9229c4bbfc6b34c611, type: 2}
  - m_RefCount: 1
    m_Data: {fileID: 11400000, guid: 5699e7daee739bffd9c1814a0dfe827c, type: 2}
  - m_RefCount: 1
    m_Data: {fileID: 11400000, guid: c7f4071274e93490fb7a37a11d2ff2be, type: 2}
  - m_RefCount: 1
    m_Data: {fileID: 11400000, guid: 6f30108bb8ccd8b7a832b27be3a6b770, type: 2}
  - m_RefCount: 1
    m_Data: {fileID: 11400000, guid: 9a8d9b6eaf562e9e0b687c6877927d0a, type: 2}
  - m_RefCount: 1
    m_Data: {fileID: 11400000, guid: c25bfcd6f40f4c71392de166f8fd6503, type: 2}
  m_TileSpriteArray:
  - m_RefCount: 1
    m_Data: {fileID: 21300026, guid: f0078b8ca681dec0eadfb01c89ac4acf, type: 3}
  - m_RefCount: 1
    m_Data: {fileID: 21300052, guid: f0078b8ca681dec0eadfb01c89ac4acf, type: 3}
  - m_RefCount: 1
    m_Data: {fileID: 21300002, guid: f0078b8ca681dec0eadfb01c89ac4acf, type: 3}
  - m_RefCount: 0
    m_Data: {fileID: 0}
  - m_RefCount: 1
    m_Data: {fileID: 21300032, guid: f0078b8ca681dec0eadfb01c89ac4acf, type: 3}
  - m_RefCount: 1
    m_Data: {fileID: 21300024, guid: f0078b8ca681dec0eadfb01c89ac4acf, type: 3}
  - m_RefCount: 1
    m_Data: {fileID: 21300030, guid: f0078b8ca681dec0eadfb01c89ac4acf, type: 3}
  - m_RefCount: 1
    m_Data: {fileID: 21300028, guid: f0078b8ca681dec0eadfb01c89ac4acf, type: 3}
  - m_RefCount: 1
    m_Data: {fileID: 21300040, guid: f0078b8ca681dec0eadfb01c89ac4acf, type: 3}
  - m_RefCount: 1
    m_Data: {fileID: 21300050, guid: f0078b8ca681dec0eadfb01c89ac4acf, type: 3}
  - m_RefCount: 1
    m_Data: {fileID: 21300038, guid: f0078b8ca681dec0eadfb01c89ac4acf, type: 3}
  - m_RefCount: 1
    m_Data: {fileID: 21300042, guid: f0078b8ca681dec0eadfb01c89ac4acf, type: 3}
  - m_RefCount: 1
    m_Data: {fileID: 21300054, guid: f0078b8ca681dec0eadfb01c89ac4acf, type: 3}
  - m_RefCount: 1
    m_Data: {fileID: 21300036, guid: f0078b8ca681dec0eadfb01c89ac4acf, type: 3}
  - m_RefCount: 1
    m_Data: {fileID: 21300048, guid: f0078b8ca681dec0eadfb01c89ac4acf, type: 3}
  - m_RefCount: 1
    m_Data: {fileID: 21300046, guid: f0078b8ca681dec0eadfb01c89ac4acf, type: 3}
  - m_RefCount: 1
    m_Data: {fileID: 21300034, guid: f0078b8ca681dec0eadfb01c89ac4acf, type: 3}
  - m_RefCount: 1
    m_Data: {fileID: 21300044, guid: f0078b8ca681dec0eadfb01c89ac4acf, type: 3}
  - m_RefCount: 1
    m_Data: {fileID: 21300056, guid: f0078b8ca681dec0eadfb01c89ac4acf, type: 3}
  m_TileMatrixArray:
  - m_RefCount: 18
    m_Data:
      e00: 1
      e01: 0
      e02: 0
      e03: 0
      e10: 0
      e11: 1
      e12: 0
      e13: 0
      e20: 0
      e21: 0
      e22: 1
      e23: 0
      e30: 0
      e31: 0
      e32: 0
      e33: 1
  m_TileColorArray:
  - m_RefCount: 18
    m_Data: {r: 1, g: 1, b: 1, a: 1}
  - m_RefCount: 0
    m_Data: {r: 0, g: 0, b: 0, a: 0}
  - m_RefCount: 0
    m_Data: {r: 0, g: 0, b: 0, a: 0}
  m_AnimationFrameRate: 1
  m_Color: {r: 1, g: 1, b: 1, a: 1}
  m_Origin: {x: -4, y: -8, z: 0}
  m_Size: {x: 11, y: 9, z: 1}
  m_TileAnchor: {x: 0.5, y: 0.5, z: 0}
  m_TileOrientation: 0
  m_TileOrientationMatrix:
    e00: 1
    e01: 0
    e02: 0
    e03: 0
    e10: 0
    e11: 1
    e12: 0
    e13: 0
    e20: 0
    e21: 0
    e22: 1
    e23: 0
    e30: 0
    e31: 0
    e32: 0
    e33: 1
--- !u!483693784 &1032265238758582232
TilemapRenderer:
  m_ObjectHideFlags: 0
  m_CorrespondingSourceObject: {fileID: 0}
  m_PrefabInstance: {fileID: 0}
  m_PrefabAsset: {fileID: 0}
  m_GameObject: {fileID: 8338218783793237935}
  m_Enabled: 0
  m_CastShadows: 0
  m_ReceiveShadows: 0
  m_DynamicOccludee: 0
  m_MotionVectors: 1
  m_LightProbeUsage: 0
  m_ReflectionProbeUsage: 0
  m_RenderingLayerMask: 1
  m_RendererPriority: 0
  m_Materials:
  - {fileID: 10754, guid: 0000000000000000f000000000000000, type: 0}
  m_StaticBatchInfo:
    firstSubMesh: 0
    subMeshCount: 0
  m_StaticBatchRoot: {fileID: 0}
  m_ProbeAnchor: {fileID: 0}
  m_LightProbeVolumeOverride: {fileID: 0}
  m_ScaleInLightmap: 1
  m_PreserveUVs: 0
  m_IgnoreNormalsForChartDetection: 0
  m_ImportantGI: 0
  m_StitchLightmapSeams: 0
  m_SelectedEditorRenderState: 0
  m_MinimumChartSize: 4
  m_AutoUVMaxDistance: 0.5
  m_AutoUVMaxAngle: 89
  m_LightmapParameters: {fileID: 0}
  m_SortingLayerID: 0
  m_SortingLayer: 0
  m_SortingOrder: 0
  m_ChunkSize: {x: 32, y: 32, z: 32}
  m_ChunkCullingBounds: {x: 0, y: 0, z: 0}
  m_MaxChunkCount: 16
  m_MaxFrameAge: 16
  m_SortOrder: 0
  m_Mode: 0
  m_DetectChunkCullingBounds: 0
  m_MaskInteraction: 0
--- !u!114 &114641487267817350
MonoBehaviour:
  m_ObjectHideFlags: 0
  m_CorrespondingSourceObject: {fileID: 0}
  m_PrefabInstance: {fileID: 0}
  m_PrefabAsset: {fileID: 0}
  m_GameObject: {fileID: 0}
  m_Enabled: 1
  m_EditorHideFlags: 0
  m_Script: {fileID: 12395, guid: 0000000000000000e000000000000000, type: 0}
  m_Name: Palette Settings
  m_EditorClassIdentifier: 
  cellSizing: 0
