﻿Fuente [V],Voltímetro [mV],Amperimetro [mA],T[°C]
0.4,402,0.01,27.8
0.425,427,0.01,27.8
0.45,451,0.02,27.8
0.475,476,0.05,27.8
0.5,500,0.09,27.8
0.525,524,0.16,27.8
0.55,548,0.31,27.8
0.575,570,0.53,27.8
0.6,590,0.87,27.8
0.625,608,1.33,27.8
0.65,625,1.94,27.8
0.675,641,2.8,27.8
0.7,653,3.76,27.8
0.725,664,4.87,27.8
0.75,674,6.11,27.8
0.775,682,7.37,27.8
0.8,690,8.81,27.8
0.825,697,10.28,27.8
0.85,702,11.9,27.8
0.875,708,13.48,27.8
0.9,713,15.16,27.8
0.925,717,16.87,27.8
0.95,721,18.67,27.8
0.975,725,20.45,27.8
1,728,22.27,27.8
1.25,752,41.08,27.8
