{
	"global": {
		"animation": {
			"duration": {
				"base": {
					"value": ".3s",
					"name": "",
					"comment": ""
				},
				"short": {
					"value": ".2s",
					"name": "",
					"comment": ""
				},
				"shorter": {
					"value": ".1s",
					"name": "",
					"comment": ""
				},
				"shortest": {
					"value": ".01s",
					"name": "",
					"comment": ""
				},
				"long": {
					"value": ".4s",
					"name": "",
					"comment": ""
				},
				"longer": {
					"value": ".5s",
					"name": "",
					"comment": ""
				},
				"longest": {
					"value": "4s",
					"name": "",
					"comment": ""
				}
			},
			"rotation": {
				"smallest-2": {
					"value": "0deg",
					"name": "",
					"comment": ""
				},
				"smallest": {
					"value": "45deg",
					"name": "",
					"comment": ""
				},
				"smaller": {
					"value": "90deg",
					"name": "",
					"comment": ""
				},
				"small": {
					"value": "135deg",
					"name": "",
					"comment": ""
				},
				"base": {
					"value": "180deg",
					"name": "",
					"comment": ""
				},
				"large": {
					"value": "225deg",
					"name": "",
					"comment": ""
				},
				"larger": {
					"value": "270deg",
					"name": "",
					"comment": ""
				},
				"largest": {
					"value": "315deg",
					"name": "",
					"comment": ""
				},
				"largest-2": {
					"value": "360deg",
					"name": "",
					"comment": ""
				}
			}
		}
	}
}