<?xml version="1.0" encoding="UTF-8"?>
<svg width="112px" height="108px" viewBox="0 0 112 108" version="1.1" xmlns="http://www.w3.org/2000/svg" xmlns:xlink="http://www.w3.org/1999/xlink">
    <title>Group 73</title>
    <g id="Viyan-skisser" stroke="none" stroke-width="1" fill="none" fill-rule="evenodd">
        <g id="Startsida-+-illy-Copy" transform="translate(-1387.000000, -842.000000)">
            <g id="Group-73" transform="translate(1389.000000, 844.000000)">
                <g id="Group-4" transform="translate(30.526900, 65.254100)">
                    <path d="M10.842,19.053 C4.854,19.053 0,14.199 0,8.211 C0,4.929 1.459,1.988 3.763,-7.10542736e-15" id="Fill-1" fill="#FFFFFF"></path>
                    <path d="M10.842,19.053 C4.854,19.053 0,14.199 0,8.211 C0,4.929 1.459,1.988 3.763,-7.10542736e-15" id="Stroke-3" stroke="#333333" stroke-width="1.8" stroke-linecap="round" stroke-linejoin="round"></path>
                </g>
                <g id="Group-8" transform="translate(16.451700, 40.941100)">
                    <path d="M10.842,21.683 C4.854,21.683 0,16.829 0,10.841 C0,4.854 4.854,0 10.842,0" id="Fill-5" fill="#FFFFFF"></path>
                    <path d="M10.842,21.683 C4.854,21.683 0,16.829 0,10.841 C0,4.854 4.854,0 10.842,0" id="Stroke-7" stroke="#333333" stroke-width="1.8" stroke-linecap="round" stroke-linejoin="round"></path>
                </g>
                <g id="Group-12" transform="translate(30.527742, 18.544840)">
                    <path d="M3.7514577,19.0436595 C1.3724577,16.9856595 -0.101542302,13.9106595 0.0054576975,10.4946595 C0.181457698,4.84865951 4.7584577,0.230659508 10.4034577,0.00865950827 C16.5904577,-0.235340492 21.6824577,4.70865951 21.6824577,10.8416595 L21.6824577,31.5256595" id="Fill-9" fill="#FFFFFF"></path>
                    <path d="M3.7514577,19.0436595 C1.3724577,16.9856595 -0.101542302,13.9106595 0.0054576975,10.4946595 C0.181457698,4.84865951 4.7584577,0.230659508 10.4034577,0.00865950827 C16.5904577,-0.235340492 21.6824577,4.70865951 21.6824577,10.8416595 L21.6824577,31.5256595" id="Stroke-11" stroke="#333333" stroke-width="1.8" stroke-linecap="round" stroke-linejoin="round"></path>
                </g>
                <g id="Group-16" transform="translate(19.686300, 30.099000)">
                    <path d="M0.217,13.013 C0.074,12.312 0,11.586 0,10.842 C0,4.854 4.854,0 10.841,0" id="Fill-13" fill="#FFFFFF"></path>
                    <path d="M0.217,13.013 C0.074,12.312 0,11.586 0,10.842 C0,4.854 4.854,0 10.841,0" id="Stroke-15" stroke="#333333" stroke-width="1.8" stroke-linecap="round" stroke-linejoin="round"></path>
                </g>
                <g id="Group-20" transform="translate(19.147100, 59.481600)">
                    <path d="M10.842,13.984 C4.854,13.984 0,9.13 0,3.142 C0,2.05 0.162,0.994 0.463,0" id="Fill-17" fill="#FFFFFF"></path>
                    <path d="M10.842,13.984 C4.854,13.984 0,9.13 0,3.142 C0,2.05 0.162,0.994 0.463,0" id="Stroke-19" stroke="#333333" stroke-width="1.8" stroke-linecap="round" stroke-linejoin="round"></path>
                </g>
                <line x1="54.3363" y1="0" x2="54.3363" y2="10.271" id="Stroke-21" stroke="#95C23F" stroke-width="2.614" stroke-linecap="round"></line>
                <line x1="15.2637" y1="14.8358" x2="22.8247" y2="22.5388" id="Stroke-23" stroke="#95C23F" stroke-width="2.614" stroke-linecap="round"></line>
                <line x1="1.33226763e-15" y1="51.7825" x2="10.699" y2="51.7825" id="Stroke-25" stroke="#95C23F" stroke-width="2.614" stroke-linecap="round"></line>
                <line x1="15.2637" y1="88.3014" x2="23.1097" y2="80.4554" id="Stroke-27" stroke="#95C23F" stroke-width="2.614" stroke-linecap="round"></line>
                <g id="Group-32" transform="translate(45.848600, 89.085200)">
                    <line x1="0" y1="0.5" x2="16.976" y2="0.5" id="Fill-29" fill="#FFFFFF"></line>
                    <line x1="0" y1="0.5" x2="16.976" y2="0.5" id="Stroke-31" stroke="#333333" stroke-width="2.614" stroke-linecap="round" stroke-linejoin="round"></line>
                </g>
                <g id="Group-36" transform="translate(45.848600, 93.935400)">
                    <line x1="0" y1="0.5" x2="16.976" y2="0.5" id="Fill-33" fill="#FFFFFF"></line>
                    <line x1="0" y1="0.5" x2="16.976" y2="0.5" id="Stroke-35" stroke="#333333" stroke-width="2.614" stroke-linecap="round" stroke-linejoin="round"></line>
                </g>
                <g id="Group-40" transform="translate(45.848600, 98.785500)">
                    <line x1="0" y1="0.5" x2="16.976" y2="0.5" id="Fill-37" fill="#FFFFFF"></line>
                    <line x1="0" y1="0.5" x2="16.976" y2="0.5" id="Stroke-39" stroke="#333333" stroke-width="2.614" stroke-linecap="round" stroke-linejoin="round"></line>
                </g>
                <g id="Group-44" transform="translate(52.053900, 103.778300)">
                    <line x1="0" y1="0.5" x2="4.565" y2="0.5" id="Fill-41" fill="#FFFFFF"></line>
                    <line x1="0" y1="0.5" x2="4.565" y2="0.5" id="Stroke-43" stroke="#333333" stroke-width="2.614" stroke-linecap="round" stroke-linejoin="round"></line>
                </g>
                <g id="Group-48" transform="translate(66.737000, 65.254100)">
                    <path d="M0,19.053 C5.988,19.053 10.842,14.199 10.842,8.211 C10.842,4.929 9.383,1.988 7.079,-7.10542736e-15" id="Fill-45" fill="#FFFFFF"></path>
                    <path d="M0,19.053 C5.988,19.053 10.842,14.199 10.842,8.211 C10.842,4.929 9.383,1.988 7.079,-7.10542736e-15" id="Stroke-47" stroke="#333333" stroke-width="1.8" stroke-linecap="round" stroke-linejoin="round"></path>
                </g>
                <g id="Group-52" transform="translate(80.812200, 40.941100)">
                    <path d="M0,21.683 C5.988,21.683 10.842,16.829 10.842,10.841 C10.842,4.854 5.988,0 0,0" id="Fill-49" fill="#FFFFFF"></path>
                    <path d="M0,21.683 C5.988,21.683 10.842,16.829 10.842,10.841 C10.842,4.854 5.988,0 0,0" id="Stroke-51" stroke="#333333" stroke-width="1.8" stroke-linecap="round" stroke-linejoin="round"></path>
                </g>
                <g id="Group-56" transform="translate(55.895700, 18.544840)">
                    <path d="M17.931,19.0436595 C20.31,16.9856595 21.784,13.9106595 21.677,10.4946595 C21.501,4.84865951 16.924,0.230659508 11.279,0.00865950827 C5.092,-0.235340492 -1.42108547e-14,4.70865951 -1.42108547e-14,10.8416595 L-1.42108547e-14,31.5256595" id="Fill-53" fill="#FFFFFF"></path>
                    <path d="M17.931,19.0436595 C20.31,16.9856595 21.784,13.9106595 21.677,10.4946595 C21.501,4.84865951 16.924,0.230659508 11.279,0.00865950827 C5.092,-0.235340492 -1.42108547e-14,4.70865951 -1.42108547e-14,10.8416595 L-1.42108547e-14,31.5256595" id="Stroke-55" stroke="#333333" stroke-width="1.8" stroke-linecap="round" stroke-linejoin="round"></path>
                </g>
                <g id="Group-60" transform="translate(77.578600, 30.099000)">
                    <path d="M10.624,13.013 C10.767,12.312 10.841,11.586 10.841,10.842 C10.841,4.854 5.987,0 0,0" id="Fill-57" fill="#FFFFFF"></path>
                    <path d="M10.624,13.013 C10.767,12.312 10.841,11.586 10.841,10.842 C10.841,4.854 5.987,0 0,0" id="Stroke-59" stroke="#333333" stroke-width="1.8" stroke-linecap="round" stroke-linejoin="round"></path>
                </g>
                <g id="Group-64" transform="translate(78.116900, 59.481600)">
                    <path d="M0,13.984 C5.988,13.984 10.842,9.13 10.842,3.142 C10.842,2.05 10.68,0.994 10.379,0" id="Fill-61" fill="#FFFFFF"></path>
                    <path d="M0,13.984 C5.988,13.984 10.842,9.13 10.842,3.142 C10.842,2.05 10.68,0.994 10.379,0" id="Stroke-63" stroke="#333333" stroke-width="1.8" stroke-linecap="round" stroke-linejoin="round"></path>
                </g>
                <line x1="92.8422" y1="14.8358" x2="85.2812" y2="22.5388" id="Stroke-65" stroke="#95C23F" stroke-width="2.614" stroke-linecap="round"></line>
                <line x1="108.106" y1="51.7825" x2="97.407" y2="51.7825" id="Stroke-67" stroke="#95C23F" stroke-width="2.614" stroke-linecap="round"></line>
                <line x1="92.8422" y1="88.3014" x2="84.9962" y2="80.4554" id="Stroke-69" stroke="#95C23F" stroke-width="2.614" stroke-linecap="round"></line>
                <path d="M60.132,85.163 C57.349,75.529 60.937,57.913 61.172,55.777 C61.407,53.641 62.831,52.072 64.877,52.072 C66.922,52.072 68.581,53.731 68.581,55.777 C68.581,57.823 66.562,59.176 64.877,59.481 C62.735,59.869 57.589,60.375 54.259,60.406 C50.929,60.436 45.937,59.869 43.796,59.481 C42.111,59.176 40.092,57.823 40.092,55.777 C40.092,53.731 41.75,52.072 43.796,52.072 C45.842,52.072 47.266,53.641 47.501,55.777 C47.736,57.913 51.324,75.529 48.541,85.163" id="Stroke-71" stroke="#95C23F" stroke-width="2.614" stroke-linecap="round"></path>
            </g>
        </g>
    </g>
</svg>