{
	"color": {
		"text": {
			"primary": {
				"value": "{global.color.neutral.grayscale.darker-3.value}",
				"name": "",
				"comment": ""
			},
			"secondary": {
				"value": "{global.color.profile.purple.base.value}",
				"name": "",
				"comment": ""
			},
			"inverted": {
				"value": "{global.color.neutral.grayscale.white.value}",
				"name": "",
				"comment": ""
			},
			"link": {
				"value": "{global.color.profile.purple.base.value}",
				"name": "",
				"comment": ""
			},
			"link-hover": {
				"value": "{global.color.profile.purple.dark.value}",
				"name": "",
				"comment": ""
			},
			"link-visited": {
				"value": "{global.color.profile.purple.base.value}",
				"name": "",
				"comment": ""
			},
			"link-secondary": {
				"value": "{global.color.cta.link.base.value}",
				"name": "",
				"comment": ""
			},
			"link-secondary-hover": {
				"value": "{global.color.profile.purple.dark.value}",
				"name": "",
				"comment": ""
			},
			"link-secondary-visited": {
				"value": "{global.color.cta.link.base.value}",
				"name": "",
				"comment": ""
			},
			"neutral": {
				"value": "{global.color.neutral.grayscale.darkest-4.value}",
				"name": "",
				"comment": ""
			}
		},
		"background": {
			"primary": {
				"value": "{global.color.neutral.grayscale.white.value}",
				"name": "",
				"comment": ""
			},
			"secondary": {
				"value": "{global.color.profile.purple.opacity5.value}",
				"name": "",
				"comment": ""
			},
			"tertiary": {
				"value": "{global.color.profile.purple.opacity15.value}",
				"name": "",
				"comment": ""
			},
			"inverted-1": {
				"value": "{global.color.profile.purple.base.value}",
				"name": "",
				"comment": ""
			},
			"inverted-2": {
				"value": "{global.color.profile.purple.dark.value}",
				"name": "",
				"comment": ""
			},
			"inverted-3": {
				"value": "{global.color.profile.purple.extra-dark.value}",
				"name": "",
				"comment": ""
			},
			"inverted-4": {
				"value": "{global.color.cta.green.light.value}",
				"name": "",
				"comment": ""
			},
			"complementary-1": {
				"value": "{global.color.profile.purple.base.value}",
				"name": "",
				"comment": ""
			},
			"complementary-2": {
				"value": "{global.color.complementary.cerise.base.value}",
				"name": "",
				"comment": ""
			},
			"neutral-1": {
				"value": "{global.color.profile.purple.opacity5.value}",
				"name": "",
				"comment": ""
			},
			"neutral-2": {
				"value": "{global.color.cta.green.base.value}",
				"name": "",
				"comment": ""
			},
			"neutral-3": {
				"value": "{global.color.neutral.grayscale.base.value}",
				"name": "",
				"comment": ""
			},
			"neutral-4": {
				"value": "{global.color.neutral.grayscale.darkest-4.value}",
				"name": "",
				"comment": ""
			},
			"neutral-5": {
				"value": "{global.color.profile.green.lightest.value}",
				"name": "",
				"comment": ""
			},
			"neutral-6": {
				"value": "{global.color.neutral.grayscale.lightest-2.value}",
				"name": "",
				"comment": ""
			},
			"neutral-7": {
				"value": "{global.color.profile.green.lighter.value}",
				"name": "",
				"comment": ""
			},
			"informative": {
				"value": "{global.color.neutral.grayscale.opacity50.value}",
				"name": "",
				"comment": ""
			},
			"success-1": {
				"value": "{global.color.function.success.base.value}",
				"name": "",
				"comment": ""
			},
			"success-2": {
				"value": "{global.color.neutral.grayscale.white.value}",
				"name": "",
				"comment": ""
			},
			"success-3": {
				"value": "{global.color.function.success.lightest.value}",
				"name": "",
				"comment": ""
			},
			"warning-1": {
				"value": "{global.color.complementary.red.accent2.value}",
				"name": "",
				"comment": ""
			},
			"warning-2": {
				"value": "{global.color.neutral.grayscale.white.value}",
				"name": "",
				"comment": ""
			},
			"warning-3": {
				"value": "{global.color.function.warning.lightest-2.value}",
				"name": "",
				"comment": ""
			},
			"danger-1": {
				"value": "{global.color.function.danger.base.value}",
				"name": "",
				"comment": ""
			},
			"danger-2": {
				"value": "{global.color.neutral.grayscale.white.value}",
				"name": "",
				"comment": ""
			},
			"danger-3": {
				"value": "{global.color.function.danger.lightest.value}",
				"name": "",
				"comment": ""
			},
			"input": {
				"value": "{global.color.neutral.grayscale.white.value}",
				"name": "",
				"comment": ""
			},
			"input-empty": {
				"value": "{global.color.profile.purple.opacity5.value}",
				"name": "",
				"comment": ""
			},
			"radio-primary": {
				"value": "{global.color.neutral.grayscale.white.value}",
				"name": "",
				"comment": ""
			},
			"radio-secondary": {
				"value": "{global.color.neutral.grayscale.white.value}",
				"name": "",
				"comment": ""
			},
			"radio-marker": {
				"value": "{global.color.profile.purple.base.value}",
				"name": "",
				"comment": ""
			},
			"checkbox-primary": {
				"value": "{global.color.profile.purple.base.value}",
				"name": "",
				"comment": ""
			},
			"checkbox-secondary": {
				"value": "{global.color.profile.purple.base.value}",
				"name": "",
				"comment": ""
			},
			"checkbox-marker": {
				"value": "{global.color.neutral.grayscale.white.value}",
				"name": "",
				"comment": ""
			},
			"notification-info": {
				"value": "{global.color.neutral.grayscale.opacity50.value}",
				"name": "",
				"comment": ""
			},
			"notification-warning": {
				"value": "{global.color.profile.apricot.opacity25.value}",
				"name": "",
				"comment": ""
			},
			"notification-danger": {
				"value": "{global.color.profile.apricot.opacity50.value}",
				"name": "",
				"comment": ""
			}
		},
		"border": {
			"primary": {
				"value": "{global.color.profile.purple.opacity60.value}",
				"name": "",
				"comment": ""
			},
			"secondary": {
				"value": "{global.color.profile.purple.base.value}",
				"name": "",
				"comment": ""
			},
			"tertiary": {
				"value": "{global.color.profile.purple.dark.value}",
				"name": "",
				"comment": ""
			},
			"quaternary": {
				"value": "{global.color.profile.purple.extra-dark.value}",
				"name": "",
				"comment": ""
			},
			"focus": {
				"value": "{global.color.complementary.orange.accent3.value}",
				"name": "",
				"comment": ""
			},
			"success": {
				"value": "{global.color.function.success.base.value}",
				"name": "",
				"comment": ""
			},
			"warning": {
				"value": "{global.color.complementary.red.accent2.value}",
				"name": "",
				"comment": ""
			},
			"danger": {
				"value": "{global.color.function.danger.base.value}",
				"name": "",
				"comment": ""
			},
			"informative": {
				"value": "{global.color.complementary.blue.base.value}",
				"name": "",
				"comment": ""
			},
			"inverted": {
				"value": "{global.color.neutral.grayscale.lightest-6.value}",
				"name": "",
				"comment": ""
			},
			"neutral-1": {
				"value": "{global.color.profile.green.lightest.value}",
				"name": "",
				"comment": ""
			},
			"neutral-2": {
				"value": "{global.color.neutral.grayscale.light.value}",
				"name": "",
				"comment": ""
			},
			"neutral-3": {
				"value": "{global.color.profile.purple.opacity60.value}",
				"name": "",
				"comment": ""
			},
			"neutral-4": {
				"value": "{global.color.neutral.grayscale.lightest-2.value}",
				"name": "",
				"comment": ""
			},
			"neutral-5": {
				"value": "{global.color.neutral.grayscale.darkest-3.value}",
				"name": "",
				"comment": ""
			},
			"radio-primary": {
				"value": "{global.color.profile.purple.opacity60.value}",
				"name": "",
				"comment": ""
			},
			"radio-secondary": {
				"value": "{global.color.profile.purple.opacity60.value}",
				"name": "",
				"comment": ""
			},
			"radio-focus": {
				"value": "{global.color.profile.purple.base.value}",
				"name": "",
				"comment": ""
			},
			"checkbox-primary": {
				"value": "{global.color.profile.purple.base.value}",
				"name": "",
				"comment": ""
			},
			"checkbox-secondary": {
				"value": "{global.color.profile.purple.base.value}",
				"name": "",
				"comment": ""
			},
			"checkbox-focus": {
				"value": "{global.color.profile.purple.base.value}",
				"name": "",
				"comment": ""
			}
		},
		"icons": {
			"primary": {
				"value": "{global.color.profile.purple.base.value}",
				"name": "",
				"comment": ""
			},
			"secondary": {
				"value": "{global.color.profile.blue.base.value}",
				"name": "",
				"comment": ""
			},
			"inverted": {
				"value": "{global.color.neutral.grayscale.white.value}",
				"name": "",
				"comment": ""
			},
			"complementary-1": {
				"value": "{global.color.cta.link.base.value}",
				"name": "",
				"comment": ""
			},
			"complementary-2": {
				"value": "{global.color.cta.hover.base.value}",
				"name": "",
				"comment": ""
			},
			"complementary-3": {
				"value": "{global.color.cta.visited.base.value}",
				"name": "",
				"comment": ""
			},
			"success": {
				"value": "{global.color.complementary.turqouise.base.value}",
				"name": "",
				"comment": ""
			},
			"warning": {
				"value": "{global.color.function.warning.base.value}",
				"name": "",
				"comment": ""
			},
			"danger": {
				"value": "{global.color.function.danger.base.value}",
				"name": "",
				"comment": ""
			},
			"informative": {
				"value": "{global.color.function.info.base.value}",
				"name": "",
				"comment": ""
			}
		}
	}
}
