<?xml version="1.0" encoding="UTF-8"?>
<svg width="630px" height="320px" viewBox="0 0 630 320" version="1.1" xmlns="http://www.w3.org/2000/svg" xmlns:xlink="http://www.w3.org/1999/xlink">
    <title>Group 8</title>
    <g id="Page-1" stroke="none" stroke-width="1" fill="none" fill-rule="evenodd">
        <g id="Grid-designmönstersida-placeholder" transform="translate(-371.000000, -1493.000000)">
            <g id="Group-8" transform="translate(371.000000, 1493.000000)">
                <rect id="Rectangle" fill="#FFFFFF" x="0" y="0" width="630" height="320"></rect>
                <rect id="Rectangle-Copy-17" fill="#E0EDF5" x="0" y="0" width="32.5862069" height="320"></rect>
                <rect id="Rectangle-Copy-76" fill="#E0EDF5" x="54.3103448" y="0" width="32.5862069" height="320"></rect>
                <rect id="Rectangle-Copy-77" fill="#E0EDF5" x="108.62069" y="0" width="32.5862069" height="320"></rect>
                <rect id="Rectangle-Copy-90" fill="#E0EDF5" x="162.931034" y="0" width="32.5862069" height="320"></rect>
                <rect id="Rectangle-Copy-91" fill="#E0EDF5" x="217.241379" y="0" width="32.5862069" height="320"></rect>
                <rect id="Rectangle-Copy-92" fill="#E0EDF5" x="271.551724" y="0" width="32.5862069" height="320"></rect>
                <rect id="Rectangle-Copy-93" fill="#E0EDF5" x="325.862069" y="0" width="32.5862069" height="320"></rect>
                <rect id="Rectangle-Copy-94" fill="#E0EDF5" x="380.172414" y="0" width="32.5862069" height="320"></rect>
                <rect id="Rectangle-Copy-95" fill="#E0EDF5" x="434.482759" y="0" width="32.5862069" height="320"></rect>
                <rect id="Rectangle-Copy-96" fill="#E0EDF5" x="488.793103" y="0" width="32.5862069" height="320"></rect>
                <rect id="Rectangle-Copy-97" fill="#E0EDF5" x="543.103448" y="0" width="32.5862069" height="320"></rect>
                <rect id="Rectangle-Copy-98" fill="#E0EDF5" x="597.413793" y="0" width="32.5862069" height="320"></rect>
                <rect id="Rectangle-Copy-100" fill-opacity="0.580201049" fill="#1616B2" x="0" y="0" width="630" height="66"></rect>
                <rect id="Rectangle-Copy-101" fill-opacity="0.580201049" fill="#1616B2" x="0" y="83" width="304" height="66"></rect>
                <rect id="Rectangle-Copy-103" fill-opacity="0.580201049" fill="#1616B2" x="0" y="166" width="196" height="66"></rect>
                <rect id="Rectangle-Copy-106" fill-opacity="0.580201049" fill="#1616B2" x="0" y="254" width="141" height="66"></rect>
                <rect id="Rectangle-Copy-107" fill-opacity="0.580201049" fill="#1616B2" x="163" y="254" width="141" height="66"></rect>
                <rect id="Rectangle-Copy-108" fill-opacity="0.580201049" fill="#1616B2" x="326" y="254" width="141" height="66"></rect>
                <rect id="Rectangle-Copy-109" fill-opacity="0.580201049" fill="#1616B2" x="489" y="254" width="141" height="66"></rect>
                <rect id="Rectangle-Copy-104" fill-opacity="0.580201049" fill="#1616B2" x="217" y="166" width="196" height="66"></rect>
                <rect id="Rectangle-Copy-105" fill-opacity="0.580201049" fill="#1616B2" x="434" y="166" width="196" height="66"></rect>
                <rect id="Rectangle-Copy-102" fill-opacity="0.580201049" fill="#1616B2" x="326" y="83" width="304" height="66"></rect>
                <g id="Fullbredd" transform="translate(281.570312, 26.843750)" fill="#FFFFFF" fill-rule="nonzero">
                    <polygon id="Path" points="1.328125 12.15625 0 12.15625 0 0.734375 6.3671875 0.734375 6.3671875 1.9140625 1.328125 1.9140625 1.328125 6.09375 6.0625 6.09375 6.0625 7.2734375 1.328125 7.2734375"></polygon>
                    <path d="M9.28125,3.59375 L9.28125,9.1484375 C9.28125,9.84635417 9.44010417,10.3671875 9.7578125,10.7109375 C10.0755208,11.0546875 10.5729167,11.2265625 11.25,11.2265625 C12.1458333,11.2265625 12.8007812,10.9817708 13.2148438,10.4921875 C13.6289062,10.0026042 13.8359375,9.203125 13.8359375,8.09375 L13.8359375,3.59375 L15.1328125,3.59375 L15.1328125,12.15625 L14.0625,12.15625 L13.875,11.0078125 L13.8046875,11.0078125 C13.5390625,11.4296875 13.1705729,11.7526042 12.6992188,11.9765625 C12.2278646,12.2005208 11.6901042,12.3125 11.0859375,12.3125 C10.0442708,12.3125 9.26432292,12.0651042 8.74609375,11.5703125 C8.22786458,11.0755208 7.96875,10.2838542 7.96875,9.1953125 L7.96875,3.59375 L9.28125,3.59375 Z" id="Path"></path>
                    <polygon id="Path" points="19.1796875 12.15625 17.8828125 12.15625 17.8828125 0 19.1796875 0"></polygon>
                    <polygon id="Path" points="23.2265625 12.15625 21.9296875 12.15625 21.9296875 0 23.2265625 0"></polygon>
                    <path d="M29.9609375,3.453125 C31.0859375,3.453125 31.9596354,3.83723958 32.5820312,4.60546875 C33.2044271,5.37369792 33.515625,6.4609375 33.515625,7.8671875 C33.515625,9.2734375 33.2018229,10.3658854 32.5742188,11.1445312 C31.9466146,11.9231771 31.0755208,12.3125 29.9609375,12.3125 C29.4036458,12.3125 28.8945312,12.2096354 28.4335938,12.0039062 C27.9726562,11.7981771 27.5859375,11.4817708 27.2734375,11.0546875 L27.1796875,11.0546875 L26.90625,12.15625 L25.9765625,12.15625 L25.9765625,0 L27.2734375,0 L27.2734375,2.953125 C27.2734375,3.61458333 27.2526042,4.20833333 27.2109375,4.734375 L27.2734375,4.734375 C27.8776042,3.88020833 28.7734375,3.453125 29.9609375,3.453125 Z M29.7734375,4.5390625 C28.8880208,4.5390625 28.25,4.79296875 27.859375,5.30078125 C27.46875,5.80859375 27.2734375,6.6640625 27.2734375,7.8671875 C27.2734375,9.0703125 27.4739583,9.93098958 27.875,10.4492188 C28.2760417,10.9674479 28.9192708,11.2265625 29.8046875,11.2265625 C30.6015625,11.2265625 31.1953125,10.9361979 31.5859375,10.3554688 C31.9765625,9.77473958 32.171875,8.94010417 32.171875,7.8515625 C32.171875,6.73697917 31.9765625,5.90625 31.5859375,5.359375 C31.1953125,4.8125 30.5911458,4.5390625 29.7734375,4.5390625 Z" id="Shape"></path>
                    <path d="M39.6875,3.4375 C40.0677083,3.4375 40.4088542,3.46875 40.7109375,3.53125 L40.53125,4.734375 C40.1770833,4.65625 39.8645833,4.6171875 39.59375,4.6171875 C38.9010417,4.6171875 38.3085938,4.8984375 37.8164062,5.4609375 C37.3242188,6.0234375 37.078125,6.72395833 37.078125,7.5625 L37.078125,12.15625 L35.78125,12.15625 L35.78125,3.59375 L36.8515625,3.59375 L37,5.1796875 L37.0625,5.1796875 C37.3802083,4.62239583 37.7630208,4.19270833 38.2109375,3.890625 C38.6588542,3.58854167 39.1510417,3.4375 39.6875,3.4375 Z" id="Path"></path>
                    <path d="M45.9296875,12.3125 C44.6640625,12.3125 43.6653646,11.9270833 42.9335938,11.15625 C42.2018229,10.3854167 41.8359375,9.31510417 41.8359375,7.9453125 C41.8359375,6.56510417 42.1757812,5.46875 42.8554688,4.65625 C43.5351562,3.84375 44.4479167,3.4375 45.59375,3.4375 C46.6666667,3.4375 47.515625,3.79036458 48.140625,4.49609375 C48.765625,5.20182292 49.078125,6.1328125 49.078125,7.2890625 L49.078125,8.109375 L43.1796875,8.109375 C43.2057292,9.11458333 43.4596354,9.87760417 43.9414062,10.3984375 C44.4231771,10.9192708 45.1015625,11.1796875 45.9765625,11.1796875 C46.8984375,11.1796875 47.8098958,10.9869792 48.7109375,10.6015625 L48.7109375,11.7578125 C48.2526042,11.9557292 47.8190104,12.0976562 47.4101562,12.1835938 C47.0013021,12.2695312 46.5078125,12.3125 45.9296875,12.3125 Z M45.578125,4.5234375 C44.890625,4.5234375 44.3424479,4.74739583 43.9335938,5.1953125 C43.5247396,5.64322917 43.2838542,6.26302083 43.2109375,7.0546875 L47.6875,7.0546875 C47.6875,6.23697917 47.5052083,5.61067708 47.140625,5.17578125 C46.7760417,4.74088542 46.2552083,4.5234375 45.578125,4.5234375 Z" id="Shape"></path>
                    <path d="M57.1171875,11.0078125 L57.046875,11.0078125 C56.4479167,11.8776042 55.5520833,12.3125 54.359375,12.3125 C53.2395833,12.3125 52.3684896,11.9296875 51.7460938,11.1640625 C51.1236979,10.3984375 50.8125,9.30989583 50.8125,7.8984375 C50.8125,6.48697917 51.125,5.390625 51.75,4.609375 C52.375,3.828125 53.2447917,3.4375 54.359375,3.4375 C55.5208333,3.4375 56.4114583,3.859375 57.03125,4.703125 L57.1328125,4.703125 L57.078125,4.0859375 L57.046875,3.484375 L57.046875,0 L58.34375,0 L58.34375,12.15625 L57.2890625,12.15625 L57.1171875,11.0078125 Z M54.5234375,11.2265625 C55.4088542,11.2265625 56.0507812,10.9856771 56.4492188,10.5039062 C56.8476562,10.0221354 57.046875,9.24479167 57.046875,8.171875 L57.046875,7.8984375 C57.046875,6.68489583 56.8450521,5.81901042 56.4414062,5.30078125 C56.0377604,4.78255208 55.3932292,4.5234375 54.5078125,4.5234375 C53.7473958,4.5234375 53.1653646,4.81901042 52.7617188,5.41015625 C52.3580729,6.00130208 52.15625,6.8359375 52.15625,7.9140625 C52.15625,9.0078125 52.3567708,9.83333333 52.7578125,10.390625 C53.1588542,10.9479167 53.7473958,11.2265625 54.5234375,11.2265625 Z" id="Shape"></path>
                    <path d="M66.921875,11.0078125 L66.8515625,11.0078125 C66.2526042,11.8776042 65.3567708,12.3125 64.1640625,12.3125 C63.0442708,12.3125 62.1731771,11.9296875 61.5507812,11.1640625 C60.9283854,10.3984375 60.6171875,9.30989583 60.6171875,7.8984375 C60.6171875,6.48697917 60.9296875,5.390625 61.5546875,4.609375 C62.1796875,3.828125 63.0494792,3.4375 64.1640625,3.4375 C65.3255208,3.4375 66.2161458,3.859375 66.8359375,4.703125 L66.9375,4.703125 L66.8828125,4.0859375 L66.8515625,3.484375 L66.8515625,0 L68.1484375,0 L68.1484375,12.15625 L67.09375,12.15625 L66.921875,11.0078125 Z M64.328125,11.2265625 C65.2135417,11.2265625 65.8554688,10.9856771 66.2539062,10.5039062 C66.6523438,10.0221354 66.8515625,9.24479167 66.8515625,8.171875 L66.8515625,7.8984375 C66.8515625,6.68489583 66.6497396,5.81901042 66.2460938,5.30078125 C65.8424479,4.78255208 65.1979167,4.5234375 64.3125,4.5234375 C63.5520833,4.5234375 62.9700521,4.81901042 62.5664062,5.41015625 C62.1627604,6.00130208 61.9609375,6.8359375 61.9609375,7.9140625 C61.9609375,9.0078125 62.1614583,9.83333333 62.5625,10.390625 C62.9635417,10.9479167 63.5520833,11.2265625 64.328125,11.2265625 Z" id="Shape"></path>
                </g>
                <g id="Tvåspalt" transform="translate(103.140625, 108.960938)" fill="#FFFFFF" fill-rule="nonzero">
                    <polygon id="Path" points="4.9453125 13.0390625 3.6171875 13.0390625 3.6171875 2.796875 0 2.796875 0 1.6171875 8.5625 1.6171875 8.5625 2.796875 4.9453125 2.796875"></polygon>
                    <path d="M11.9609375,13.0390625 L8.7109375,4.4765625 L10.1015625,4.4765625 L11.9453125,9.5546875 C12.3619792,10.7421875 12.6067708,11.5130208 12.6796875,11.8671875 L12.7421875,11.8671875 C12.7994792,11.5911458 12.9804688,11.0195312 13.2851562,10.1523438 C13.5898438,9.28515625 14.2734375,7.39322917 15.3359375,4.4765625 L16.7265625,4.4765625 L13.4765625,13.0390625 L11.9609375,13.0390625 Z" id="Path"></path>
                    <path d="M23.3671875,13.0390625 L23.109375,11.8203125 L23.046875,11.8203125 C22.6197917,12.3567708 22.1940104,12.7200521 21.7695312,12.9101562 C21.3450521,13.1002604 20.8151042,13.1953125 20.1796875,13.1953125 C19.3307292,13.1953125 18.6653646,12.9765625 18.1835938,12.5390625 C17.7018229,12.1015625 17.4609375,11.4791667 17.4609375,10.671875 C17.4609375,8.94270833 18.84375,8.03645833 21.609375,7.953125 L23.0625,7.90625 L23.0625,7.375 C23.0625,6.703125 22.9179688,6.20703125 22.6289062,5.88671875 C22.3398438,5.56640625 21.8776042,5.40625 21.2421875,5.40625 C20.5286458,5.40625 19.7213542,5.625 18.8203125,6.0625 L18.421875,5.0703125 C18.84375,4.84114583 19.3059896,4.66145833 19.8085938,4.53125 C20.3111979,4.40104167 20.8151042,4.3359375 21.3203125,4.3359375 C22.3411458,4.3359375 23.0976562,4.5625 23.5898438,5.015625 C24.0820312,5.46875 24.328125,6.1953125 24.328125,7.1953125 L24.328125,13.0390625 L23.3671875,13.0390625 Z M20.4375,12.125 C21.2447917,12.125 21.8789062,11.9036458 22.3398438,11.4609375 C22.8007812,11.0182292 23.03125,10.3984375 23.03125,9.6015625 L23.03125,8.828125 L21.734375,8.8828125 C20.703125,8.91927083 19.9596354,9.07942708 19.5039062,9.36328125 C19.0481771,9.64713542 18.8203125,10.0885417 18.8203125,10.6875 C18.8203125,11.15625 18.9622396,11.5130208 19.2460938,11.7578125 C19.5299479,12.0026042 19.9270833,12.125 20.4375,12.125 Z M23.0078125,1.6484375 C23.0078125,2.15885417 22.8476562,2.56901042 22.5273438,2.87890625 C22.2070312,3.18880208 21.78125,3.34375 21.25,3.34375 C20.7239583,3.34375 20.3046875,3.19140625 19.9921875,2.88671875 C19.6796875,2.58203125 19.5234375,2.17447917 19.5234375,1.6640625 C19.5234375,1.15364583 19.6809896,0.748697917 19.9960938,0.44921875 C20.3111979,0.149739583 20.7291667,0 21.25,0 C21.7760417,0 22.2005208,0.154947917 22.5234375,0.46484375 C22.8463542,0.774739583 23.0078125,1.16927083 23.0078125,1.6484375 Z M22.1640625,1.6640625 C22.1640625,1.37239583 22.078125,1.14713542 21.90625,0.98828125 C21.734375,0.829427083 21.515625,0.75 21.25,0.75 C20.984375,0.75 20.765625,0.829427083 20.59375,0.98828125 C20.421875,1.14713542 20.3359375,1.37239583 20.3359375,1.6640625 C20.3359375,1.95572917 20.4140625,2.18098958 20.5703125,2.33984375 C20.7265625,2.49869792 20.953125,2.578125 21.25,2.578125 C21.5208333,2.578125 21.7408854,2.49869792 21.9101562,2.33984375 C22.0794271,2.18098958 22.1640625,1.95572917 22.1640625,1.6640625 Z" id="Shape"></path>
                    <path d="M32.5234375,10.703125 C32.5234375,11.5 32.2265625,12.1145833 31.6328125,12.546875 C31.0390625,12.9791667 30.2057292,13.1953125 29.1328125,13.1953125 C27.9973958,13.1953125 27.1119792,13.015625 26.4765625,12.65625 L26.4765625,11.453125 C26.8880208,11.6614583 27.3294271,11.8255208 27.8007812,11.9453125 C28.2721354,12.0651042 28.7265625,12.125 29.1640625,12.125 C29.8411458,12.125 30.3619792,12.0169271 30.7265625,11.8007812 C31.0911458,11.5846354 31.2734375,11.2552083 31.2734375,10.8125 C31.2734375,10.4791667 31.1289062,10.1940104 30.8398438,9.95703125 C30.5507812,9.72005208 29.9869792,9.44010417 29.1484375,9.1171875 C28.3515625,8.8203125 27.7851562,8.56119792 27.4492188,8.33984375 C27.1132812,8.11848958 26.8632812,7.8671875 26.6992188,7.5859375 C26.5351562,7.3046875 26.453125,6.96875 26.453125,6.578125 C26.453125,5.88020833 26.7369792,5.32942708 27.3046875,4.92578125 C27.8723958,4.52213542 28.6510417,4.3203125 29.640625,4.3203125 C30.5625,4.3203125 31.4635417,4.5078125 32.34375,4.8828125 L31.8828125,5.9375 C31.0234375,5.58333333 30.2447917,5.40625 29.546875,5.40625 C28.9322917,5.40625 28.46875,5.50260417 28.15625,5.6953125 C27.84375,5.88802083 27.6875,6.15364583 27.6875,6.4921875 C27.6875,6.72135417 27.7460938,6.91666667 27.8632812,7.078125 C27.9804688,7.23958333 28.1692708,7.39322917 28.4296875,7.5390625 C28.6901042,7.68489583 29.1901042,7.89583333 29.9296875,8.171875 C30.9453125,8.54166667 31.6315104,8.9140625 31.9882812,9.2890625 C32.3450521,9.6640625 32.5234375,10.1354167 32.5234375,10.703125 Z" id="Path"></path>
                    <path d="M38.6171875,13.1953125 C38.0598958,13.1953125 37.5507812,13.0924479 37.0898438,12.8867188 C36.6289062,12.6809896 36.2421875,12.3645833 35.9296875,11.9375 L35.8359375,11.9375 C35.8984375,12.4375 35.9296875,12.9114583 35.9296875,13.359375 L35.9296875,16.8828125 L34.6328125,16.8828125 L34.6328125,4.4765625 L35.6875,4.4765625 L35.8671875,5.6484375 L35.9296875,5.6484375 C36.2630208,5.1796875 36.6510417,4.84114583 37.09375,4.6328125 C37.5364583,4.42447917 38.0442708,4.3203125 38.6171875,4.3203125 C39.7526042,4.3203125 40.6289062,4.70833333 41.2460938,5.484375 C41.8632812,6.26041667 42.171875,7.34895833 42.171875,8.75 C42.171875,10.15625 41.8580729,11.2486979 41.2304688,12.0273438 C40.6028646,12.8059896 39.7317708,13.1953125 38.6171875,13.1953125 Z M38.4296875,5.421875 C37.5546875,5.421875 36.921875,5.6640625 36.53125,6.1484375 C36.140625,6.6328125 35.9401042,7.40364583 35.9296875,8.4609375 L35.9296875,8.75 C35.9296875,9.953125 36.1302083,10.8138021 36.53125,11.3320312 C36.9322917,11.8502604 37.5755208,12.109375 38.4609375,12.109375 C39.2005208,12.109375 39.7799479,11.8098958 40.1992188,11.2109375 C40.6184896,10.6119792 40.828125,9.78645833 40.828125,8.734375 C40.828125,7.66666667 40.6184896,6.84765625 40.1992188,6.27734375 C39.7799479,5.70703125 39.1901042,5.421875 38.4296875,5.421875 Z" id="Shape"></path>
                    <path d="M49.703125,13.0390625 L49.4453125,11.8203125 L49.3828125,11.8203125 C48.9557292,12.3567708 48.5299479,12.7200521 48.1054688,12.9101562 C47.6809896,13.1002604 47.1510417,13.1953125 46.515625,13.1953125 C45.6666667,13.1953125 45.0013021,12.9765625 44.5195312,12.5390625 C44.0377604,12.1015625 43.796875,11.4791667 43.796875,10.671875 C43.796875,8.94270833 45.1796875,8.03645833 47.9453125,7.953125 L49.3984375,7.90625 L49.3984375,7.375 C49.3984375,6.703125 49.2539062,6.20703125 48.9648438,5.88671875 C48.6757812,5.56640625 48.2135417,5.40625 47.578125,5.40625 C46.8645833,5.40625 46.0572917,5.625 45.15625,6.0625 L44.7578125,5.0703125 C45.1796875,4.84114583 45.6419271,4.66145833 46.1445312,4.53125 C46.6471354,4.40104167 47.1510417,4.3359375 47.65625,4.3359375 C48.6770833,4.3359375 49.4335938,4.5625 49.9257812,5.015625 C50.4179688,5.46875 50.6640625,6.1953125 50.6640625,7.1953125 L50.6640625,13.0390625 L49.703125,13.0390625 Z M46.7734375,12.125 C47.5807292,12.125 48.2148438,11.9036458 48.6757812,11.4609375 C49.1367188,11.0182292 49.3671875,10.3984375 49.3671875,9.6015625 L49.3671875,8.828125 L48.0703125,8.8828125 C47.0390625,8.91927083 46.2955729,9.07942708 45.8398438,9.36328125 C45.3841146,9.64713542 45.15625,10.0885417 45.15625,10.6875 C45.15625,11.15625 45.2981771,11.5130208 45.5820312,11.7578125 C45.8658854,12.0026042 46.2630208,12.125 46.7734375,12.125 Z" id="Shape"></path>
                    <polygon id="Path" points="54.6328125 13.0390625 53.3359375 13.0390625 53.3359375 0.8828125 54.6328125 0.8828125"></polygon>
                    <path d="M60.1484375,12.125 C60.3776042,12.125 60.5989583,12.1080729 60.8125,12.0742188 C61.0260417,12.0403646 61.1953125,12.0052083 61.3203125,11.96875 L61.3203125,12.9609375 C61.1796875,13.0286458 60.9726562,13.0846354 60.6992188,13.1289062 C60.4257812,13.1731771 60.1796875,13.1953125 59.9609375,13.1953125 C58.3046875,13.1953125 57.4765625,12.3229167 57.4765625,10.578125 L57.4765625,5.484375 L56.25,5.484375 L56.25,4.859375 L57.4765625,4.3203125 L58.0234375,2.4921875 L58.7734375,2.4921875 L58.7734375,4.4765625 L61.2578125,4.4765625 L61.2578125,5.484375 L58.7734375,5.484375 L58.7734375,10.5234375 C58.7734375,11.0390625 58.8958333,11.4348958 59.140625,11.7109375 C59.3854167,11.9869792 59.7213542,12.125 60.1484375,12.125 Z" id="Path"></path>
                </g>
                <g id="Trespalt" transform="translate(53.140625, 192.843750)" fill="#FFFFFF" fill-rule="nonzero">
                    <polygon id="Path" points="4.9453125 12.15625 3.6171875 12.15625 3.6171875 1.9140625 0 1.9140625 0 0.734375 8.5625 0.734375 8.5625 1.9140625 4.9453125 1.9140625"></polygon>
                    <path d="M13.9921875,3.4375 C14.3723958,3.4375 14.7135417,3.46875 15.015625,3.53125 L14.8359375,4.734375 C14.4817708,4.65625 14.1692708,4.6171875 13.8984375,4.6171875 C13.2057292,4.6171875 12.6132812,4.8984375 12.1210938,5.4609375 C11.6289062,6.0234375 11.3828125,6.72395833 11.3828125,7.5625 L11.3828125,12.15625 L10.0859375,12.15625 L10.0859375,3.59375 L11.15625,3.59375 L11.3046875,5.1796875 L11.3671875,5.1796875 C11.6848958,4.62239583 12.0677083,4.19270833 12.515625,3.890625 C12.9635417,3.58854167 13.4557292,3.4375 13.9921875,3.4375 Z" id="Path"></path>
                    <path d="M20.234375,12.3125 C18.96875,12.3125 17.9700521,11.9270833 17.2382812,11.15625 C16.5065104,10.3854167 16.140625,9.31510417 16.140625,7.9453125 C16.140625,6.56510417 16.4804688,5.46875 17.1601562,4.65625 C17.8398438,3.84375 18.7526042,3.4375 19.8984375,3.4375 C20.9713542,3.4375 21.8203125,3.79036458 22.4453125,4.49609375 C23.0703125,5.20182292 23.3828125,6.1328125 23.3828125,7.2890625 L23.3828125,8.109375 L17.484375,8.109375 C17.5104167,9.11458333 17.7643229,9.87760417 18.2460938,10.3984375 C18.7278646,10.9192708 19.40625,11.1796875 20.28125,11.1796875 C21.203125,11.1796875 22.1145833,10.9869792 23.015625,10.6015625 L23.015625,11.7578125 C22.5572917,11.9557292 22.1236979,12.0976562 21.7148438,12.1835938 C21.3059896,12.2695312 20.8125,12.3125 20.234375,12.3125 Z M19.8828125,4.5234375 C19.1953125,4.5234375 18.6471354,4.74739583 18.2382812,5.1953125 C17.8294271,5.64322917 17.5885417,6.26302083 17.515625,7.0546875 L21.9921875,7.0546875 C21.9921875,6.23697917 21.8098958,5.61067708 21.4453125,5.17578125 C21.0807292,4.74088542 20.5598958,4.5234375 19.8828125,4.5234375 Z" id="Shape"></path>
                    <path d="M31.1171875,9.8203125 C31.1171875,10.6171875 30.8203125,11.2317708 30.2265625,11.6640625 C29.6328125,12.0963542 28.7994792,12.3125 27.7265625,12.3125 C26.5911458,12.3125 25.7057292,12.1328125 25.0703125,11.7734375 L25.0703125,10.5703125 C25.4817708,10.7786458 25.9231771,10.9427083 26.3945312,11.0625 C26.8658854,11.1822917 27.3203125,11.2421875 27.7578125,11.2421875 C28.4348958,11.2421875 28.9557292,11.1341146 29.3203125,10.9179688 C29.6848958,10.7018229 29.8671875,10.3723958 29.8671875,9.9296875 C29.8671875,9.59635417 29.7226562,9.31119792 29.4335938,9.07421875 C29.1445312,8.83723958 28.5807292,8.55729167 27.7421875,8.234375 C26.9453125,7.9375 26.3789062,7.67838542 26.0429688,7.45703125 C25.7070312,7.23567708 25.4570312,6.984375 25.2929688,6.703125 C25.1289062,6.421875 25.046875,6.0859375 25.046875,5.6953125 C25.046875,4.99739583 25.3307292,4.44661458 25.8984375,4.04296875 C26.4661458,3.63932292 27.2447917,3.4375 28.234375,3.4375 C29.15625,3.4375 30.0572917,3.625 30.9375,4 L30.4765625,5.0546875 C29.6171875,4.70052083 28.8385417,4.5234375 28.140625,4.5234375 C27.5260417,4.5234375 27.0625,4.61979167 26.75,4.8125 C26.4375,5.00520833 26.28125,5.27083333 26.28125,5.609375 C26.28125,5.83854167 26.3398438,6.03385417 26.4570312,6.1953125 C26.5742188,6.35677083 26.7630208,6.51041667 27.0234375,6.65625 C27.2838542,6.80208333 27.7838542,7.01302083 28.5234375,7.2890625 C29.5390625,7.65885417 30.2252604,8.03125 30.5820312,8.40625 C30.9388021,8.78125 31.1171875,9.25260417 31.1171875,9.8203125 Z" id="Path"></path>
                    <path d="M37.2109375,12.3125 C36.6536458,12.3125 36.1445312,12.2096354 35.6835938,12.0039062 C35.2226562,11.7981771 34.8359375,11.4817708 34.5234375,11.0546875 L34.4296875,11.0546875 C34.4921875,11.5546875 34.5234375,12.0286458 34.5234375,12.4765625 L34.5234375,16 L33.2265625,16 L33.2265625,3.59375 L34.28125,3.59375 L34.4609375,4.765625 L34.5234375,4.765625 C34.8567708,4.296875 35.2447917,3.95833333 35.6875,3.75 C36.1302083,3.54166667 36.6380208,3.4375 37.2109375,3.4375 C38.3463542,3.4375 39.2226562,3.82552083 39.8398438,4.6015625 C40.4570312,5.37760417 40.765625,6.46614583 40.765625,7.8671875 C40.765625,9.2734375 40.4518229,10.3658854 39.8242188,11.1445312 C39.1966146,11.9231771 38.3255208,12.3125 37.2109375,12.3125 Z M37.0234375,4.5390625 C36.1484375,4.5390625 35.515625,4.78125 35.125,5.265625 C34.734375,5.75 34.5338542,6.52083333 34.5234375,7.578125 L34.5234375,7.8671875 C34.5234375,9.0703125 34.7239583,9.93098958 35.125,10.4492188 C35.5260417,10.9674479 36.1692708,11.2265625 37.0546875,11.2265625 C37.7942708,11.2265625 38.3736979,10.9270833 38.7929688,10.328125 C39.2122396,9.72916667 39.421875,8.90364583 39.421875,7.8515625 C39.421875,6.78385417 39.2122396,5.96484375 38.7929688,5.39453125 C38.3736979,4.82421875 37.7838542,4.5390625 37.0234375,4.5390625 Z" id="Shape"></path>
                    <path d="M48.296875,12.15625 L48.0390625,10.9375 L47.9765625,10.9375 C47.5494792,11.4739583 47.1236979,11.8372396 46.6992188,12.0273438 C46.2747396,12.2174479 45.7447917,12.3125 45.109375,12.3125 C44.2604167,12.3125 43.5950521,12.09375 43.1132812,11.65625 C42.6315104,11.21875 42.390625,10.5963542 42.390625,9.7890625 C42.390625,8.05989583 43.7734375,7.15364583 46.5390625,7.0703125 L47.9921875,7.0234375 L47.9921875,6.4921875 C47.9921875,5.8203125 47.8476562,5.32421875 47.5585938,5.00390625 C47.2695312,4.68359375 46.8072917,4.5234375 46.171875,4.5234375 C45.4583333,4.5234375 44.6510417,4.7421875 43.75,5.1796875 L43.3515625,4.1875 C43.7734375,3.95833333 44.2356771,3.77864583 44.7382812,3.6484375 C45.2408854,3.51822917 45.7447917,3.453125 46.25,3.453125 C47.2708333,3.453125 48.0273438,3.6796875 48.5195312,4.1328125 C49.0117188,4.5859375 49.2578125,5.3125 49.2578125,6.3125 L49.2578125,12.15625 L48.296875,12.15625 Z M45.3671875,11.2421875 C46.1744792,11.2421875 46.8085938,11.0208333 47.2695312,10.578125 C47.7304688,10.1354167 47.9609375,9.515625 47.9609375,8.71875 L47.9609375,7.9453125 L46.6640625,8 C45.6328125,8.03645833 44.8893229,8.19661458 44.4335938,8.48046875 C43.9778646,8.76432292 43.75,9.20572917 43.75,9.8046875 C43.75,10.2734375 43.8919271,10.6302083 44.1757812,10.875 C44.4596354,11.1197917 44.8567708,11.2421875 45.3671875,11.2421875 Z" id="Shape"></path>
                    <polygon id="Path" points="53.2265625 12.15625 51.9296875 12.15625 51.9296875 0 53.2265625 0"></polygon>
                    <path d="M58.7421875,11.2421875 C58.9713542,11.2421875 59.1927083,11.2252604 59.40625,11.1914062 C59.6197917,11.1575521 59.7890625,11.1223958 59.9140625,11.0859375 L59.9140625,12.078125 C59.7734375,12.1458333 59.5664062,12.2018229 59.2929688,12.2460938 C59.0195312,12.2903646 58.7734375,12.3125 58.5546875,12.3125 C56.8984375,12.3125 56.0703125,11.4401042 56.0703125,9.6953125 L56.0703125,4.6015625 L54.84375,4.6015625 L54.84375,3.9765625 L56.0703125,3.4375 L56.6171875,1.609375 L57.3671875,1.609375 L57.3671875,3.59375 L59.8515625,3.59375 L59.8515625,4.6015625 L57.3671875,4.6015625 L57.3671875,9.640625 C57.3671875,10.15625 57.4895833,10.5520833 57.734375,10.828125 C57.9791667,11.1041667 58.3151042,11.2421875 58.7421875,11.2421875 Z" id="Path"></path>
                </g>
                <g id="Trespalt-Copy" transform="translate(281.140625, 192.843750)" fill="#FFFFFF" fill-rule="nonzero">
                    <polygon id="Path" points="4.9453125 12.15625 3.6171875 12.15625 3.6171875 1.9140625 0 1.9140625 0 0.734375 8.5625 0.734375 8.5625 1.9140625 4.9453125 1.9140625"></polygon>
                    <path d="M13.9921875,3.4375 C14.3723958,3.4375 14.7135417,3.46875 15.015625,3.53125 L14.8359375,4.734375 C14.4817708,4.65625 14.1692708,4.6171875 13.8984375,4.6171875 C13.2057292,4.6171875 12.6132812,4.8984375 12.1210938,5.4609375 C11.6289062,6.0234375 11.3828125,6.72395833 11.3828125,7.5625 L11.3828125,12.15625 L10.0859375,12.15625 L10.0859375,3.59375 L11.15625,3.59375 L11.3046875,5.1796875 L11.3671875,5.1796875 C11.6848958,4.62239583 12.0677083,4.19270833 12.515625,3.890625 C12.9635417,3.58854167 13.4557292,3.4375 13.9921875,3.4375 Z" id="Path"></path>
                    <path d="M20.234375,12.3125 C18.96875,12.3125 17.9700521,11.9270833 17.2382812,11.15625 C16.5065104,10.3854167 16.140625,9.31510417 16.140625,7.9453125 C16.140625,6.56510417 16.4804688,5.46875 17.1601562,4.65625 C17.8398438,3.84375 18.7526042,3.4375 19.8984375,3.4375 C20.9713542,3.4375 21.8203125,3.79036458 22.4453125,4.49609375 C23.0703125,5.20182292 23.3828125,6.1328125 23.3828125,7.2890625 L23.3828125,8.109375 L17.484375,8.109375 C17.5104167,9.11458333 17.7643229,9.87760417 18.2460938,10.3984375 C18.7278646,10.9192708 19.40625,11.1796875 20.28125,11.1796875 C21.203125,11.1796875 22.1145833,10.9869792 23.015625,10.6015625 L23.015625,11.7578125 C22.5572917,11.9557292 22.1236979,12.0976562 21.7148438,12.1835938 C21.3059896,12.2695312 20.8125,12.3125 20.234375,12.3125 Z M19.8828125,4.5234375 C19.1953125,4.5234375 18.6471354,4.74739583 18.2382812,5.1953125 C17.8294271,5.64322917 17.5885417,6.26302083 17.515625,7.0546875 L21.9921875,7.0546875 C21.9921875,6.23697917 21.8098958,5.61067708 21.4453125,5.17578125 C21.0807292,4.74088542 20.5598958,4.5234375 19.8828125,4.5234375 Z" id="Shape"></path>
                    <path d="M31.1171875,9.8203125 C31.1171875,10.6171875 30.8203125,11.2317708 30.2265625,11.6640625 C29.6328125,12.0963542 28.7994792,12.3125 27.7265625,12.3125 C26.5911458,12.3125 25.7057292,12.1328125 25.0703125,11.7734375 L25.0703125,10.5703125 C25.4817708,10.7786458 25.9231771,10.9427083 26.3945312,11.0625 C26.8658854,11.1822917 27.3203125,11.2421875 27.7578125,11.2421875 C28.4348958,11.2421875 28.9557292,11.1341146 29.3203125,10.9179688 C29.6848958,10.7018229 29.8671875,10.3723958 29.8671875,9.9296875 C29.8671875,9.59635417 29.7226562,9.31119792 29.4335938,9.07421875 C29.1445312,8.83723958 28.5807292,8.55729167 27.7421875,8.234375 C26.9453125,7.9375 26.3789062,7.67838542 26.0429688,7.45703125 C25.7070312,7.23567708 25.4570312,6.984375 25.2929688,6.703125 C25.1289062,6.421875 25.046875,6.0859375 25.046875,5.6953125 C25.046875,4.99739583 25.3307292,4.44661458 25.8984375,4.04296875 C26.4661458,3.63932292 27.2447917,3.4375 28.234375,3.4375 C29.15625,3.4375 30.0572917,3.625 30.9375,4 L30.4765625,5.0546875 C29.6171875,4.70052083 28.8385417,4.5234375 28.140625,4.5234375 C27.5260417,4.5234375 27.0625,4.61979167 26.75,4.8125 C26.4375,5.00520833 26.28125,5.27083333 26.28125,5.609375 C26.28125,5.83854167 26.3398438,6.03385417 26.4570312,6.1953125 C26.5742188,6.35677083 26.7630208,6.51041667 27.0234375,6.65625 C27.2838542,6.80208333 27.7838542,7.01302083 28.5234375,7.2890625 C29.5390625,7.65885417 30.2252604,8.03125 30.5820312,8.40625 C30.9388021,8.78125 31.1171875,9.25260417 31.1171875,9.8203125 Z" id="Path"></path>
                    <path d="M37.2109375,12.3125 C36.6536458,12.3125 36.1445312,12.2096354 35.6835938,12.0039062 C35.2226562,11.7981771 34.8359375,11.4817708 34.5234375,11.0546875 L34.4296875,11.0546875 C34.4921875,11.5546875 34.5234375,12.0286458 34.5234375,12.4765625 L34.5234375,16 L33.2265625,16 L33.2265625,3.59375 L34.28125,3.59375 L34.4609375,4.765625 L34.5234375,4.765625 C34.8567708,4.296875 35.2447917,3.95833333 35.6875,3.75 C36.1302083,3.54166667 36.6380208,3.4375 37.2109375,3.4375 C38.3463542,3.4375 39.2226562,3.82552083 39.8398438,4.6015625 C40.4570312,5.37760417 40.765625,6.46614583 40.765625,7.8671875 C40.765625,9.2734375 40.4518229,10.3658854 39.8242188,11.1445312 C39.1966146,11.9231771 38.3255208,12.3125 37.2109375,12.3125 Z M37.0234375,4.5390625 C36.1484375,4.5390625 35.515625,4.78125 35.125,5.265625 C34.734375,5.75 34.5338542,6.52083333 34.5234375,7.578125 L34.5234375,7.8671875 C34.5234375,9.0703125 34.7239583,9.93098958 35.125,10.4492188 C35.5260417,10.9674479 36.1692708,11.2265625 37.0546875,11.2265625 C37.7942708,11.2265625 38.3736979,10.9270833 38.7929688,10.328125 C39.2122396,9.72916667 39.421875,8.90364583 39.421875,7.8515625 C39.421875,6.78385417 39.2122396,5.96484375 38.7929688,5.39453125 C38.3736979,4.82421875 37.7838542,4.5390625 37.0234375,4.5390625 Z" id="Shape"></path>
                    <path d="M48.296875,12.15625 L48.0390625,10.9375 L47.9765625,10.9375 C47.5494792,11.4739583 47.1236979,11.8372396 46.6992188,12.0273438 C46.2747396,12.2174479 45.7447917,12.3125 45.109375,12.3125 C44.2604167,12.3125 43.5950521,12.09375 43.1132812,11.65625 C42.6315104,11.21875 42.390625,10.5963542 42.390625,9.7890625 C42.390625,8.05989583 43.7734375,7.15364583 46.5390625,7.0703125 L47.9921875,7.0234375 L47.9921875,6.4921875 C47.9921875,5.8203125 47.8476562,5.32421875 47.5585938,5.00390625 C47.2695312,4.68359375 46.8072917,4.5234375 46.171875,4.5234375 C45.4583333,4.5234375 44.6510417,4.7421875 43.75,5.1796875 L43.3515625,4.1875 C43.7734375,3.95833333 44.2356771,3.77864583 44.7382812,3.6484375 C45.2408854,3.51822917 45.7447917,3.453125 46.25,3.453125 C47.2708333,3.453125 48.0273438,3.6796875 48.5195312,4.1328125 C49.0117188,4.5859375 49.2578125,5.3125 49.2578125,6.3125 L49.2578125,12.15625 L48.296875,12.15625 Z M45.3671875,11.2421875 C46.1744792,11.2421875 46.8085938,11.0208333 47.2695312,10.578125 C47.7304688,10.1354167 47.9609375,9.515625 47.9609375,8.71875 L47.9609375,7.9453125 L46.6640625,8 C45.6328125,8.03645833 44.8893229,8.19661458 44.4335938,8.48046875 C43.9778646,8.76432292 43.75,9.20572917 43.75,9.8046875 C43.75,10.2734375 43.8919271,10.6302083 44.1757812,10.875 C44.4596354,11.1197917 44.8567708,11.2421875 45.3671875,11.2421875 Z" id="Shape"></path>
                    <polygon id="Path" points="53.2265625 12.15625 51.9296875 12.15625 51.9296875 0 53.2265625 0"></polygon>
                    <path d="M58.7421875,11.2421875 C58.9713542,11.2421875 59.1927083,11.2252604 59.40625,11.1914062 C59.6197917,11.1575521 59.7890625,11.1223958 59.9140625,11.0859375 L59.9140625,12.078125 C59.7734375,12.1458333 59.5664062,12.2018229 59.2929688,12.2460938 C59.0195312,12.2903646 58.7734375,12.3125 58.5546875,12.3125 C56.8984375,12.3125 56.0703125,11.4401042 56.0703125,9.6953125 L56.0703125,4.6015625 L54.84375,4.6015625 L54.84375,3.9765625 L56.0703125,3.4375 L56.6171875,1.609375 L57.3671875,1.609375 L57.3671875,3.59375 L59.8515625,3.59375 L59.8515625,4.6015625 L57.3671875,4.6015625 L57.3671875,9.640625 C57.3671875,10.15625 57.4895833,10.5520833 57.734375,10.828125 C57.9791667,11.1041667 58.3151042,11.2421875 58.7421875,11.2421875 Z" id="Path"></path>
                </g>
                <g id="Trespalt-Copy-2" transform="translate(506.140625, 192.843750)" fill="#FFFFFF" fill-rule="nonzero">
                    <polygon id="Path" points="4.9453125 12.15625 3.6171875 12.15625 3.6171875 1.9140625 0 1.9140625 0 0.734375 8.5625 0.734375 8.5625 1.9140625 4.9453125 1.9140625"></polygon>
                    <path d="M13.9921875,3.4375 C14.3723958,3.4375 14.7135417,3.46875 15.015625,3.53125 L14.8359375,4.734375 C14.4817708,4.65625 14.1692708,4.6171875 13.8984375,4.6171875 C13.2057292,4.6171875 12.6132812,4.8984375 12.1210938,5.4609375 C11.6289062,6.0234375 11.3828125,6.72395833 11.3828125,7.5625 L11.3828125,12.15625 L10.0859375,12.15625 L10.0859375,3.59375 L11.15625,3.59375 L11.3046875,5.1796875 L11.3671875,5.1796875 C11.6848958,4.62239583 12.0677083,4.19270833 12.515625,3.890625 C12.9635417,3.58854167 13.4557292,3.4375 13.9921875,3.4375 Z" id="Path"></path>
                    <path d="M20.234375,12.3125 C18.96875,12.3125 17.9700521,11.9270833 17.2382812,11.15625 C16.5065104,10.3854167 16.140625,9.31510417 16.140625,7.9453125 C16.140625,6.56510417 16.4804688,5.46875 17.1601562,4.65625 C17.8398438,3.84375 18.7526042,3.4375 19.8984375,3.4375 C20.9713542,3.4375 21.8203125,3.79036458 22.4453125,4.49609375 C23.0703125,5.20182292 23.3828125,6.1328125 23.3828125,7.2890625 L23.3828125,8.109375 L17.484375,8.109375 C17.5104167,9.11458333 17.7643229,9.87760417 18.2460938,10.3984375 C18.7278646,10.9192708 19.40625,11.1796875 20.28125,11.1796875 C21.203125,11.1796875 22.1145833,10.9869792 23.015625,10.6015625 L23.015625,11.7578125 C22.5572917,11.9557292 22.1236979,12.0976562 21.7148438,12.1835938 C21.3059896,12.2695312 20.8125,12.3125 20.234375,12.3125 Z M19.8828125,4.5234375 C19.1953125,4.5234375 18.6471354,4.74739583 18.2382812,5.1953125 C17.8294271,5.64322917 17.5885417,6.26302083 17.515625,7.0546875 L21.9921875,7.0546875 C21.9921875,6.23697917 21.8098958,5.61067708 21.4453125,5.17578125 C21.0807292,4.74088542 20.5598958,4.5234375 19.8828125,4.5234375 Z" id="Shape"></path>
                    <path d="M31.1171875,9.8203125 C31.1171875,10.6171875 30.8203125,11.2317708 30.2265625,11.6640625 C29.6328125,12.0963542 28.7994792,12.3125 27.7265625,12.3125 C26.5911458,12.3125 25.7057292,12.1328125 25.0703125,11.7734375 L25.0703125,10.5703125 C25.4817708,10.7786458 25.9231771,10.9427083 26.3945312,11.0625 C26.8658854,11.1822917 27.3203125,11.2421875 27.7578125,11.2421875 C28.4348958,11.2421875 28.9557292,11.1341146 29.3203125,10.9179688 C29.6848958,10.7018229 29.8671875,10.3723958 29.8671875,9.9296875 C29.8671875,9.59635417 29.7226562,9.31119792 29.4335938,9.07421875 C29.1445312,8.83723958 28.5807292,8.55729167 27.7421875,8.234375 C26.9453125,7.9375 26.3789062,7.67838542 26.0429688,7.45703125 C25.7070312,7.23567708 25.4570312,6.984375 25.2929688,6.703125 C25.1289062,6.421875 25.046875,6.0859375 25.046875,5.6953125 C25.046875,4.99739583 25.3307292,4.44661458 25.8984375,4.04296875 C26.4661458,3.63932292 27.2447917,3.4375 28.234375,3.4375 C29.15625,3.4375 30.0572917,3.625 30.9375,4 L30.4765625,5.0546875 C29.6171875,4.70052083 28.8385417,4.5234375 28.140625,4.5234375 C27.5260417,4.5234375 27.0625,4.61979167 26.75,4.8125 C26.4375,5.00520833 26.28125,5.27083333 26.28125,5.609375 C26.28125,5.83854167 26.3398438,6.03385417 26.4570312,6.1953125 C26.5742188,6.35677083 26.7630208,6.51041667 27.0234375,6.65625 C27.2838542,6.80208333 27.7838542,7.01302083 28.5234375,7.2890625 C29.5390625,7.65885417 30.2252604,8.03125 30.5820312,8.40625 C30.9388021,8.78125 31.1171875,9.25260417 31.1171875,9.8203125 Z" id="Path"></path>
                    <path d="M37.2109375,12.3125 C36.6536458,12.3125 36.1445312,12.2096354 35.6835938,12.0039062 C35.2226562,11.7981771 34.8359375,11.4817708 34.5234375,11.0546875 L34.4296875,11.0546875 C34.4921875,11.5546875 34.5234375,12.0286458 34.5234375,12.4765625 L34.5234375,16 L33.2265625,16 L33.2265625,3.59375 L34.28125,3.59375 L34.4609375,4.765625 L34.5234375,4.765625 C34.8567708,4.296875 35.2447917,3.95833333 35.6875,3.75 C36.1302083,3.54166667 36.6380208,3.4375 37.2109375,3.4375 C38.3463542,3.4375 39.2226562,3.82552083 39.8398438,4.6015625 C40.4570312,5.37760417 40.765625,6.46614583 40.765625,7.8671875 C40.765625,9.2734375 40.4518229,10.3658854 39.8242188,11.1445312 C39.1966146,11.9231771 38.3255208,12.3125 37.2109375,12.3125 Z M37.0234375,4.5390625 C36.1484375,4.5390625 35.515625,4.78125 35.125,5.265625 C34.734375,5.75 34.5338542,6.52083333 34.5234375,7.578125 L34.5234375,7.8671875 C34.5234375,9.0703125 34.7239583,9.93098958 35.125,10.4492188 C35.5260417,10.9674479 36.1692708,11.2265625 37.0546875,11.2265625 C37.7942708,11.2265625 38.3736979,10.9270833 38.7929688,10.328125 C39.2122396,9.72916667 39.421875,8.90364583 39.421875,7.8515625 C39.421875,6.78385417 39.2122396,5.96484375 38.7929688,5.39453125 C38.3736979,4.82421875 37.7838542,4.5390625 37.0234375,4.5390625 Z" id="Shape"></path>
                    <path d="M48.296875,12.15625 L48.0390625,10.9375 L47.9765625,10.9375 C47.5494792,11.4739583 47.1236979,11.8372396 46.6992188,12.0273438 C46.2747396,12.2174479 45.7447917,12.3125 45.109375,12.3125 C44.2604167,12.3125 43.5950521,12.09375 43.1132812,11.65625 C42.6315104,11.21875 42.390625,10.5963542 42.390625,9.7890625 C42.390625,8.05989583 43.7734375,7.15364583 46.5390625,7.0703125 L47.9921875,7.0234375 L47.9921875,6.4921875 C47.9921875,5.8203125 47.8476562,5.32421875 47.5585938,5.00390625 C47.2695312,4.68359375 46.8072917,4.5234375 46.171875,4.5234375 C45.4583333,4.5234375 44.6510417,4.7421875 43.75,5.1796875 L43.3515625,4.1875 C43.7734375,3.95833333 44.2356771,3.77864583 44.7382812,3.6484375 C45.2408854,3.51822917 45.7447917,3.453125 46.25,3.453125 C47.2708333,3.453125 48.0273438,3.6796875 48.5195312,4.1328125 C49.0117188,4.5859375 49.2578125,5.3125 49.2578125,6.3125 L49.2578125,12.15625 L48.296875,12.15625 Z M45.3671875,11.2421875 C46.1744792,11.2421875 46.8085938,11.0208333 47.2695312,10.578125 C47.7304688,10.1354167 47.9609375,9.515625 47.9609375,8.71875 L47.9609375,7.9453125 L46.6640625,8 C45.6328125,8.03645833 44.8893229,8.19661458 44.4335938,8.48046875 C43.9778646,8.76432292 43.75,9.20572917 43.75,9.8046875 C43.75,10.2734375 43.8919271,10.6302083 44.1757812,10.875 C44.4596354,11.1197917 44.8567708,11.2421875 45.3671875,11.2421875 Z" id="Shape"></path>
                    <polygon id="Path" points="53.2265625 12.15625 51.9296875 12.15625 51.9296875 0 53.2265625 0"></polygon>
                    <path d="M58.7421875,11.2421875 C58.9713542,11.2421875 59.1927083,11.2252604 59.40625,11.1914062 C59.6197917,11.1575521 59.7890625,11.1223958 59.9140625,11.0859375 L59.9140625,12.078125 C59.7734375,12.1458333 59.5664062,12.2018229 59.2929688,12.2460938 C59.0195312,12.2903646 58.7734375,12.3125 58.5546875,12.3125 C56.8984375,12.3125 56.0703125,11.4401042 56.0703125,9.6953125 L56.0703125,4.6015625 L54.84375,4.6015625 L54.84375,3.9765625 L56.0703125,3.4375 L56.6171875,1.609375 L57.3671875,1.609375 L57.3671875,3.59375 L59.8515625,3.59375 L59.8515625,4.6015625 L57.3671875,4.6015625 L57.3671875,9.640625 C57.3671875,10.15625 57.4895833,10.5520833 57.734375,10.828125 C57.9791667,11.1041667 58.3151042,11.2421875 58.7421875,11.2421875 Z" id="Path"></path>
                </g>
                <g id="Fyrspalt" transform="translate(525.570312, 280.843750)" fill="#FFFFFF" fill-rule="nonzero">
                    <polygon id="Path" points="1.328125 12.15625 0 12.15625 0 0.734375 6.3671875 0.734375 6.3671875 1.9140625 1.328125 1.9140625 1.328125 6.09375 6.0625 6.09375 6.0625 7.2734375 1.328125 7.2734375"></polygon>
                    <path d="M6.703125,3.59375 L8.09375,3.59375 L9.96875,8.4765625 C10.3802083,9.59114583 10.6354167,10.3958333 10.734375,10.890625 L10.796875,10.890625 C10.8645833,10.625 11.0065104,10.1705729 11.2226562,9.52734375 C11.4388021,8.88411458 12.1458333,6.90625 13.34375,3.59375 L14.734375,3.59375 L11.0546875,13.34375 C10.6901042,14.3072917 10.2643229,14.9908854 9.77734375,15.3945312 C9.29036458,15.7981771 8.69270833,16 7.984375,16 C7.58854167,16 7.19791667,15.9557292 6.8125,15.8671875 L6.8125,14.828125 C7.09895833,14.890625 7.41927083,14.921875 7.7734375,14.921875 C8.6640625,14.921875 9.29947917,14.421875 9.6796875,13.421875 L10.15625,12.203125 L6.703125,3.59375 Z" id="Path"></path>
                    <path d="M20.03125,3.4375 C20.4114583,3.4375 20.7526042,3.46875 21.0546875,3.53125 L20.875,4.734375 C20.5208333,4.65625 20.2083333,4.6171875 19.9375,4.6171875 C19.2447917,4.6171875 18.6523438,4.8984375 18.1601562,5.4609375 C17.6679688,6.0234375 17.421875,6.72395833 17.421875,7.5625 L17.421875,12.15625 L16.125,12.15625 L16.125,3.59375 L17.1953125,3.59375 L17.34375,5.1796875 L17.40625,5.1796875 C17.7239583,4.62239583 18.1067708,4.19270833 18.5546875,3.890625 C19.0026042,3.58854167 19.4947917,3.4375 20.03125,3.4375 Z" id="Path"></path>
                    <path d="M28.1796875,9.8203125 C28.1796875,10.6171875 27.8828125,11.2317708 27.2890625,11.6640625 C26.6953125,12.0963542 25.8619792,12.3125 24.7890625,12.3125 C23.6536458,12.3125 22.7682292,12.1328125 22.1328125,11.7734375 L22.1328125,10.5703125 C22.5442708,10.7786458 22.9856771,10.9427083 23.4570312,11.0625 C23.9283854,11.1822917 24.3828125,11.2421875 24.8203125,11.2421875 C25.4973958,11.2421875 26.0182292,11.1341146 26.3828125,10.9179688 C26.7473958,10.7018229 26.9296875,10.3723958 26.9296875,9.9296875 C26.9296875,9.59635417 26.7851562,9.31119792 26.4960938,9.07421875 C26.2070312,8.83723958 25.6432292,8.55729167 24.8046875,8.234375 C24.0078125,7.9375 23.4414062,7.67838542 23.1054688,7.45703125 C22.7695312,7.23567708 22.5195312,6.984375 22.3554688,6.703125 C22.1914062,6.421875 22.109375,6.0859375 22.109375,5.6953125 C22.109375,4.99739583 22.3932292,4.44661458 22.9609375,4.04296875 C23.5286458,3.63932292 24.3072917,3.4375 25.296875,3.4375 C26.21875,3.4375 27.1197917,3.625 28,4 L27.5390625,5.0546875 C26.6796875,4.70052083 25.9010417,4.5234375 25.203125,4.5234375 C24.5885417,4.5234375 24.125,4.61979167 23.8125,4.8125 C23.5,5.00520833 23.34375,5.27083333 23.34375,5.609375 C23.34375,5.83854167 23.4023438,6.03385417 23.5195312,6.1953125 C23.6367188,6.35677083 23.8255208,6.51041667 24.0859375,6.65625 C24.3463542,6.80208333 24.8463542,7.01302083 25.5859375,7.2890625 C26.6015625,7.65885417 27.2877604,8.03125 27.6445312,8.40625 C28.0013021,8.78125 28.1796875,9.25260417 28.1796875,9.8203125 Z" id="Path"></path>
                    <path d="M34.2734375,12.3125 C33.7161458,12.3125 33.2070312,12.2096354 32.7460938,12.0039062 C32.2851562,11.7981771 31.8984375,11.4817708 31.5859375,11.0546875 L31.4921875,11.0546875 C31.5546875,11.5546875 31.5859375,12.0286458 31.5859375,12.4765625 L31.5859375,16 L30.2890625,16 L30.2890625,3.59375 L31.34375,3.59375 L31.5234375,4.765625 L31.5859375,4.765625 C31.9192708,4.296875 32.3072917,3.95833333 32.75,3.75 C33.1927083,3.54166667 33.7005208,3.4375 34.2734375,3.4375 C35.4088542,3.4375 36.2851562,3.82552083 36.9023438,4.6015625 C37.5195312,5.37760417 37.828125,6.46614583 37.828125,7.8671875 C37.828125,9.2734375 37.5143229,10.3658854 36.8867188,11.1445312 C36.2591146,11.9231771 35.3880208,12.3125 34.2734375,12.3125 Z M34.0859375,4.5390625 C33.2109375,4.5390625 32.578125,4.78125 32.1875,5.265625 C31.796875,5.75 31.5963542,6.52083333 31.5859375,7.578125 L31.5859375,7.8671875 C31.5859375,9.0703125 31.7864583,9.93098958 32.1875,10.4492188 C32.5885417,10.9674479 33.2317708,11.2265625 34.1171875,11.2265625 C34.8567708,11.2265625 35.4361979,10.9270833 35.8554688,10.328125 C36.2747396,9.72916667 36.484375,8.90364583 36.484375,7.8515625 C36.484375,6.78385417 36.2747396,5.96484375 35.8554688,5.39453125 C35.4361979,4.82421875 34.8463542,4.5390625 34.0859375,4.5390625 Z" id="Shape"></path>
                    <path d="M45.359375,12.15625 L45.1015625,10.9375 L45.0390625,10.9375 C44.6119792,11.4739583 44.1861979,11.8372396 43.7617188,12.0273438 C43.3372396,12.2174479 42.8072917,12.3125 42.171875,12.3125 C41.3229167,12.3125 40.6575521,12.09375 40.1757812,11.65625 C39.6940104,11.21875 39.453125,10.5963542 39.453125,9.7890625 C39.453125,8.05989583 40.8359375,7.15364583 43.6015625,7.0703125 L45.0546875,7.0234375 L45.0546875,6.4921875 C45.0546875,5.8203125 44.9101562,5.32421875 44.6210938,5.00390625 C44.3320312,4.68359375 43.8697917,4.5234375 43.234375,4.5234375 C42.5208333,4.5234375 41.7135417,4.7421875 40.8125,5.1796875 L40.4140625,4.1875 C40.8359375,3.95833333 41.2981771,3.77864583 41.8007812,3.6484375 C42.3033854,3.51822917 42.8072917,3.453125 43.3125,3.453125 C44.3333333,3.453125 45.0898438,3.6796875 45.5820312,4.1328125 C46.0742188,4.5859375 46.3203125,5.3125 46.3203125,6.3125 L46.3203125,12.15625 L45.359375,12.15625 Z M42.4296875,11.2421875 C43.2369792,11.2421875 43.8710938,11.0208333 44.3320312,10.578125 C44.7929688,10.1354167 45.0234375,9.515625 45.0234375,8.71875 L45.0234375,7.9453125 L43.7265625,8 C42.6953125,8.03645833 41.9518229,8.19661458 41.4960938,8.48046875 C41.0403646,8.76432292 40.8125,9.20572917 40.8125,9.8046875 C40.8125,10.2734375 40.9544271,10.6302083 41.2382812,10.875 C41.5221354,11.1197917 41.9192708,11.2421875 42.4296875,11.2421875 Z" id="Shape"></path>
                    <polygon id="Path" points="50.2890625 12.15625 48.9921875 12.15625 48.9921875 0 50.2890625 0"></polygon>
                    <path d="M55.8046875,11.2421875 C56.0338542,11.2421875 56.2552083,11.2252604 56.46875,11.1914062 C56.6822917,11.1575521 56.8515625,11.1223958 56.9765625,11.0859375 L56.9765625,12.078125 C56.8359375,12.1458333 56.6289062,12.2018229 56.3554688,12.2460938 C56.0820312,12.2903646 55.8359375,12.3125 55.6171875,12.3125 C53.9609375,12.3125 53.1328125,11.4401042 53.1328125,9.6953125 L53.1328125,4.6015625 L51.90625,4.6015625 L51.90625,3.9765625 L53.1328125,3.4375 L53.6796875,1.609375 L54.4296875,1.609375 L54.4296875,3.59375 L56.9140625,3.59375 L56.9140625,4.6015625 L54.4296875,4.6015625 L54.4296875,9.640625 C54.4296875,10.15625 54.5520833,10.5520833 54.796875,10.828125 C55.0416667,11.1041667 55.3776042,11.2421875 55.8046875,11.2421875 Z" id="Path"></path>
                </g>
                <g id="Fyrspalt-Copy" transform="translate(371.570312, 280.843750)" fill="#FFFFFF" fill-rule="nonzero">
                    <polygon id="Path" points="1.328125 12.15625 0 12.15625 0 0.734375 6.3671875 0.734375 6.3671875 1.9140625 1.328125 1.9140625 1.328125 6.09375 6.0625 6.09375 6.0625 7.2734375 1.328125 7.2734375"></polygon>
                    <path d="M6.703125,3.59375 L8.09375,3.59375 L9.96875,8.4765625 C10.3802083,9.59114583 10.6354167,10.3958333 10.734375,10.890625 L10.796875,10.890625 C10.8645833,10.625 11.0065104,10.1705729 11.2226562,9.52734375 C11.4388021,8.88411458 12.1458333,6.90625 13.34375,3.59375 L14.734375,3.59375 L11.0546875,13.34375 C10.6901042,14.3072917 10.2643229,14.9908854 9.77734375,15.3945312 C9.29036458,15.7981771 8.69270833,16 7.984375,16 C7.58854167,16 7.19791667,15.9557292 6.8125,15.8671875 L6.8125,14.828125 C7.09895833,14.890625 7.41927083,14.921875 7.7734375,14.921875 C8.6640625,14.921875 9.29947917,14.421875 9.6796875,13.421875 L10.15625,12.203125 L6.703125,3.59375 Z" id="Path"></path>
                    <path d="M20.03125,3.4375 C20.4114583,3.4375 20.7526042,3.46875 21.0546875,3.53125 L20.875,4.734375 C20.5208333,4.65625 20.2083333,4.6171875 19.9375,4.6171875 C19.2447917,4.6171875 18.6523438,4.8984375 18.1601562,5.4609375 C17.6679688,6.0234375 17.421875,6.72395833 17.421875,7.5625 L17.421875,12.15625 L16.125,12.15625 L16.125,3.59375 L17.1953125,3.59375 L17.34375,5.1796875 L17.40625,5.1796875 C17.7239583,4.62239583 18.1067708,4.19270833 18.5546875,3.890625 C19.0026042,3.58854167 19.4947917,3.4375 20.03125,3.4375 Z" id="Path"></path>
                    <path d="M28.1796875,9.8203125 C28.1796875,10.6171875 27.8828125,11.2317708 27.2890625,11.6640625 C26.6953125,12.0963542 25.8619792,12.3125 24.7890625,12.3125 C23.6536458,12.3125 22.7682292,12.1328125 22.1328125,11.7734375 L22.1328125,10.5703125 C22.5442708,10.7786458 22.9856771,10.9427083 23.4570312,11.0625 C23.9283854,11.1822917 24.3828125,11.2421875 24.8203125,11.2421875 C25.4973958,11.2421875 26.0182292,11.1341146 26.3828125,10.9179688 C26.7473958,10.7018229 26.9296875,10.3723958 26.9296875,9.9296875 C26.9296875,9.59635417 26.7851562,9.31119792 26.4960938,9.07421875 C26.2070312,8.83723958 25.6432292,8.55729167 24.8046875,8.234375 C24.0078125,7.9375 23.4414062,7.67838542 23.1054688,7.45703125 C22.7695312,7.23567708 22.5195312,6.984375 22.3554688,6.703125 C22.1914062,6.421875 22.109375,6.0859375 22.109375,5.6953125 C22.109375,4.99739583 22.3932292,4.44661458 22.9609375,4.04296875 C23.5286458,3.63932292 24.3072917,3.4375 25.296875,3.4375 C26.21875,3.4375 27.1197917,3.625 28,4 L27.5390625,5.0546875 C26.6796875,4.70052083 25.9010417,4.5234375 25.203125,4.5234375 C24.5885417,4.5234375 24.125,4.61979167 23.8125,4.8125 C23.5,5.00520833 23.34375,5.27083333 23.34375,5.609375 C23.34375,5.83854167 23.4023438,6.03385417 23.5195312,6.1953125 C23.6367188,6.35677083 23.8255208,6.51041667 24.0859375,6.65625 C24.3463542,6.80208333 24.8463542,7.01302083 25.5859375,7.2890625 C26.6015625,7.65885417 27.2877604,8.03125 27.6445312,8.40625 C28.0013021,8.78125 28.1796875,9.25260417 28.1796875,9.8203125 Z" id="Path"></path>
                    <path d="M34.2734375,12.3125 C33.7161458,12.3125 33.2070312,12.2096354 32.7460938,12.0039062 C32.2851562,11.7981771 31.8984375,11.4817708 31.5859375,11.0546875 L31.4921875,11.0546875 C31.5546875,11.5546875 31.5859375,12.0286458 31.5859375,12.4765625 L31.5859375,16 L30.2890625,16 L30.2890625,3.59375 L31.34375,3.59375 L31.5234375,4.765625 L31.5859375,4.765625 C31.9192708,4.296875 32.3072917,3.95833333 32.75,3.75 C33.1927083,3.54166667 33.7005208,3.4375 34.2734375,3.4375 C35.4088542,3.4375 36.2851562,3.82552083 36.9023438,4.6015625 C37.5195312,5.37760417 37.828125,6.46614583 37.828125,7.8671875 C37.828125,9.2734375 37.5143229,10.3658854 36.8867188,11.1445312 C36.2591146,11.9231771 35.3880208,12.3125 34.2734375,12.3125 Z M34.0859375,4.5390625 C33.2109375,4.5390625 32.578125,4.78125 32.1875,5.265625 C31.796875,5.75 31.5963542,6.52083333 31.5859375,7.578125 L31.5859375,7.8671875 C31.5859375,9.0703125 31.7864583,9.93098958 32.1875,10.4492188 C32.5885417,10.9674479 33.2317708,11.2265625 34.1171875,11.2265625 C34.8567708,11.2265625 35.4361979,10.9270833 35.8554688,10.328125 C36.2747396,9.72916667 36.484375,8.90364583 36.484375,7.8515625 C36.484375,6.78385417 36.2747396,5.96484375 35.8554688,5.39453125 C35.4361979,4.82421875 34.8463542,4.5390625 34.0859375,4.5390625 Z" id="Shape"></path>
                    <path d="M45.359375,12.15625 L45.1015625,10.9375 L45.0390625,10.9375 C44.6119792,11.4739583 44.1861979,11.8372396 43.7617188,12.0273438 C43.3372396,12.2174479 42.8072917,12.3125 42.171875,12.3125 C41.3229167,12.3125 40.6575521,12.09375 40.1757812,11.65625 C39.6940104,11.21875 39.453125,10.5963542 39.453125,9.7890625 C39.453125,8.05989583 40.8359375,7.15364583 43.6015625,7.0703125 L45.0546875,7.0234375 L45.0546875,6.4921875 C45.0546875,5.8203125 44.9101562,5.32421875 44.6210938,5.00390625 C44.3320312,4.68359375 43.8697917,4.5234375 43.234375,4.5234375 C42.5208333,4.5234375 41.7135417,4.7421875 40.8125,5.1796875 L40.4140625,4.1875 C40.8359375,3.95833333 41.2981771,3.77864583 41.8007812,3.6484375 C42.3033854,3.51822917 42.8072917,3.453125 43.3125,3.453125 C44.3333333,3.453125 45.0898438,3.6796875 45.5820312,4.1328125 C46.0742188,4.5859375 46.3203125,5.3125 46.3203125,6.3125 L46.3203125,12.15625 L45.359375,12.15625 Z M42.4296875,11.2421875 C43.2369792,11.2421875 43.8710938,11.0208333 44.3320312,10.578125 C44.7929688,10.1354167 45.0234375,9.515625 45.0234375,8.71875 L45.0234375,7.9453125 L43.7265625,8 C42.6953125,8.03645833 41.9518229,8.19661458 41.4960938,8.48046875 C41.0403646,8.76432292 40.8125,9.20572917 40.8125,9.8046875 C40.8125,10.2734375 40.9544271,10.6302083 41.2382812,10.875 C41.5221354,11.1197917 41.9192708,11.2421875 42.4296875,11.2421875 Z" id="Shape"></path>
                    <polygon id="Path" points="50.2890625 12.15625 48.9921875 12.15625 48.9921875 0 50.2890625 0"></polygon>
                    <path d="M55.8046875,11.2421875 C56.0338542,11.2421875 56.2552083,11.2252604 56.46875,11.1914062 C56.6822917,11.1575521 56.8515625,11.1223958 56.9765625,11.0859375 L56.9765625,12.078125 C56.8359375,12.1458333 56.6289062,12.2018229 56.3554688,12.2460938 C56.0820312,12.2903646 55.8359375,12.3125 55.6171875,12.3125 C53.9609375,12.3125 53.1328125,11.4401042 53.1328125,9.6953125 L53.1328125,4.6015625 L51.90625,4.6015625 L51.90625,3.9765625 L53.1328125,3.4375 L53.6796875,1.609375 L54.4296875,1.609375 L54.4296875,3.59375 L56.9140625,3.59375 L56.9140625,4.6015625 L54.4296875,4.6015625 L54.4296875,9.640625 C54.4296875,10.15625 54.5520833,10.5520833 54.796875,10.828125 C55.0416667,11.1041667 55.3776042,11.2421875 55.8046875,11.2421875 Z" id="Path"></path>
                </g>
                <g id="Fyrspalt-Copy-2" transform="translate(202.570312, 280.843750)" fill="#FFFFFF" fill-rule="nonzero">
                    <polygon id="Path" points="1.328125 12.15625 0 12.15625 0 0.734375 6.3671875 0.734375 6.3671875 1.9140625 1.328125 1.9140625 1.328125 6.09375 6.0625 6.09375 6.0625 7.2734375 1.328125 7.2734375"></polygon>
                    <path d="M6.703125,3.59375 L8.09375,3.59375 L9.96875,8.4765625 C10.3802083,9.59114583 10.6354167,10.3958333 10.734375,10.890625 L10.796875,10.890625 C10.8645833,10.625 11.0065104,10.1705729 11.2226562,9.52734375 C11.4388021,8.88411458 12.1458333,6.90625 13.34375,3.59375 L14.734375,3.59375 L11.0546875,13.34375 C10.6901042,14.3072917 10.2643229,14.9908854 9.77734375,15.3945312 C9.29036458,15.7981771 8.69270833,16 7.984375,16 C7.58854167,16 7.19791667,15.9557292 6.8125,15.8671875 L6.8125,14.828125 C7.09895833,14.890625 7.41927083,14.921875 7.7734375,14.921875 C8.6640625,14.921875 9.29947917,14.421875 9.6796875,13.421875 L10.15625,12.203125 L6.703125,3.59375 Z" id="Path"></path>
                    <path d="M20.03125,3.4375 C20.4114583,3.4375 20.7526042,3.46875 21.0546875,3.53125 L20.875,4.734375 C20.5208333,4.65625 20.2083333,4.6171875 19.9375,4.6171875 C19.2447917,4.6171875 18.6523438,4.8984375 18.1601562,5.4609375 C17.6679688,6.0234375 17.421875,6.72395833 17.421875,7.5625 L17.421875,12.15625 L16.125,12.15625 L16.125,3.59375 L17.1953125,3.59375 L17.34375,5.1796875 L17.40625,5.1796875 C17.7239583,4.62239583 18.1067708,4.19270833 18.5546875,3.890625 C19.0026042,3.58854167 19.4947917,3.4375 20.03125,3.4375 Z" id="Path"></path>
                    <path d="M28.1796875,9.8203125 C28.1796875,10.6171875 27.8828125,11.2317708 27.2890625,11.6640625 C26.6953125,12.0963542 25.8619792,12.3125 24.7890625,12.3125 C23.6536458,12.3125 22.7682292,12.1328125 22.1328125,11.7734375 L22.1328125,10.5703125 C22.5442708,10.7786458 22.9856771,10.9427083 23.4570312,11.0625 C23.9283854,11.1822917 24.3828125,11.2421875 24.8203125,11.2421875 C25.4973958,11.2421875 26.0182292,11.1341146 26.3828125,10.9179688 C26.7473958,10.7018229 26.9296875,10.3723958 26.9296875,9.9296875 C26.9296875,9.59635417 26.7851562,9.31119792 26.4960938,9.07421875 C26.2070312,8.83723958 25.6432292,8.55729167 24.8046875,8.234375 C24.0078125,7.9375 23.4414062,7.67838542 23.1054688,7.45703125 C22.7695312,7.23567708 22.5195312,6.984375 22.3554688,6.703125 C22.1914062,6.421875 22.109375,6.0859375 22.109375,5.6953125 C22.109375,4.99739583 22.3932292,4.44661458 22.9609375,4.04296875 C23.5286458,3.63932292 24.3072917,3.4375 25.296875,3.4375 C26.21875,3.4375 27.1197917,3.625 28,4 L27.5390625,5.0546875 C26.6796875,4.70052083 25.9010417,4.5234375 25.203125,4.5234375 C24.5885417,4.5234375 24.125,4.61979167 23.8125,4.8125 C23.5,5.00520833 23.34375,5.27083333 23.34375,5.609375 C23.34375,5.83854167 23.4023438,6.03385417 23.5195312,6.1953125 C23.6367188,6.35677083 23.8255208,6.51041667 24.0859375,6.65625 C24.3463542,6.80208333 24.8463542,7.01302083 25.5859375,7.2890625 C26.6015625,7.65885417 27.2877604,8.03125 27.6445312,8.40625 C28.0013021,8.78125 28.1796875,9.25260417 28.1796875,9.8203125 Z" id="Path"></path>
                    <path d="M34.2734375,12.3125 C33.7161458,12.3125 33.2070312,12.2096354 32.7460938,12.0039062 C32.2851562,11.7981771 31.8984375,11.4817708 31.5859375,11.0546875 L31.4921875,11.0546875 C31.5546875,11.5546875 31.5859375,12.0286458 31.5859375,12.4765625 L31.5859375,16 L30.2890625,16 L30.2890625,3.59375 L31.34375,3.59375 L31.5234375,4.765625 L31.5859375,4.765625 C31.9192708,4.296875 32.3072917,3.95833333 32.75,3.75 C33.1927083,3.54166667 33.7005208,3.4375 34.2734375,3.4375 C35.4088542,3.4375 36.2851562,3.82552083 36.9023438,4.6015625 C37.5195312,5.37760417 37.828125,6.46614583 37.828125,7.8671875 C37.828125,9.2734375 37.5143229,10.3658854 36.8867188,11.1445312 C36.2591146,11.9231771 35.3880208,12.3125 34.2734375,12.3125 Z M34.0859375,4.5390625 C33.2109375,4.5390625 32.578125,4.78125 32.1875,5.265625 C31.796875,5.75 31.5963542,6.52083333 31.5859375,7.578125 L31.5859375,7.8671875 C31.5859375,9.0703125 31.7864583,9.93098958 32.1875,10.4492188 C32.5885417,10.9674479 33.2317708,11.2265625 34.1171875,11.2265625 C34.8567708,11.2265625 35.4361979,10.9270833 35.8554688,10.328125 C36.2747396,9.72916667 36.484375,8.90364583 36.484375,7.8515625 C36.484375,6.78385417 36.2747396,5.96484375 35.8554688,5.39453125 C35.4361979,4.82421875 34.8463542,4.5390625 34.0859375,4.5390625 Z" id="Shape"></path>
                    <path d="M45.359375,12.15625 L45.1015625,10.9375 L45.0390625,10.9375 C44.6119792,11.4739583 44.1861979,11.8372396 43.7617188,12.0273438 C43.3372396,12.2174479 42.8072917,12.3125 42.171875,12.3125 C41.3229167,12.3125 40.6575521,12.09375 40.1757812,11.65625 C39.6940104,11.21875 39.453125,10.5963542 39.453125,9.7890625 C39.453125,8.05989583 40.8359375,7.15364583 43.6015625,7.0703125 L45.0546875,7.0234375 L45.0546875,6.4921875 C45.0546875,5.8203125 44.9101562,5.32421875 44.6210938,5.00390625 C44.3320312,4.68359375 43.8697917,4.5234375 43.234375,4.5234375 C42.5208333,4.5234375 41.7135417,4.7421875 40.8125,5.1796875 L40.4140625,4.1875 C40.8359375,3.95833333 41.2981771,3.77864583 41.8007812,3.6484375 C42.3033854,3.51822917 42.8072917,3.453125 43.3125,3.453125 C44.3333333,3.453125 45.0898438,3.6796875 45.5820312,4.1328125 C46.0742188,4.5859375 46.3203125,5.3125 46.3203125,6.3125 L46.3203125,12.15625 L45.359375,12.15625 Z M42.4296875,11.2421875 C43.2369792,11.2421875 43.8710938,11.0208333 44.3320312,10.578125 C44.7929688,10.1354167 45.0234375,9.515625 45.0234375,8.71875 L45.0234375,7.9453125 L43.7265625,8 C42.6953125,8.03645833 41.9518229,8.19661458 41.4960938,8.48046875 C41.0403646,8.76432292 40.8125,9.20572917 40.8125,9.8046875 C40.8125,10.2734375 40.9544271,10.6302083 41.2382812,10.875 C41.5221354,11.1197917 41.9192708,11.2421875 42.4296875,11.2421875 Z" id="Shape"></path>
                    <polygon id="Path" points="50.2890625 12.15625 48.9921875 12.15625 48.9921875 0 50.2890625 0"></polygon>
                    <path d="M55.8046875,11.2421875 C56.0338542,11.2421875 56.2552083,11.2252604 56.46875,11.1914062 C56.6822917,11.1575521 56.8515625,11.1223958 56.9765625,11.0859375 L56.9765625,12.078125 C56.8359375,12.1458333 56.6289062,12.2018229 56.3554688,12.2460938 C56.0820312,12.2903646 55.8359375,12.3125 55.6171875,12.3125 C53.9609375,12.3125 53.1328125,11.4401042 53.1328125,9.6953125 L53.1328125,4.6015625 L51.90625,4.6015625 L51.90625,3.9765625 L53.1328125,3.4375 L53.6796875,1.609375 L54.4296875,1.609375 L54.4296875,3.59375 L56.9140625,3.59375 L56.9140625,4.6015625 L54.4296875,4.6015625 L54.4296875,9.640625 C54.4296875,10.15625 54.5520833,10.5520833 54.796875,10.828125 C55.0416667,11.1041667 55.3776042,11.2421875 55.8046875,11.2421875 Z" id="Path"></path>
                </g>
                <g id="Fyrspalt-Copy-3" transform="translate(42.570312, 280.843750)" fill="#FFFFFF" fill-rule="nonzero">
                    <polygon id="Path" points="1.328125 12.15625 0 12.15625 0 0.734375 6.3671875 0.734375 6.3671875 1.9140625 1.328125 1.9140625 1.328125 6.09375 6.0625 6.09375 6.0625 7.2734375 1.328125 7.2734375"></polygon>
                    <path d="M6.703125,3.59375 L8.09375,3.59375 L9.96875,8.4765625 C10.3802083,9.59114583 10.6354167,10.3958333 10.734375,10.890625 L10.796875,10.890625 C10.8645833,10.625 11.0065104,10.1705729 11.2226562,9.52734375 C11.4388021,8.88411458 12.1458333,6.90625 13.34375,3.59375 L14.734375,3.59375 L11.0546875,13.34375 C10.6901042,14.3072917 10.2643229,14.9908854 9.77734375,15.3945312 C9.29036458,15.7981771 8.69270833,16 7.984375,16 C7.58854167,16 7.19791667,15.9557292 6.8125,15.8671875 L6.8125,14.828125 C7.09895833,14.890625 7.41927083,14.921875 7.7734375,14.921875 C8.6640625,14.921875 9.29947917,14.421875 9.6796875,13.421875 L10.15625,12.203125 L6.703125,3.59375 Z" id="Path"></path>
                    <path d="M20.03125,3.4375 C20.4114583,3.4375 20.7526042,3.46875 21.0546875,3.53125 L20.875,4.734375 C20.5208333,4.65625 20.2083333,4.6171875 19.9375,4.6171875 C19.2447917,4.6171875 18.6523438,4.8984375 18.1601562,5.4609375 C17.6679688,6.0234375 17.421875,6.72395833 17.421875,7.5625 L17.421875,12.15625 L16.125,12.15625 L16.125,3.59375 L17.1953125,3.59375 L17.34375,5.1796875 L17.40625,5.1796875 C17.7239583,4.62239583 18.1067708,4.19270833 18.5546875,3.890625 C19.0026042,3.58854167 19.4947917,3.4375 20.03125,3.4375 Z" id="Path"></path>
                    <path d="M28.1796875,9.8203125 C28.1796875,10.6171875 27.8828125,11.2317708 27.2890625,11.6640625 C26.6953125,12.0963542 25.8619792,12.3125 24.7890625,12.3125 C23.6536458,12.3125 22.7682292,12.1328125 22.1328125,11.7734375 L22.1328125,10.5703125 C22.5442708,10.7786458 22.9856771,10.9427083 23.4570312,11.0625 C23.9283854,11.1822917 24.3828125,11.2421875 24.8203125,11.2421875 C25.4973958,11.2421875 26.0182292,11.1341146 26.3828125,10.9179688 C26.7473958,10.7018229 26.9296875,10.3723958 26.9296875,9.9296875 C26.9296875,9.59635417 26.7851562,9.31119792 26.4960938,9.07421875 C26.2070312,8.83723958 25.6432292,8.55729167 24.8046875,8.234375 C24.0078125,7.9375 23.4414062,7.67838542 23.1054688,7.45703125 C22.7695312,7.23567708 22.5195312,6.984375 22.3554688,6.703125 C22.1914062,6.421875 22.109375,6.0859375 22.109375,5.6953125 C22.109375,4.99739583 22.3932292,4.44661458 22.9609375,4.04296875 C23.5286458,3.63932292 24.3072917,3.4375 25.296875,3.4375 C26.21875,3.4375 27.1197917,3.625 28,4 L27.5390625,5.0546875 C26.6796875,4.70052083 25.9010417,4.5234375 25.203125,4.5234375 C24.5885417,4.5234375 24.125,4.61979167 23.8125,4.8125 C23.5,5.00520833 23.34375,5.27083333 23.34375,5.609375 C23.34375,5.83854167 23.4023438,6.03385417 23.5195312,6.1953125 C23.6367188,6.35677083 23.8255208,6.51041667 24.0859375,6.65625 C24.3463542,6.80208333 24.8463542,7.01302083 25.5859375,7.2890625 C26.6015625,7.65885417 27.2877604,8.03125 27.6445312,8.40625 C28.0013021,8.78125 28.1796875,9.25260417 28.1796875,9.8203125 Z" id="Path"></path>
                    <path d="M34.2734375,12.3125 C33.7161458,12.3125 33.2070312,12.2096354 32.7460938,12.0039062 C32.2851562,11.7981771 31.8984375,11.4817708 31.5859375,11.0546875 L31.4921875,11.0546875 C31.5546875,11.5546875 31.5859375,12.0286458 31.5859375,12.4765625 L31.5859375,16 L30.2890625,16 L30.2890625,3.59375 L31.34375,3.59375 L31.5234375,4.765625 L31.5859375,4.765625 C31.9192708,4.296875 32.3072917,3.95833333 32.75,3.75 C33.1927083,3.54166667 33.7005208,3.4375 34.2734375,3.4375 C35.4088542,3.4375 36.2851562,3.82552083 36.9023438,4.6015625 C37.5195312,5.37760417 37.828125,6.46614583 37.828125,7.8671875 C37.828125,9.2734375 37.5143229,10.3658854 36.8867188,11.1445312 C36.2591146,11.9231771 35.3880208,12.3125 34.2734375,12.3125 Z M34.0859375,4.5390625 C33.2109375,4.5390625 32.578125,4.78125 32.1875,5.265625 C31.796875,5.75 31.5963542,6.52083333 31.5859375,7.578125 L31.5859375,7.8671875 C31.5859375,9.0703125 31.7864583,9.93098958 32.1875,10.4492188 C32.5885417,10.9674479 33.2317708,11.2265625 34.1171875,11.2265625 C34.8567708,11.2265625 35.4361979,10.9270833 35.8554688,10.328125 C36.2747396,9.72916667 36.484375,8.90364583 36.484375,7.8515625 C36.484375,6.78385417 36.2747396,5.96484375 35.8554688,5.39453125 C35.4361979,4.82421875 34.8463542,4.5390625 34.0859375,4.5390625 Z" id="Shape"></path>
                    <path d="M45.359375,12.15625 L45.1015625,10.9375 L45.0390625,10.9375 C44.6119792,11.4739583 44.1861979,11.8372396 43.7617188,12.0273438 C43.3372396,12.2174479 42.8072917,12.3125 42.171875,12.3125 C41.3229167,12.3125 40.6575521,12.09375 40.1757812,11.65625 C39.6940104,11.21875 39.453125,10.5963542 39.453125,9.7890625 C39.453125,8.05989583 40.8359375,7.15364583 43.6015625,7.0703125 L45.0546875,7.0234375 L45.0546875,6.4921875 C45.0546875,5.8203125 44.9101562,5.32421875 44.6210938,5.00390625 C44.3320312,4.68359375 43.8697917,4.5234375 43.234375,4.5234375 C42.5208333,4.5234375 41.7135417,4.7421875 40.8125,5.1796875 L40.4140625,4.1875 C40.8359375,3.95833333 41.2981771,3.77864583 41.8007812,3.6484375 C42.3033854,3.51822917 42.8072917,3.453125 43.3125,3.453125 C44.3333333,3.453125 45.0898438,3.6796875 45.5820312,4.1328125 C46.0742188,4.5859375 46.3203125,5.3125 46.3203125,6.3125 L46.3203125,12.15625 L45.359375,12.15625 Z M42.4296875,11.2421875 C43.2369792,11.2421875 43.8710938,11.0208333 44.3320312,10.578125 C44.7929688,10.1354167 45.0234375,9.515625 45.0234375,8.71875 L45.0234375,7.9453125 L43.7265625,8 C42.6953125,8.03645833 41.9518229,8.19661458 41.4960938,8.48046875 C41.0403646,8.76432292 40.8125,9.20572917 40.8125,9.8046875 C40.8125,10.2734375 40.9544271,10.6302083 41.2382812,10.875 C41.5221354,11.1197917 41.9192708,11.2421875 42.4296875,11.2421875 Z" id="Shape"></path>
                    <polygon id="Path" points="50.2890625 12.15625 48.9921875 12.15625 48.9921875 0 50.2890625 0"></polygon>
                    <path d="M55.8046875,11.2421875 C56.0338542,11.2421875 56.2552083,11.2252604 56.46875,11.1914062 C56.6822917,11.1575521 56.8515625,11.1223958 56.9765625,11.0859375 L56.9765625,12.078125 C56.8359375,12.1458333 56.6289062,12.2018229 56.3554688,12.2460938 C56.0820312,12.2903646 55.8359375,12.3125 55.6171875,12.3125 C53.9609375,12.3125 53.1328125,11.4401042 53.1328125,9.6953125 L53.1328125,4.6015625 L51.90625,4.6015625 L51.90625,3.9765625 L53.1328125,3.4375 L53.6796875,1.609375 L54.4296875,1.609375 L54.4296875,3.59375 L56.9140625,3.59375 L56.9140625,4.6015625 L54.4296875,4.6015625 L54.4296875,9.640625 C54.4296875,10.15625 54.5520833,10.5520833 54.796875,10.828125 C55.0416667,11.1041667 55.3776042,11.2421875 55.8046875,11.2421875 Z" id="Path"></path>
                </g>
                <g id="Tvåspalt-Copy" transform="translate(435.140625, 108.960938)" fill="#FFFFFF" fill-rule="nonzero">
                    <polygon id="Path" points="4.9453125 13.0390625 3.6171875 13.0390625 3.6171875 2.796875 0 2.796875 0 1.6171875 8.5625 1.6171875 8.5625 2.796875 4.9453125 2.796875"></polygon>
                    <path d="M11.9609375,13.0390625 L8.7109375,4.4765625 L10.1015625,4.4765625 L11.9453125,9.5546875 C12.3619792,10.7421875 12.6067708,11.5130208 12.6796875,11.8671875 L12.7421875,11.8671875 C12.7994792,11.5911458 12.9804688,11.0195312 13.2851562,10.1523438 C13.5898438,9.28515625 14.2734375,7.39322917 15.3359375,4.4765625 L16.7265625,4.4765625 L13.4765625,13.0390625 L11.9609375,13.0390625 Z" id="Path"></path>
                    <path d="M23.3671875,13.0390625 L23.109375,11.8203125 L23.046875,11.8203125 C22.6197917,12.3567708 22.1940104,12.7200521 21.7695312,12.9101562 C21.3450521,13.1002604 20.8151042,13.1953125 20.1796875,13.1953125 C19.3307292,13.1953125 18.6653646,12.9765625 18.1835938,12.5390625 C17.7018229,12.1015625 17.4609375,11.4791667 17.4609375,10.671875 C17.4609375,8.94270833 18.84375,8.03645833 21.609375,7.953125 L23.0625,7.90625 L23.0625,7.375 C23.0625,6.703125 22.9179688,6.20703125 22.6289062,5.88671875 C22.3398438,5.56640625 21.8776042,5.40625 21.2421875,5.40625 C20.5286458,5.40625 19.7213542,5.625 18.8203125,6.0625 L18.421875,5.0703125 C18.84375,4.84114583 19.3059896,4.66145833 19.8085938,4.53125 C20.3111979,4.40104167 20.8151042,4.3359375 21.3203125,4.3359375 C22.3411458,4.3359375 23.0976562,4.5625 23.5898438,5.015625 C24.0820312,5.46875 24.328125,6.1953125 24.328125,7.1953125 L24.328125,13.0390625 L23.3671875,13.0390625 Z M20.4375,12.125 C21.2447917,12.125 21.8789062,11.9036458 22.3398438,11.4609375 C22.8007812,11.0182292 23.03125,10.3984375 23.03125,9.6015625 L23.03125,8.828125 L21.734375,8.8828125 C20.703125,8.91927083 19.9596354,9.07942708 19.5039062,9.36328125 C19.0481771,9.64713542 18.8203125,10.0885417 18.8203125,10.6875 C18.8203125,11.15625 18.9622396,11.5130208 19.2460938,11.7578125 C19.5299479,12.0026042 19.9270833,12.125 20.4375,12.125 Z M23.0078125,1.6484375 C23.0078125,2.15885417 22.8476562,2.56901042 22.5273438,2.87890625 C22.2070312,3.18880208 21.78125,3.34375 21.25,3.34375 C20.7239583,3.34375 20.3046875,3.19140625 19.9921875,2.88671875 C19.6796875,2.58203125 19.5234375,2.17447917 19.5234375,1.6640625 C19.5234375,1.15364583 19.6809896,0.748697917 19.9960938,0.44921875 C20.3111979,0.149739583 20.7291667,0 21.25,0 C21.7760417,0 22.2005208,0.154947917 22.5234375,0.46484375 C22.8463542,0.774739583 23.0078125,1.16927083 23.0078125,1.6484375 Z M22.1640625,1.6640625 C22.1640625,1.37239583 22.078125,1.14713542 21.90625,0.98828125 C21.734375,0.829427083 21.515625,0.75 21.25,0.75 C20.984375,0.75 20.765625,0.829427083 20.59375,0.98828125 C20.421875,1.14713542 20.3359375,1.37239583 20.3359375,1.6640625 C20.3359375,1.95572917 20.4140625,2.18098958 20.5703125,2.33984375 C20.7265625,2.49869792 20.953125,2.578125 21.25,2.578125 C21.5208333,2.578125 21.7408854,2.49869792 21.9101562,2.33984375 C22.0794271,2.18098958 22.1640625,1.95572917 22.1640625,1.6640625 Z" id="Shape"></path>
                    <path d="M32.5234375,10.703125 C32.5234375,11.5 32.2265625,12.1145833 31.6328125,12.546875 C31.0390625,12.9791667 30.2057292,13.1953125 29.1328125,13.1953125 C27.9973958,13.1953125 27.1119792,13.015625 26.4765625,12.65625 L26.4765625,11.453125 C26.8880208,11.6614583 27.3294271,11.8255208 27.8007812,11.9453125 C28.2721354,12.0651042 28.7265625,12.125 29.1640625,12.125 C29.8411458,12.125 30.3619792,12.0169271 30.7265625,11.8007812 C31.0911458,11.5846354 31.2734375,11.2552083 31.2734375,10.8125 C31.2734375,10.4791667 31.1289062,10.1940104 30.8398438,9.95703125 C30.5507812,9.72005208 29.9869792,9.44010417 29.1484375,9.1171875 C28.3515625,8.8203125 27.7851562,8.56119792 27.4492188,8.33984375 C27.1132812,8.11848958 26.8632812,7.8671875 26.6992188,7.5859375 C26.5351562,7.3046875 26.453125,6.96875 26.453125,6.578125 C26.453125,5.88020833 26.7369792,5.32942708 27.3046875,4.92578125 C27.8723958,4.52213542 28.6510417,4.3203125 29.640625,4.3203125 C30.5625,4.3203125 31.4635417,4.5078125 32.34375,4.8828125 L31.8828125,5.9375 C31.0234375,5.58333333 30.2447917,5.40625 29.546875,5.40625 C28.9322917,5.40625 28.46875,5.50260417 28.15625,5.6953125 C27.84375,5.88802083 27.6875,6.15364583 27.6875,6.4921875 C27.6875,6.72135417 27.7460938,6.91666667 27.8632812,7.078125 C27.9804688,7.23958333 28.1692708,7.39322917 28.4296875,7.5390625 C28.6901042,7.68489583 29.1901042,7.89583333 29.9296875,8.171875 C30.9453125,8.54166667 31.6315104,8.9140625 31.9882812,9.2890625 C32.3450521,9.6640625 32.5234375,10.1354167 32.5234375,10.703125 Z" id="Path"></path>
                    <path d="M38.6171875,13.1953125 C38.0598958,13.1953125 37.5507812,13.0924479 37.0898438,12.8867188 C36.6289062,12.6809896 36.2421875,12.3645833 35.9296875,11.9375 L35.8359375,11.9375 C35.8984375,12.4375 35.9296875,12.9114583 35.9296875,13.359375 L35.9296875,16.8828125 L34.6328125,16.8828125 L34.6328125,4.4765625 L35.6875,4.4765625 L35.8671875,5.6484375 L35.9296875,5.6484375 C36.2630208,5.1796875 36.6510417,4.84114583 37.09375,4.6328125 C37.5364583,4.42447917 38.0442708,4.3203125 38.6171875,4.3203125 C39.7526042,4.3203125 40.6289062,4.70833333 41.2460938,5.484375 C41.8632812,6.26041667 42.171875,7.34895833 42.171875,8.75 C42.171875,10.15625 41.8580729,11.2486979 41.2304688,12.0273438 C40.6028646,12.8059896 39.7317708,13.1953125 38.6171875,13.1953125 Z M38.4296875,5.421875 C37.5546875,5.421875 36.921875,5.6640625 36.53125,6.1484375 C36.140625,6.6328125 35.9401042,7.40364583 35.9296875,8.4609375 L35.9296875,8.75 C35.9296875,9.953125 36.1302083,10.8138021 36.53125,11.3320312 C36.9322917,11.8502604 37.5755208,12.109375 38.4609375,12.109375 C39.2005208,12.109375 39.7799479,11.8098958 40.1992188,11.2109375 C40.6184896,10.6119792 40.828125,9.78645833 40.828125,8.734375 C40.828125,7.66666667 40.6184896,6.84765625 40.1992188,6.27734375 C39.7799479,5.70703125 39.1901042,5.421875 38.4296875,5.421875 Z" id="Shape"></path>
                    <path d="M49.703125,13.0390625 L49.4453125,11.8203125 L49.3828125,11.8203125 C48.9557292,12.3567708 48.5299479,12.7200521 48.1054688,12.9101562 C47.6809896,13.1002604 47.1510417,13.1953125 46.515625,13.1953125 C45.6666667,13.1953125 45.0013021,12.9765625 44.5195312,12.5390625 C44.0377604,12.1015625 43.796875,11.4791667 43.796875,10.671875 C43.796875,8.94270833 45.1796875,8.03645833 47.9453125,7.953125 L49.3984375,7.90625 L49.3984375,7.375 C49.3984375,6.703125 49.2539062,6.20703125 48.9648438,5.88671875 C48.6757812,5.56640625 48.2135417,5.40625 47.578125,5.40625 C46.8645833,5.40625 46.0572917,5.625 45.15625,6.0625 L44.7578125,5.0703125 C45.1796875,4.84114583 45.6419271,4.66145833 46.1445312,4.53125 C46.6471354,4.40104167 47.1510417,4.3359375 47.65625,4.3359375 C48.6770833,4.3359375 49.4335938,4.5625 49.9257812,5.015625 C50.4179688,5.46875 50.6640625,6.1953125 50.6640625,7.1953125 L50.6640625,13.0390625 L49.703125,13.0390625 Z M46.7734375,12.125 C47.5807292,12.125 48.2148438,11.9036458 48.6757812,11.4609375 C49.1367188,11.0182292 49.3671875,10.3984375 49.3671875,9.6015625 L49.3671875,8.828125 L48.0703125,8.8828125 C47.0390625,8.91927083 46.2955729,9.07942708 45.8398438,9.36328125 C45.3841146,9.64713542 45.15625,10.0885417 45.15625,10.6875 C45.15625,11.15625 45.2981771,11.5130208 45.5820312,11.7578125 C45.8658854,12.0026042 46.2630208,12.125 46.7734375,12.125 Z" id="Shape"></path>
                    <polygon id="Path" points="54.6328125 13.0390625 53.3359375 13.0390625 53.3359375 0.8828125 54.6328125 0.8828125"></polygon>
                    <path d="M60.1484375,12.125 C60.3776042,12.125 60.5989583,12.1080729 60.8125,12.0742188 C61.0260417,12.0403646 61.1953125,12.0052083 61.3203125,11.96875 L61.3203125,12.9609375 C61.1796875,13.0286458 60.9726562,13.0846354 60.6992188,13.1289062 C60.4257812,13.1731771 60.1796875,13.1953125 59.9609375,13.1953125 C58.3046875,13.1953125 57.4765625,12.3229167 57.4765625,10.578125 L57.4765625,5.484375 L56.25,5.484375 L56.25,4.859375 L57.4765625,4.3203125 L58.0234375,2.4921875 L58.7734375,2.4921875 L58.7734375,4.4765625 L61.2578125,4.4765625 L61.2578125,5.484375 L58.7734375,5.484375 L58.7734375,10.5234375 C58.7734375,11.0390625 58.8958333,11.4348958 59.140625,11.7109375 C59.3854167,11.9869792 59.7213542,12.125 60.1484375,12.125 Z" id="Path"></path>
                </g>
            </g>
        </g>
    </g>
</svg>