{
	"name": "skolverket",
	"$schema": "../../../node_modules/nx/schemas/project-schema.json",
	"projectType": "library",
	"generators": {
		"@nxext/stencil:component": {
			"style": "scss",
			"storybook": true
		}
	},
	"sourceRoot": "libs/skolverket/package/src",
	"targets": {
		"prepare": {
			"executor": "nx:run-commands",
			"options": {
				"commands": [
					"node prepare-components -- package-name=skolverket",
					"node component-tokens-prepare -- package-name=skolverket",
					"node css-variables-props-generator -- package-name=skolverket"
				],
				"cwd": "libs/shared/build",
				"parallel": false
			},
			"configurations": {
				"production": {}
			},
			"defaultConfiguration": "production"
		},
    "prepare-docs": {
			"executor": "nx:run-commands",
			"options": {
				"commands": [
					"npx stencil build --config .config/stencil.config.docs.ts"
				],
				"cwd": "libs/skolverket/package",
				"parallel": false
			},
			"configurations": {
				"production": {}
			},
			"defaultConfiguration": "production"
		},
		"test": {
			"executor": "@nxext/stencil:test",
			"options": {
				"projectType": "library",
				"configPath": "libs/skolverket/package/.config/stencil.config.prod.ts"
			}
		},
		"e2e": {
			"executor": "@nxext/stencil:e2e",
			"options": {
				"projectType": "library",
				"configPath": "libs/skolverket/package/.config/stencil.config.prod.ts"
			}
		},
		"build": {
			"executor": "@nxext/stencil:build",
			"options": {
				"projectType": "library",
				"configPath": "libs/skolverket/package/.config/stencil.config.prod.ts",
				"outputPath": "dist/libs/skolverket/",
				"parallel": false,
				"nxBail": true
			},
			"configurations": {
				"production": {
					"configPath": "libs/skolverket/package/.config/stencil.config.prod.ts"
				}
			},
			"defaultConfiguration": "production",
			"dependsOn": [
				{
					"target": "prepare"
				},
        {
					"target": "prepare-docs"
				}, 
        {
					"target": "build",
					"dependencies": true
				}
			]
		},
		"serve": {
			"executor": "@nxext/stencil:serve",
			"options": {
				"projectType": "library",
				"configPath": "libs/skolverket/package/.config/stencil.config.dev.ts",
				"outputPath": "dist/libs/skolverket",
				"serve": true,
				"watch": true
			},
			"dependsOn": [
				{
					"target": "prepare"
				},
				{
					"target": "prepare-docs"
				}
			]
		},
		"storybook": {
			"executor": "@nx/storybook:storybook",
			"options": {
				"port": 4403,
				"projectBuildConfig": "core:build:storybook",
				"configDir": "libs/skolverket/package/.storybook"
			},
			"configurations": {
				"ci": {
					"quiet": true
				}
			}
		},
		"build-storybook": {
			"executor": "@nx/storybook:build",
			"outputs": ["{options.outputDir}"],
			"options": {
				"configDir": "libs/skolverket/package/.storybook",
				"outputDir": "dist/storybook/skolverket"
			},
			"configurations": {
				"ci": {
					"quiet": true
				}
			},
			"dependsOn": [
				{
					"target": "build"
				}
			]
		},
		"generate-component": {
			"executor": "nx:run-commands",
			"options": {
				"commands": [
					"nx g @nxext/stencil:component --project='skolverket' --directory='_{args.category}' {args.name}"
				],
				"cwd": "libs/skolverket/package",
				"parallel": false
			}
		},
		"publish": {
			"executor": "nx:run-commands",
			"options": {
				"commands": ["npm publish"],
				"cwd": "dist/libs/skolverket",
				"parallel": false
			}
		}
	},
	"tags": [],
	"implicitDependencies": [
    "skolverket-design-tokens"
  ]
}
