{
	"border-radius": {
		"primary": {
			"value": "{global.border-radius.smallest-3.value}",
			"name": "",
			"comment": ""
		},
		"secondary": {
			"value": "{global.border-radius.base.value}",
			"name": "",
			"comment": ""
		},
		"tertiary": {
			"value": "{global.border-radius.smaller.value}",
			"name": "",
			"comment": ""
		},
		"complementary-1": {
			"value": "{global.border-radius.largest.value}",
			"name": "",
			"comment": ""
		},
		"complementary-2": {
			"value": "{global.border-radius.largest-2.value}",
			"name": "",
			"comment": ""
		},
		"button": {
			"value": "{global.border-radius.base.value}",
			"name": "",
			"comment": ""
		},
		"input": {
			"value": "{global.border-radius.smallest-3.value}",
			"name": "",
			"comment": ""
		},
    "input-search": {
      "value": "{global.border-radius.base.value}",
			"name": "",
			"comment": ""
    }
	},
	"border-width": {
		"primary": {
			"value": "{global.border-width.small.value}",
			"name": "",
			"comment": ""
		},
		"secondary": {
			"value": "{global.border-width.base.value}",
			"name": "",
			"comment": ""
		},
		"tertiary": {
			"value": "{global.border-width.smaller.value}",
			"name": "",
			"comment": ""
		},
		"complementary-1": {
			"value": "{global.border-width.largest.value}",
			"name": "",
			"comment": ""
		},
		"complementary-2": {
			"value": "{global.border-width.largest-2.value}",
			"name": "",
			"comment": ""
		},
		"input-regular": {
			"value": "{global.border-width.small.value}",
			"name": "",
			"comment": ""
		},
		"input-validation": {
			"value": "{global.border-width.base.value}",
			"name": "",
			"comment": ""
		},
		"button": {
			"value": "{global.border-width.small.value}",
			"name": "",
			"comment": ""
		}
	},
	"border-style": {
		"primary": {
			"value": "{global.border-style.solid.value}",
			"name": "",
			"comment": ""
		},
		"secondary": {
			"value": "{global.border-style.none.value}",
			"name": "",
			"comment": ""
		},
		"complementary": {
			"value": "{global.border-style.dashed.value}",
			"name": "",
			"comment": ""
		}
	}
}
