<?xml version="1.0" encoding="UTF-8"?>
<svg width="175px" height="366px" viewBox="0 0 175 366" version="1.1" xmlns="http://www.w3.org/2000/svg" xmlns:xlink="http://www.w3.org/1999/xlink">
    <title>Group 18Ikoner</title>
    <defs>
        <polygon id="path-1" points="1.57268946e-15 0 59.3554823 0 59.3554823 56.8103606 1.57268946e-15 56.8103606"></polygon>
    </defs>
    <g id="Page-1" stroke="none" stroke-width="1" fill="none" fill-rule="evenodd">
        <g id="Group-18">
            <path d="M68.7224627,142.7925 L115.078463,142.9955 C120.709463,143.0335 125.348463,138.5645 125.386463,132.9335 L125.386463,132.9335 C125.424463,127.3015 120.848463,122.6635 115.217463,122.6245 L68.6224627,122.4215 L68.6224627,115.2215 L118.782463,115.5625 C128.237463,115.6265 135.920463,123.4145 135.855872,132.8695 L135.855872,132.8695 C135.791463,142.3235 128.003463,150.0065 118.549463,149.9425 L68.3894627,149.6015 C58.9344627,149.5375 51.1464627,157.2205 51.0820658,166.6755 L51.0820658,166.6755 C51.0184627,176.1295 58.7014627,183.9175 68.1554627,183.9815 L118.315463,184.3225 L118.315463,166.9125 L68.5604627,166.6755 C61.9924627,166.6315 56.6554627,161.2215 56.6994627,154.6535 L56.6994627,154.6535 C56.7444627,148.0855 62.1544627,142.7475 68.7224627,142.7925" id="Fill-1" fill="#78B842"></path>
            <path d="M28.1560627,81.2392 C28.1560627,85.7372 24.5100627,89.3832 20.0120627,89.3832 C15.5150627,89.3832 11.8680627,85.7372 11.8680627,81.2392 C11.8680627,76.7412 15.5150627,73.0952 20.0120627,73.0952 C24.5100627,73.0952 28.1560627,76.7412 28.1560627,81.2392" id="Fill-3" fill="#95C23F"></path>
            <g id="Group-7" transform="translate(-0, 0)">
                <mask id="mask-2" fill="white">
                    <use xlink:href="#path-1"></use>
                </mask>
                <g id="Clip-6"></g>
                <path d="M26.4932627,1.9761 L19.2482627,16.6651 L3.03926272,19.0281 C0.133262724,19.4501 -1.03173728,23.0331 1.07626272,25.0861 L12.8022627,36.5131 L10.0292627,52.6551 C9.53026272,55.5731 12.6032627,57.7591 15.1772627,56.3941 L29.6772627,48.7721 L44.1782627,56.3941 C46.7512627,57.7481 49.8252627,55.5731 49.3252627,52.6551 L46.5522627,36.5131 L58.2792627,25.0861 C60.3872627,23.0331 59.2222627,19.4501 56.3152627,19.0281 L40.1062627,16.6651 L32.8612627,1.9761 C31.5632627,-0.6419 27.8022627,-0.6759 26.4932627,1.9761 Z" id="Fill-5" fill="#78B842" mask="url(#mask-2)"></path>
            </g>
            <path d="M81.6233627,46.0764 L77.6403627,54.1524 L68.7283627,55.4524 C67.1303627,55.6834 66.4893627,57.6544 67.6483627,58.7824 L74.0963627,65.0654 L72.5713627,73.9404 C72.2963627,75.5454 73.9863627,76.7464 75.4013627,75.9964 L83.3743627,71.8054 L91.3463627,75.9964 C92.7613627,76.7404 94.4513627,75.5454 94.1773627,73.9404 L92.6523627,65.0654 L99.0993627,58.7824 C100.258363,57.6544 99.6183627,55.6834 98.0203627,55.4524 L89.1083627,54.1524 L85.1243627,46.0764 C84.4113627,44.6364 82.3433627,44.6184 81.6233627,46.0764" id="Fill-8" fill="#95C23F"></path>
            <path d="M37.7763627,236.4156 L37.7763627,218.1686 C37.7763627,213.7646 41.3793627,210.1616 45.7843627,210.1616 L143.865363,210.1616 C148.270363,210.1616 151.873363,213.7646 151.873363,218.1686 L151.873363,329.0226 C151.873363,348.5016 135.936363,364.4386 116.457363,364.4386 L73.1923627,364.4386 C53.7133627,364.4386 37.7763627,348.5016 37.7763627,329.0226 L37.7763627,262.6086" id="Fill-10" fill="#95C23F"></path>
            <path d="M106.592763,365.996 L63.3277627,365.996 C42.9407627,365.996 26.3537627,349.41 26.3537627,329.023 L26.3537627,262.609 C26.3537627,261.748 27.0517627,261.051 27.9117627,261.051 C28.7717627,261.051 29.4697627,261.748 29.4697627,262.609 L29.4697627,329.023 C29.4697627,347.692 44.6577627,362.881 63.3277627,362.881 L106.592763,362.881 C125.261763,362.881 140.451763,347.692 140.451763,329.023 L140.451763,218.169 C140.451763,214.613 137.557763,211.719 134.000763,211.719 L35.9197627,211.719 C32.3627627,211.719 29.4697627,214.613 29.4697627,218.169 L29.4697627,236.416 C29.4697627,237.276 28.7717627,237.973 27.9117627,237.973 C27.0517627,237.973 26.3537627,237.276 26.3537627,236.416 L26.3537627,218.169 C26.3537627,212.895 30.6447627,208.604 35.9197627,208.604 L134.000763,208.604 C139.275763,208.604 143.566763,212.895 143.566763,218.169 L143.566763,329.023 C143.566763,349.41 126.979763,365.996 106.592763,365.996" id="Fill-12" fill="#333333"></path>
            <path d="M142.008963,313.0517 C141.148963,313.0517 140.450963,312.3547 140.450963,311.4937 C140.450963,310.6337 141.148963,309.9367 142.008963,309.9367 C157.107963,309.9367 171.871963,295.1957 171.871963,284.1927 L171.871963,265.7417 C171.871963,254.7397 157.107963,239.9987 142.008963,239.9987 C141.148963,239.9987 140.450963,239.3017 140.450963,238.4407 C140.450963,237.5807 141.148963,236.8827 142.008963,236.8827 C149.019963,236.8827 157.187963,240.1977 163.859963,245.7497 C170.930963,251.6357 174.986963,258.9227 174.986963,265.7417 L174.986963,284.1927 C174.986963,291.0117 170.930963,298.2987 163.859963,304.1847 C157.187963,309.7367 149.019963,313.0517 142.008963,313.0517" id="Fill-14" fill="#333333"></path>
            <path d="M69.2365627,116.9665 L69.2325627,116.9665 L67.3815627,116.9535 C67.0415627,116.9515 66.7665627,116.6735 66.7695384,116.3325 C66.7715627,115.9935 67.0475627,115.7195 67.3865627,115.7195 L67.3905627,115.7195 L69.2405627,115.7325 C69.5815627,115.7345 69.8555627,116.0125 69.8535736,116.3535 C69.8515627,116.6925 69.5755627,116.9665 69.2365627,116.9665 M74.1715627,116.9995 L74.1675627,116.9995 L72.3165627,116.9875 C71.9765627,116.9845 71.7015627,116.7065 71.7045384,116.3665 C71.7065627,116.0265 71.9825627,115.7535 72.3205627,115.7535 L72.3255627,115.7535 L74.1755627,115.7655 C74.5165627,115.7685 74.7905627,116.0465 74.7885736,116.3865 C74.7855627,116.7265 74.5105627,116.9995 74.1715627,116.9995 M79.1065627,117.0335 L79.1015627,117.0335 L77.2515627,117.0205 C76.9105627,117.0185 76.6365627,116.7405 76.6385518,116.3995 C76.6415627,116.0605 76.9165627,115.7865 77.2555627,115.7865 L77.2605627,115.7865 L79.1105627,115.7995 C79.4505627,115.8015 79.7255627,116.0795 79.722587,116.4205 C79.7205627,116.7595 79.4445627,117.0335 79.1065627,117.0335 M84.0415627,117.0665 L84.0365627,117.0665 L82.1855627,117.0545 C81.8455627,117.0515 81.5715627,116.7735 81.5735518,116.4335 C81.5755627,116.0935 81.8515627,115.8205 82.1905627,115.8205 L82.1945627,115.8205 L84.0455627,115.8325 C84.3855627,115.8355 84.6605627,116.1135 84.657587,116.4535 C84.6555627,116.7935 84.3795627,117.0665 84.0415627,117.0665 M88.9755627,117.1005 L88.9715627,117.1005 L87.1205627,117.0875 C86.7805627,117.0855 86.5065627,116.8075 86.5085518,116.4665 C86.5105627,116.1275 86.7865627,115.8535 87.1255627,115.8535 L87.1295627,115.8535 L88.9795627,115.8665 C89.3205627,115.8685 89.5945627,116.1465 89.5925736,116.4875 C89.5905627,116.8265 89.3145627,117.1005 88.9755627,117.1005 M93.9105627,117.1335 L93.9065627,117.1335 L92.0555627,117.1215 C91.7155627,117.1195 91.4405627,116.8415 91.4435384,116.5005 C91.4455627,116.1615 91.7205627,115.8875 92.0595627,115.8875 L92.0635627,115.8875 L93.9145627,115.8995 C94.2555627,115.9025 94.5295627,116.1805 94.5275736,116.5205 C94.5245627,116.8605 94.2495627,117.1335 93.9105627,117.1335 M98.8455627,117.1675 L98.8415627,117.1675 L96.9905627,117.1555 C96.6495627,117.1525 96.3755627,116.8745 96.3775518,116.5335 C96.3805627,116.1945 96.6555627,115.9205 96.9945627,115.9205 L96.9985627,115.9205 L98.8495627,115.9335 C99.1905627,115.9355 99.4645627,116.2135 99.4625736,116.5545 C99.4595627,116.8935 99.1845627,117.1675 98.8455627,117.1675 M103.780563,117.2015 L103.775563,117.2015 L101.925563,117.1885 C101.584563,117.1865 101.310563,116.9085 101.312552,116.5675 C101.315563,116.2285 101.590563,115.9545 101.929563,115.9545 L101.933563,115.9545 L103.784563,115.9675 C104.124563,115.9695 104.399563,116.2475 104.396587,116.5885 C104.394563,116.9275 104.118563,117.2015 103.780563,117.2015 M108.714563,117.2345 L108.710563,117.2345 L106.859563,117.2225 C106.519563,117.2195 106.245563,116.9415 106.247552,116.6005 C106.249563,116.2615 106.525563,115.9875 106.864563,115.9875 L106.868563,115.9875 L108.719563,116.0005 C109.059563,116.0035 109.334563,116.2805 109.331587,116.6215 C109.329563,116.9605 109.053563,117.2345 108.714563,117.2345 M113.649563,117.2685 L113.645563,117.2685 L111.794563,117.2555 C111.454563,117.2525 111.179563,116.9755 111.182538,116.6345 C111.184563,116.2955 111.460563,116.0215 111.799563,116.0215 L111.803563,116.0215 L113.653563,116.0345 C113.994563,116.0365 114.268563,116.3145 114.266574,116.6555 C114.264563,116.9945 113.988563,117.2685 113.649563,117.2685 M118.583563,117.3325 C118.570563,117.3325 118.556563,117.3325 118.542563,117.3315 C118.211563,117.3085 117.877563,117.2965 117.541563,117.2945 L116.729563,117.2885 C116.389563,117.2865 116.114563,117.0085 116.117538,116.6675 C116.119563,116.3275 116.378563,116.0465 116.738563,116.0545 L117.550563,116.0605 C117.910563,116.0635 118.268563,116.0765 118.624563,116.0995 C118.964563,116.1225 119.221563,116.4165 119.198563,116.7565 C119.177563,117.0825 118.906563,117.3325 118.583563,117.3325 M123.389563,118.3655 C123.318563,118.3655 123.245563,118.3525 123.174563,118.3265 C122.619563,118.1195 122.047563,117.9415 121.472563,117.7955 C121.142563,117.7125 120.942563,117.3765 121.026563,117.0465 C121.109563,116.7155 121.446563,116.5145 121.775563,116.5995 C122.393563,116.7565 123.009563,116.9475 123.605563,117.1705 C123.924563,117.2895 124.086563,117.6445 123.967563,117.9635 C123.875563,118.2125 123.639563,118.3655 123.389563,118.3655 M127.704563,120.7245 C127.575563,120.7245 127.445563,120.6845 127.334563,120.6015 C126.859563,120.2455 126.361563,119.9115 125.852563,119.6095 C125.559563,119.4345 125.463563,119.0565 125.637563,118.7635 C125.811563,118.4705 126.190563,118.3745 126.483563,118.5485 C127.029563,118.8735 127.564563,119.2315 128.074563,119.6145 C128.347563,119.8185 128.402563,120.2055 128.197563,120.4775 C128.076563,120.6395 127.891563,120.7245 127.704563,120.7245 M131.182563,124.2025 C130.995563,124.2025 130.809563,124.1165 130.689563,123.9555 C130.333563,123.4815 129.948563,123.0215 129.544563,122.5875 C129.311563,122.3385 129.325563,121.9475 129.574563,121.7155 C129.824563,121.4845 130.213563,121.4965 130.446563,121.7455 C130.881563,122.2115 131.294563,122.7065 131.675563,123.2145 C131.880563,123.4875 131.824563,123.8745 131.552563,124.0785 C131.441563,124.1615 131.311563,124.2025 131.182563,124.2025 M133.543563,128.5135 C133.293563,128.5135 133.058563,128.3605 132.965563,128.1115 C132.758563,127.5575 132.519563,127.0085 132.253563,126.4785 C132.100563,126.1745 132.223563,125.8035 132.527563,125.6505 C132.833563,125.4985 133.203563,125.6215 133.355563,125.9245 C133.641563,126.4935 133.899563,127.0845 134.121563,127.6805 C134.240563,127.9995 134.078563,128.3555 133.759563,128.4745 C133.688563,128.5005 133.615563,128.5135 133.543563,128.5135 M134.579563,133.3185 C134.257563,133.3185 133.986563,133.0695 133.964563,132.7435 C133.924563,132.1525 133.852563,131.5575 133.748563,130.9745 C133.688563,130.6395 133.912563,130.3195 134.247563,130.2595 C134.585563,130.1985 134.903563,130.4245 134.962563,130.7585 C135.074563,131.3855 135.152563,132.0245 135.195563,132.6605 C135.218563,132.9995 134.961563,133.2935 134.621563,133.3175 C134.607563,133.3185 134.593563,133.3185 134.579563,133.3185 M134.208563,138.2205 C134.164563,138.2205 134.119563,138.2155 134.074563,138.2055 C133.741563,138.1315 133.532563,137.8015 133.606563,137.4695 C133.735563,136.8905 133.834563,136.2995 133.900563,135.7125 C133.937563,135.3735 134.252563,135.1305 134.581563,135.1675 C134.920563,135.2045 135.164563,135.5105 135.126563,135.8485 C135.055563,136.4805 134.949563,137.1155 134.810563,137.7385 C134.746563,138.0255 134.491563,138.2205 134.208563,138.2205 M132.452563,142.8145 C132.350563,142.8145 132.247563,142.7895 132.152563,142.7365 C131.854563,142.5705 131.748563,142.1945 131.914563,141.8965 C132.203563,141.3785 132.467563,140.8395 132.698563,140.2955 C132.831563,139.9825 133.192563,139.8345 133.507563,139.9685 C133.821563,140.1025 133.967563,140.4645 133.834563,140.7775 C133.586563,141.3625 133.302563,141.9415 132.991563,142.4985 C132.879563,142.7005 132.669563,142.8145 132.452563,142.8145 M129.470563,146.7245 C129.310563,146.7245 129.150563,146.6625 129.030563,146.5405 C128.791563,146.2965 128.794563,145.9065 129.037563,145.6675 C129.460563,145.2525 129.865563,144.8095 130.240563,144.3515 C130.456563,144.0875 130.844563,144.0495 131.109563,144.2655 C131.372563,144.4815 131.411563,144.8705 131.195563,145.1335 C130.791563,145.625504 130.356563,146.1015 129.902563,146.5475 C129.782563,146.6655 129.626563,146.7245 129.470563,146.7245 M125.512563,149.6435 C125.293563,149.6435 125.080563,149.5255 124.969563,149.3185 C124.807563,149.0175 124.919563,148.6445 125.220563,148.4835 C125.741563,148.2025 126.254563,147.8905 126.743563,147.5565 C127.023563,147.3625 127.408563,147.4355 127.600563,147.7165 C127.793563,147.9985 127.720563,148.3825 127.439563,148.5745 C126.914563,148.9335 126.364563,149.2685 125.804563,149.5695 C125.711563,149.6195 125.611563,149.6435 125.512563,149.6435 M120.891563,151.3225 C120.605563,151.3225 120.348563,151.1215 120.288563,150.8305 C120.219563,150.4975 120.433563,150.1705 120.767563,150.1015 C121.346563,149.9815 121.926563,149.8285 122.490563,149.6455 C122.814563,149.5405 123.161563,149.7195 123.266563,150.0435 C123.371563,150.3675 123.193563,150.7155 122.869563,150.8205 C122.263563,151.0155 121.640563,151.1805 121.017563,151.3095 C120.975563,151.3185 120.933563,151.3225 120.891563,151.3225 M68.4855627,151.3425 L68.4815627,151.3425 L67.0355627,151.3335 C66.9065627,151.3335 66.7775627,151.3345 66.6495627,151.3375 C66.3085627,151.3375 66.0265627,151.0755 66.0185627,150.7345 C66.0105627,150.3945 66.2805627,150.1115 66.6205627,150.1045 C66.7585627,150.1015 66.8965627,150.0985 67.0355627,150.0985 L68.4895627,150.1085 C68.8305627,150.1115 69.1045627,150.3895 69.1025736,150.7295 C69.1005627,151.0685 68.8245627,151.3425 68.4855627,151.3425 M73.4205627,151.3765 L73.4155627,151.3765 L71.5655627,151.3635 C71.2245627,151.3615 70.9505627,151.0835 70.9525518,150.7425 C70.9555627,150.4035 71.2305627,150.1295 71.5695627,150.1295 L71.5735627,150.1295 L73.4245627,150.1425 C73.7645627,150.1445 74.0395627,150.4225 74.036587,150.7635 C74.0345627,151.1025 73.7585627,151.3765 73.4205627,151.3765 M78.3545627,151.4095 L78.3505627,151.4095 L76.5005627,151.3975 C76.1595627,151.3945 75.8855627,151.1165 75.8875518,150.7755 C75.8895627,150.4365 76.1655627,150.1625 76.5045627,150.1625 L76.5085627,150.1625 L78.3595627,150.1755 C78.6995627,150.1785 78.9745627,150.4555 78.971587,150.7965 C78.9695627,151.1355 78.6935627,151.4095 78.3545627,151.4095 M83.2895627,151.4435 L83.2855627,151.4435 L81.4355627,151.4305 C81.0945627,151.4275 80.8205627,151.1505 80.8225518,150.8095 C80.8245627,150.4685 81.0885627,150.1805 81.4435627,150.1965 L83.2945627,150.2095 C83.6345627,150.2115 83.9085627,150.4895 83.9065736,150.8305 C83.9045627,151.1695 83.6285627,151.4435 83.2895627,151.4435 M88.2245627,151.4765 L88.2205627,151.4765 L86.3705627,151.4645 C86.0295627,151.4615 85.7555627,151.1845 85.7575518,150.8435 C85.7595627,150.5045 86.0355627,150.2305 86.3745627,150.2305 L86.3785627,150.2305 L88.2285627,150.2425 C88.5695627,150.2455 88.8435627,150.5225 88.8415736,150.8635 C88.8395627,151.2025 88.5635627,151.4765 88.2245627,151.4765 M93.1595627,151.5105 L93.1555627,151.5105 L91.3045627,151.4975 C90.9635627,151.4955 90.6895627,151.2175 90.6915518,150.8765 C90.6945627,150.5375 90.9695627,150.2635 91.3085627,150.2635 L91.3125627,150.2635 L93.1635627,150.2755 C93.5045627,150.2785 93.7785627,150.5565 93.7765736,150.8975 C93.7745627,151.2365 93.4985627,151.5105 93.1595627,151.5105 M98.0945627,151.5445 L98.0895627,151.5445 L96.2395627,151.5315 C95.8985627,151.5285 95.6245627,151.2505 95.6265518,150.9105 C95.6295627,150.5715 95.9045627,150.2975 96.2435627,150.2975 L96.2475627,150.2975 L98.0985627,150.3095 C98.4385627,150.3125 98.7135627,150.5905 98.710587,150.9315 C98.7085627,151.2705 98.4325627,151.5445 98.0945627,151.5445 M103.028563,151.5775 L103.024563,151.5775 L101.174563,151.5645 C100.833563,151.5625 100.559563,151.2845 100.561552,150.9435 C100.563563,150.6045 100.839563,150.3305 101.178563,150.3305 L101.182563,150.3305 L103.033563,150.3435 C103.373563,150.3455 103.647563,150.6235 103.645574,150.9645 C103.643563,151.3035 103.367563,151.5775 103.028563,151.5775 M107.963563,151.6105 L107.959563,151.6105 L106.108563,151.5985 C105.768563,151.5955 105.494563,151.3175 105.496552,150.9775 C105.498563,150.6375 105.774563,150.3645 106.113563,150.3645 L106.117563,150.3645 L107.968563,150.3765 C108.308563,150.3795 108.582563,150.6575 108.580574,150.9975 C108.578563,151.3375 108.302563,151.6105 107.963563,151.6105 M112.898563,151.6445 L112.894563,151.6445 L111.043563,151.6315 C110.703563,151.6295 110.428563,151.3515 110.431538,151.0105 C110.433563,150.6715 110.709563,150.3975 111.047563,150.3975 L111.052563,150.3975 L112.902563,150.4105 C113.243563,150.4125 113.517563,150.6905 113.515574,151.0315 C113.513563,151.3705 113.237563,151.6445 112.898563,151.6445 M117.430563,151.6745 L115.978563,151.6655 C115.637563,151.6625 115.363563,151.3845 115.365552,151.0445 C115.368563,150.7045 115.643563,150.4315 115.982563,150.4315 L115.986563,150.4315 L117.430563,150.4405 C117.560563,150.4405 117.689563,150.4395 117.819563,150.4365 C118.151563,150.4455 118.442563,150.6985 118.449563,151.0395 C118.457563,151.3795 118.187563,151.6625 117.847563,151.6695 C117.708563,151.6725 117.569563,151.6745 117.430563,151.6745 M61.7875627,152.1575 C61.5265627,152.1575 61.2845627,151.9915 61.2005627,151.7295 C61.0955627,151.4055 61.2735627,151.0575 61.5985627,150.9535 C62.2065627,150.7575 62.8295627,150.5925 63.4505627,150.4645 C63.7825627,150.3935 64.1115627,150.6095 64.1795627,150.9435 C64.2485627,151.2775 64.0345627,151.6035 63.7005627,151.6725 C63.1225627,151.7925 62.5425627,151.9455 61.9765627,152.1275 C61.9135627,152.1475 61.8505627,152.1575 61.7875627,152.1575 M57.3745627,154.3265 C57.1775627,154.3265 56.9845627,154.2325 56.8645627,154.0575 C56.6725627,153.7765 56.7435627,153.3925 57.0255627,153.2005 C57.5495627,152.8415 58.0995627,152.5065 58.6625627,152.2045 C58.9615627,152.0445 59.3365627,152.1565 59.4975627,152.4555 C59.6585627,152.7555 59.5455627,153.1305 59.2455627,153.2915 C58.7225627,153.5725 58.2095627,153.8845 57.7225627,154.2185 C57.6155627,154.2915 57.4945627,154.3265 57.3745627,154.3265 M53.7475627,157.6485 C53.6095627,157.6485 53.4715627,157.6025 53.3565627,157.5075 C53.0935627,157.2915 53.0555627,156.9035 53.2715627,156.6395 C53.6755627,156.1475 54.1105627,155.6725 54.5635627,155.2265 C54.8055627,154.9875 55.1965627,154.9905 55.4355627,155.2335 C55.6745627,155.4765 55.6705627,155.8675 55.4285627,156.1055 C55.0065627,156.5215 54.6015627,156.9645 54.2245627,157.4225 C54.1025627,157.5715 53.9255627,157.6485 53.7475627,157.6485 M51.1995627,161.8535 C51.1195627,161.8535 51.0375627,161.8375 50.9585627,161.8045 C50.6455627,161.6715 50.4985627,161.3095 50.6315627,160.9955 C50.8795627,160.4105 51.1635627,159.8315 51.4745627,159.2755 C51.6395627,158.9775 52.0155627,158.8705 52.3135627,159.0375 C52.6115627,159.2035 52.7175627,159.5795 52.5515627,159.8765 C52.2625627,160.3945 51.9985627,160.9335 51.7675627,161.4775 C51.6685627,161.7115 51.4395627,161.8535 51.1995627,161.8535 M49.9525627,166.6075 C49.9295627,166.6075 49.9065627,166.6055 49.8835627,166.6035 C49.5445627,166.5655 49.3005627,166.2605 49.3385627,165.9215 C49.4105627,165.2885 49.5165627,164.6525 49.6555627,164.0325 C49.7295627,163.6995 50.0595627,163.4895 50.3925627,163.5655 C50.7245627,163.6395 50.9335627,163.9695 50.8595627,164.3015 C50.7305627,164.8785 50.6315627,165.4705 50.5645627,166.0595 C50.5295627,166.3745 50.2625627,166.6075 49.9525627,166.6075 M50.1085627,171.5215 C49.8145627,171.5215 49.5545627,171.3115 49.5015627,171.0125 C49.3905627,170.3875 49.3125627,169.7475 49.2685627,169.1105 C49.2465627,168.7705 49.5025627,168.4765 49.8425627,168.4535 C50.1795627,168.4335 50.4775627,168.6875 50.5005627,169.0275 C50.5405627,169.6195 50.6125627,170.2155 50.7165627,170.7965 C50.7755627,171.1325 50.5525627,171.4525 50.2165627,171.5125 C50.1805627,171.5185 50.1435627,171.5215 50.1085627,171.5215 M51.6605627,176.1875 C51.4355627,176.1875 51.2175627,176.0625 51.1095627,175.8475 C50.8235627,175.2785 50.5655627,174.6885 50.3425627,174.0915 C50.2235627,173.7715 50.3855627,173.4175 50.7045627,173.2975 C51.0245627,173.1785 51.3795627,173.3405 51.4985627,173.6595 C51.7065627,174.2145 51.9455627,174.7645 52.2115627,175.2935 C52.3645627,175.5975 52.2415627,175.9695 51.9375627,176.1215 C51.8485627,176.1665 51.7545627,176.1875 51.6605627,176.1875 M54.4705627,180.2245 C54.3055627,180.2245 54.1405627,180.1585 54.0195627,180.0275 C53.5855627,179.5625 53.1715627,179.0685 52.7895627,178.5595 C52.5855627,178.2875 52.6405627,177.9005 52.9125627,177.6965 C53.1855627,177.4915 53.5715627,177.5465 53.7765627,177.8195 C54.1325627,178.2935 54.5175627,178.7535 54.9215627,179.1875 C55.1545627,179.4365 55.1405627,179.8265 54.8915627,180.0585 C54.7725627,180.1695 54.6215627,180.2245 54.4705627,180.2245 M58.2965627,183.3115 C58.1895627,183.3115 58.0805627,183.2835 57.9825627,183.2245 C57.4365627,182.9005 56.9015627,182.5415 56.3915627,182.1595 C56.1185627,181.9555 56.0635627,181.5685 56.2675627,181.2955 C56.4715627,181.0235 56.8585627,180.9675 57.1315627,181.1715 C57.6065627,181.5285 58.1055627,181.8615 58.6125627,182.1645 C58.9055627,182.3385 59.0015627,182.7175 58.8275627,183.0095 C58.7125627,183.2035 58.5075627,183.3115 58.2965627,183.3115 M62.8395627,185.1925 C62.7895627,185.1925 62.7385627,185.1865 62.6875627,185.1735 C62.0695627,185.0165 61.4545627,184.8255 60.8585627,184.6035 C60.5395627,184.4845 60.3765627,184.1285 60.4955627,183.8095 C60.6145627,183.4905 60.9685627,183.3275 61.2895627,183.4465 C61.8435627,183.6535 62.4155627,183.8315 62.9905627,183.9775 C63.3215627,184.0615 63.5205627,184.3975 63.4365627,184.7275 C63.3665627,185.0065 63.1155627,185.1925 62.8395627,185.1925 M67.7295627,185.7195 L67.7245627,185.7195 L66.9145627,185.7135 C66.5535627,185.7115 66.1945627,185.6985 65.8385627,185.6745 C65.4985627,185.6515 65.2415627,185.3575 65.2645627,185.0175 C65.2875627,184.6775 65.5845627,184.4235 65.9215627,184.4435 C66.2525627,184.4665 66.5865627,184.4785 66.9225627,184.4795 L67.7335627,184.4855 C68.0745627,184.4875 68.3485627,184.7655 68.3465736,185.1065 C68.3435627,185.4455 68.0675627,185.7195 67.7295627,185.7195 M72.6645627,185.7525 L72.6595627,185.7525 L70.8095627,185.7405 C70.4685627,185.7375 70.1945627,185.4595 70.1965518,185.1195 C70.1995627,184.7795 70.4745627,184.5065 70.8135627,184.5065 L70.8175627,184.5065 L72.6685627,184.5185 C73.0085627,184.5215 73.2835627,184.7995 73.280587,185.1395 C73.2785627,185.4795 73.0025627,185.7525 72.6645627,185.7525 M77.5985627,185.7865 L77.5945627,185.7865 L75.7445627,185.7735 C75.4035627,185.7715 75.1295627,185.4935 75.1315518,185.1525 C75.1335627,184.8135 75.4095627,184.5395 75.7485627,184.5395 L75.7525627,184.5395 L77.6035627,184.5525 C77.9435627,184.5545 78.2185627,184.8325 78.215587,185.1735 C78.2135627,185.5125 77.9375627,185.7865 77.5985627,185.7865 M82.5335627,185.8195 L82.5295627,185.8195 L80.6785627,185.8075 C80.3385627,185.8045 80.0635627,185.5265 80.0665384,185.1865 C80.0685627,184.8465 80.3445627,184.5735 80.6835627,184.5735 L80.6875627,184.5735 L82.5385627,184.5855 C82.8785627,184.5885 83.1525627,184.8665 83.1505736,185.2065 C83.1485627,185.5465 82.8725627,185.8195 82.5335627,185.8195 M87.4685627,185.8535 L87.4645627,185.8535 L85.6135627,185.8415 C85.2735627,185.8385 84.9985627,185.5605 85.0015384,185.2205 C85.0035627,184.8805 85.2785627,184.6075 85.6175627,184.6075 L85.6215627,184.6075 L87.4725627,184.6195 C87.8135627,184.6215 88.0875627,184.8995 88.0855736,185.2405 C88.0825627,185.5795 87.8075627,185.8535 87.4685627,185.8535 M92.4035627,185.8865 L92.3995627,185.8865 L90.5485627,185.8745 C90.2075627,185.8725 89.9335627,185.5945 89.9355518,185.2535 C89.9385627,184.9145 90.2135627,184.6405 90.5525627,184.6405 L90.5565627,184.6405 L92.4075627,184.6525 C92.7485627,184.6555 93.0225627,184.9335 93.0205736,185.2735 C93.0175627,185.6135 92.7425627,185.8865 92.4035627,185.8865 M97.3385627,185.9205 L97.3335627,185.9205 L95.4835627,185.9085 C95.1425627,185.9055 94.8685627,185.6275 94.8705518,185.2875 C94.8735627,184.9475 95.1485627,184.6745 95.4875627,184.6745 L95.4915627,184.6745 L97.3425627,184.6865 C97.6825627,184.6895 97.9575627,184.9675 97.954587,185.3075 C97.9525627,185.6475 97.6765627,185.9205 97.3385627,185.9205 M102.272563,185.9545 L102.268563,185.9545 L100.418563,185.9415 C100.077563,185.9395 99.8035627,185.6615 99.8055518,185.3205 C99.8075627,184.9815 100.083563,184.7075 100.422563,184.7075 L100.426563,184.7075 L102.277563,184.7205 C102.617563,184.7225 102.891563,185.0005 102.889574,185.3415 C102.887563,185.6805 102.611563,185.9545 102.272563,185.9545 M107.207563,185.9875 L107.203563,185.9875 L105.352563,185.9755 C105.012563,185.9725 104.737563,185.6945 104.740538,185.3535 C104.742563,185.0145 105.018563,184.7405 105.356563,184.7405 L105.361563,184.7405 L107.212563,184.7535 C107.552563,184.7565 107.826563,185.0345 107.824574,185.3745 C107.822563,185.7135 107.546563,185.9875 107.207563,185.9875 M112.142563,186.0215 L112.137563,186.0215 L110.287563,186.0085 C109.947563,186.0065 109.672563,185.7285 109.675538,185.3875 C109.677563,185.0485 109.953563,184.7745 110.291563,184.7745 L110.296563,184.7745 L112.146563,184.7875 C112.487563,184.7895 112.761563,185.0675 112.759574,185.4085 C112.756563,185.7475 112.481563,186.0215 112.142563,186.0215 M117.077563,186.0545 L117.072563,186.0545 L115.222563,186.0425 C114.881563,186.0395 114.607563,185.7615 114.609552,185.4205 C114.612563,185.0815 114.887563,184.8075 115.226563,184.8075 L115.230563,184.8075 L117.081563,184.8205 C117.421563,184.8235 117.696563,185.1005 117.693587,185.4415 C117.691563,185.7805 117.415563,186.0545 117.077563,186.0545" id="Fill-16" fill="#333333"></path>
        </g>
    </g>
</svg>