<?xml version="1.0" encoding="UTF-8"?>
<svg width="455px" height="275px" viewBox="0 0 455 275" version="1.1" xmlns="http://www.w3.org/2000/svg" xmlns:xlink="http://www.w3.org/1999/xlink">
    <title>matrispuff</title>
    <defs>
        <polygon id="path-1" points="0 141 86 141 86 0 0 0"></polygon>
        <polygon id="path-3" points="0 0 1 0 1 50.20607 0 50.20607"></polygon>
        <polygon id="path-5" points="3.90179815 116.381443 131.262623 116.381443 131.262623 0 3.90179815 0"></polygon>
    </defs>
    <g id="Page-1" stroke="none" stroke-width="1" fill="none" fill-rule="evenodd">
        <g id="Tillgänglighetssida-v3-tweakad" transform="translate(-1076, -430)">
            <g id="matrispuff" transform="translate(1076, 430)">
                <g id="matrisen" fill="#FFFFFF">
                    <rect id="Rectangle-Copy-4" x="0" y="0" width="455" height="275"></rect>
                </g>
                <g id="Group-60-Copy" transform="translate(18, 62)">
                    <path d="M33.4556567,53.8786278 L31.2298733,53.8786278 C28.4770522,53.8786278 26.2455026,51.643338 26.2455026,48.8864806 L26.2455026,45.3360087 C26.2455026,42.5785737 28.4770522,40.3432839 31.2298733,40.3432839 L36.4616174,40.3432839 C39.2000228,40.3432839 41.4200398,42.5670218 41.4200398,45.310017 L41.4200398,45.9008959 C41.4200398,50.3067849 37.8541735,53.8786278 33.4556567,53.8786278" id="Fill-1" fill="#DBE8C1"></path>
                    <path d="M52.6271471,53.8786278 L54.8529304,53.8786278 C57.6057515,53.8786278 59.8373011,51.643338 59.8373011,48.8864806 L59.8373011,45.3360087 C59.8373011,42.5785737 57.6057515,40.3432839 54.8529304,40.3432839 L49.6211864,40.3432839 C46.882781,40.3432839 44.6627639,42.5670218 44.6627639,45.310017 L44.6627639,45.9008959 C44.6627639,50.3067849 48.2286302,53.8786278 52.6271471,53.8786278" id="Fill-3" fill="#DBE8C1"></path>
                    <path d="M59.8372435,37.0178427 L59.8372435,55.2871491 C59.8372435,64.578908 52.3174403,72.1113147 43.0412289,72.1113147 L43.0412289,72.1113147 C33.7650175,72.1113147 26.245791,64.578908 26.245791,55.2871491 L26.245791,35.2070847" id="Stroke-5" stroke="#343434" stroke-width="1.15473792" stroke-linejoin="round"></path>
                    <path d="M21.8028161,43.819535 C19.7402184,40.2702183 18.5592847,36.1433073 18.5592847,31.7403062 C18.5592847,18.4591039 29.3076269,7.69274689 42.5666065,7.69274689 C46.3169938,7.69274689 49.8661379,8.55393993 53.0283647,10.0903407" id="Stroke-7" stroke="#343434" stroke-width="1.15473792" stroke-linejoin="round"></path>
                    <path d="M33.1601349,30.1761232 L33.1601349,30.1761232 C33.1601349,32.9543516 30.9112865,35.2069692 28.1377068,35.2069692 L22.0992604,35.2069692" id="Stroke-9" stroke="#343434" stroke-width="1.15473792" stroke-linejoin="round"></path>
                    <path d="M26.5624173,52.8182802 L26.5624173,52.8182802 C23.3015871,52.8182802 20.6583252,50.1705882 20.6583252,46.9042926 L20.6583252,46.6374441 C20.6583252,44.3160928 22.536402,42.4342907 24.8538691,42.4342907 L26.2458486,42.4342907" id="Stroke-11" stroke="#343434" stroke-width="1.15473792" stroke-linejoin="round"></path>
                    <path d="M64.27993,43.819535 C66.3425276,40.2702183 67.5234614,35.8995625 67.5234614,31.4965615" id="Stroke-13" stroke="#343434" stroke-width="1.15473792" stroke-linejoin="round"></path>
                    <path d="M59.5203865,52.8182802 L59.5203865,52.8182802 C62.7812167,52.8182802 65.4244785,50.1705882 65.4244785,46.9042926 L65.4244785,46.6374441 C65.4244785,44.3160928 63.5464018,42.4342907 61.2289346,42.4342907 L59.8369551,42.4342907" id="Stroke-15" stroke="#343434" stroke-width="1.15473792" stroke-linejoin="round"></path>
                    <path d="M44.1418384,11.0802217 C44.9548836,11.1789903 45.7823445,11.229241 46.6213379,11.229241 C54.4421408,11.229241 61.4983352,7.04226024 64.9327303,0.577247702 C68.9426001,4.26403185 71.4561206,9.55710564 71.4561206,15.438748 L71.4561206,20.2841862 C71.4561206,30.1847294 63.4433007,38.2104016 53.5593236,38.2104016 L47.5808466,38.2104016 C41.7419135,38.2104016 36.4830679,35.7203928 32.8059124,31.7430787" id="Stroke-17" stroke="#343434" stroke-width="1.15473792" stroke-linejoin="round"></path>
                    <path d="M52.6563821,15.3527442 C59.498071,14.5937853 65.4875039,10.6286007 68.5666964,4.83301996" id="Stroke-19" stroke="#343434" stroke-width="1.15473792" stroke-linejoin="round"></path>
                    <path d="M61.0267113,18.6513272 C65.1663223,16.8359485 68.6064837,13.7406209 70.7007959,9.79911763" id="Stroke-21" stroke="#343434" stroke-width="1.15473792" stroke-linejoin="round"></path>
                    <path d="M62.7305888,23.8591481 C66.2676237,22.3591358 69.3202913,19.9107138 71.4561206,16.7408765" id="Stroke-23" stroke="#343434" stroke-width="1.15473792" stroke-linejoin="round"></path>
                    <path d="M46.5957933,61.727845 C45.3866048,61.945598 44.1416654,62.0593841 42.8696245,62.0593841 C41.6892673,62.0593841 40.5313987,61.961193 39.4040914,61.7728973" id="Stroke-25" stroke="#343434" stroke-width="1.15473792" stroke-linejoin="round"></path>
                    <path d="M43.3857063,55.1355306 L42.2255312,55.1355306 C41.3438673,55.1355306 40.6225059,54.4129602 40.6225059,53.5298186 L41.308693,47.2583002" id="Stroke-27" stroke="#343434" stroke-width="1.15473792" stroke-linejoin="round"></path>
                    <path d="M44.6619566,45.9081158 C44.2906083,45.4183159 43.7030246,45.1017942 43.0416325,45.1017942 C42.3802404,45.1017942 41.7920801,45.4183159 41.4207318,45.9081158" id="Stroke-29" stroke="#343434" stroke-width="1.15473792" stroke-linejoin="round"></path>
                    <g id="Group-34" transform="translate(32.0572, 40.2291)">
                        <line x1="4.24455724" y1="0" x2="0" y2="3.9640294" id="Fill-31" fill="#95C13F"></line>
                        <line x1="4.24455724" y1="0" x2="0" y2="3.9640294" id="Stroke-33" stroke="#9CBF1E" stroke-width="1.15473792"></line>
                    </g>
                    <g id="Group-38" transform="translate(29.4991, 40.8073)">
                        <line x1="9.43017104" y1="0" x2="0" y2="8.80657966" id="Fill-35" fill="#95C13F"></line>
                        <line x1="9.43017104" y1="0" x2="0" y2="8.80657966" id="Stroke-37" stroke="#9CBF1E" stroke-width="1.15473792"></line>
                    </g>
                    <g id="Group-42" transform="translate(51.8624, 40.4143)">
                        <line x1="3.39806763" y1="0" x2="0" y2="3.1785012" id="Fill-39" fill="#95C13F"></line>
                        <line x1="3.39806763" y1="0" x2="0" y2="3.1785012" id="Stroke-41" stroke="#9CBF1E" stroke-width="1.15473792"></line>
                    </g>
                    <g id="Group-46" transform="translate(50.1149, 41.2003)">
                        <line x1="7.54921116" y1="0" x2="0" y2="7.0616674" id="Fill-43" fill="#95C13F"></line>
                        <line x1="7.54921116" y1="0" x2="0" y2="7.0616674" id="Stroke-45" stroke="#9CBF1E" stroke-width="1.15473792"></line>
                    </g>
                    <path d="M33.4556567,53.8786278 L31.2298733,53.8786278 C28.4770522,53.8786278 26.2455026,51.643338 26.2455026,48.8864806 L26.2455026,45.3360087 C26.2455026,42.5785737 28.4770522,40.3432839 31.2298733,40.3432839 L36.4616174,40.3432839 C39.2000228,40.3432839 41.4200398,42.5670218 41.4200398,45.310017 L41.4200398,45.9008959 C41.4200398,50.3067849 37.8541735,53.8786278 33.4556567,53.8786278 Z" id="Stroke-47" stroke="#343434" stroke-width="1.15473792" stroke-linejoin="round"></path>
                    <path d="M52.6271471,53.8786278 L54.8529304,53.8786278 C57.6057515,53.8786278 59.8373011,51.643338 59.8373011,48.8864806 L59.8373011,45.3360087 C59.8373011,42.5785737 57.6057515,40.3432839 54.8529304,40.3432839 L49.6211864,40.3432839 C46.882781,40.3432839 44.6627639,42.5670218 44.6627639,45.310017 L44.6627639,45.9008959 C44.6627639,50.3067849 48.2286302,53.8786278 52.6271471,53.8786278 Z" id="Stroke-49" stroke="#343434" stroke-width="1.15473792" stroke-linejoin="round"></path>
                    <path d="M59.8770884,78.4847208 C59.8770884,85.3407646 52.3186512,90.8989542 42.9945797,90.8989542 C33.6705082,90.8989542 26.1230269,85.7485462 26.1230269,78.8919247" id="Stroke-51" stroke="#333333" stroke-width="1.15473792" stroke-linejoin="round"></path>
                    <mask id="mask-2" fill="white">
                        <use xlink:href="#path-1"></use>
                    </mask>
                    <g id="Clip-54"></g>
                    <polygon id="Fill-53" fill="#DBE8C1" mask="url(#mask-2)" points="37.9576782 115.681156 61.2436387 115.681156 61.2436387 109.8076 37.9576782 109.8076"></polygon>
                    <polygon id="Stroke-55" stroke="#333333" stroke-width="1.15473792" stroke-linejoin="round" mask="url(#mask-2)" points="37.9576782 115.517119 61.2436387 115.517119 61.2436387 109.643563 37.9576782 109.643563"></polygon>
                    <path d="M0.5766278,141 L0.5766278,102.635034 C0.5766278,92.5248243 7.22456971,83.9700757 16.3808425,81.1173377 C19.1371234,80.2099371 32.4606854,77.1810328 32.4606854,77.1810328 L32.7086353,68.7042595" id="Stroke-56" stroke="#333333" stroke-width="1.15473792" stroke-linejoin="round" mask="url(#mask-2)"></path>
                    <path d="M85.4235452,141 L85.4235452,102.635034 C85.4235452,92.5248243 78.7756033,83.9700757 69.6193304,81.1173377 C66.8630496,80.2099371 53.5394876,77.1810328 53.5394876,77.1810328 L53.2915377,68.7042595" id="Stroke-57" stroke="#333333" stroke-width="1.15473792" stroke-linejoin="round" mask="url(#mask-2)"></path>
                    <line x1="18.6645193" y1="123.540539" x2="18.6645193" y2="140.853926" id="Stroke-58" stroke="#333333" stroke-width="1.15473792" stroke-linejoin="round" mask="url(#mask-2)"></line>
                    <line x1="67.3356537" y1="123.540539" x2="67.3356537" y2="140.853926" id="Stroke-59" stroke="#333333" stroke-width="1.15473792" stroke-linejoin="round" mask="url(#mask-2)"></line>
                </g>
                <g id="Group-38-Copy" transform="translate(347, 65)">
                    <path d="M63.067124,68.1235133 C63.067124,75.4665756 54.9756994,81.4195907 44.9941358,81.4195907 C35.0125721,81.4195907 26.932876,75.9033239 26.932876,68.5596429" id="Stroke-1" stroke="#333333" stroke-width="1.24032" stroke-linejoin="round"></path>
                    <path d="M0,134 L0,93.8327685 C0,83.0043807 7.11672524,73.8419463 16.9186578,70.7865642 C19.8692993,69.8147065 34.1323797,66.5706443 34.1323797,66.5706443 L34.397814,57.7206148" id="Stroke-3" stroke="#333333" stroke-width="1.24032" stroke-linejoin="round"></path>
                    <path d="M90,134 L90,93.8327685 C90,83.0043807 82.8832748,73.8419463 73.0813422,70.7865642 C70.1307007,69.8147065 55.8676203,66.5706443 55.8676203,66.5706443 L55.602186,57.7206148" id="Stroke-5" stroke="#333333" stroke-width="1.24032" stroke-linejoin="round"></path>
                    <line x1="19.3191714" y1="99.0743045" x2="19.3191714" y2="133.999938" id="Stroke-7" stroke="#333333" stroke-width="1.24032" stroke-linejoin="round"></line>
                    <line x1="71.4223162" y1="99.0743045" x2="71.4223162" y2="133.999938" id="Stroke-9" stroke="#333333" stroke-width="1.24032" stroke-linejoin="round"></line>
                    <g id="Group-13" transform="translate(44.6914, 83.7939)">
                        <mask id="mask-4" fill="white">
                            <use xlink:href="#path-3"></use>
                        </mask>
                        <g id="Clip-12"></g>
                        <line x1="0.308644516" y1="0" x2="0.308644516" y2="50.2062556" id="Stroke-11" stroke="#333333" stroke-width="1.24032" stroke-linejoin="round" mask="url(#mask-4)"></line>
                    </g>
                    <path d="M25.3766903,32.8737209 C25.3766903,37.437926 29.068696,41.1372952 33.6224372,41.1372952 C38.1767957,41.1372952 41.8681841,37.437926 41.8681841,32.8737209 C41.8681841,28.3095159 38.1767957,24.6101466 33.6224372,24.6101466 C29.068696,24.6101466 25.3766903,28.3095159 25.3766903,32.8737209" id="Fill-14" fill="#DBE8C1"></path>
                    <path d="M65.106647,32.8737209 C65.106647,37.437926 61.4146413,41.1372952 56.8609001,41.1372952 C52.3065416,41.1372952 48.6151532,37.437926 48.6151532,32.8737209 C48.6151532,28.3095159 52.3065416,24.6101466 56.8609001,24.6101466 C61.4146413,24.6101466 65.106647,28.3095159 65.106647,32.8737209" id="Fill-16" fill="#DBE8C1"></path>
                    <path d="M31.7002609,32.8737209 C31.7002609,34.1152985 32.7045902,35.1217991 33.9434892,35.1217991 C35.1830056,35.1217991 36.1873349,34.1152985 36.1873349,32.8737209 C36.1873349,31.6321433 35.1830056,30.6256427 33.9434892,30.6256427 C32.7045902,30.6256427 31.7002609,31.6321433 31.7002609,32.8737209" id="Fill-18" fill="#95C13F"></path>
                    <path d="M59.1042519,32.8737209 C59.1042519,34.1152985 58.0999226,35.1217991 56.8610235,35.1217991 C55.6215072,35.1217991 54.6171779,34.1152985 54.6171779,32.8737209 C54.6171779,31.6321433 55.6215072,30.6256427 56.8610235,30.6256427 C58.0999226,30.6256427 59.1042519,31.6321433 59.1042519,32.8737209" id="Fill-20" fill="#95C13F"></path>
                    <path d="M66.563696,41.0537192 C69.0828525,39.7948201 70.8236076,37.1829912 70.8236076,34.1839039 L70.8236076,34.1839039 C70.8236076,33.0048073 70.5544696,31.8850985 70.0742187,30.8841655 L70.0736014,30.8841655 C70.9378061,28.9305521 71.4180569,26.7678439 71.4180569,24.4925463 C71.4180569,19.1507313 68.769887,14.4281586 64.7173845,11.572592 C66.5883876,11.2360608 68.8779126,10.4262825 70.2822451,9.25893969 C65.6038116,9.25893969 60.4340159,7.67402598 56.7253434,4.8011379 C53.0166709,1.92763119 48.6660178,0 43.6956065,0 C36.1270257,0 29.5343789,4.18993776 26.1016346,10.3817416 L26.1016346,10.3817416 C26.2985498,8.31430142 28.0454777,4.72999618 28.0454777,4.72999618 C22.7830887,8.2926496 19.3231837,14.3260857 19.3231837,21.1693002 C19.3231837,24.3205689 20.1688697,27.2472772 21.3620894,29.9450948 C20.3750442,32.0335682 20.6855406,38.0162772 23.272599,38.8347162" id="Stroke-22" stroke="#333333" stroke-width="1.17954432" stroke-linejoin="round"></path>
                    <path d="M66.647709,19.3814779 L66.647709,38.8347162 C66.647709,50.7667286 56.9062708,60.5292279 45,60.5292279 C33.0937292,60.5292279 23.352291,50.7667286 23.352291,38.8347162 L23.352291,18.4547798 C28.8813488,21.9314445 35.3122659,24.1021948 42.21294,24.5339941 L42.2117054,24.5544086 C40.4215673,23.327678 39.1561247,21.3889116 38.8215541,19.1457823 C42.6431905,22.9750625 47.9222463,25.3437724 53.7531585,25.3437724 C54.8463773,25.3437724 55.9210775,25.2602582 56.9698516,25.099416 C54.7161294,24.3527373 53.049449,22.4096406 52.7198166,19.9914408 C54.5920543,20.6063527 56.5914534,20.9385536 58.668631,20.9385536 C61.1698862,20.9385536 64.4588021,20.2580676 66.647709,19.3814779 Z" id="Stroke-24" stroke="#333333" stroke-width="1.17954432" stroke-linejoin="round"></path>
                    <path d="M38.1382151,31.1871673 C35.0394242,30.2641809 31.8714969,30.5134862 29.1066593,31.6777359" id="Stroke-26" stroke="#333333" stroke-width="1.24032" stroke-linejoin="round"></path>
                    <path d="M31.7561256,32.8737209 C31.7561256,34.1152985 32.7604548,35.1217991 33.9993539,35.1217991 C35.2388703,35.1217991 36.2431995,34.1152985 36.2431995,32.8737209 C36.2431995,31.6321433 35.2388703,30.6256427 33.9993539,30.6256427 C32.7604548,30.6256427 31.7561256,31.6321433 31.7561256,32.8737209 Z" id="Stroke-28" stroke="#333333" stroke-width="1.24032" stroke-linejoin="round"></path>
                    <path d="M52.778027,31.1871673 C55.8768179,30.2641809 59.0447452,30.5134862 61.8095828,31.6777359" id="Stroke-30" stroke="#333333" stroke-width="1.24032" stroke-linejoin="round"></path>
                    <path d="M59.1601165,32.8737209 C59.1601165,34.1152985 58.1557873,35.1217991 56.9168882,35.1217991 C55.6773718,35.1217991 54.6730426,34.1152985 54.6730426,32.8737209 C54.6730426,31.6321433 55.6773718,30.6256427 56.9168882,30.6256427 C58.1557873,30.6256427 59.1601165,31.6321433 59.1601165,32.8737209 Z" id="Stroke-32" stroke="#333333" stroke-width="1.24032" stroke-linejoin="round"></path>
                    <path d="M46.1610589,43.1004973 L43.8851143,43.1004973 C42.7770805,43.1004973 41.8702829,42.1917392 41.8702829,41.0813098 L42.7326357,33.9659009" id="Stroke-34" stroke="#333333" stroke-width="1.24032" stroke-linejoin="round"></path>
                    <path d="M49.7776936,48.8483767 C48.0005185,49.6296984 42.959119,49.6965097 40.4535428,48.8242504" id="Stroke-36" stroke="#333333" stroke-width="1.24032" stroke-linejoin="round"></path>
                </g>
                <g id="syn" transform="translate(121, 31)">
                    <g id="syn-oga" fill="#F4F4F4" fill-rule="nonzero">
                        <circle id="Oval" cx="106.5" cy="106.5" r="106.5"></circle>
                    </g>
                    <g id="Group-19" transform="translate(41, 42)">
                        <path d="M2.38869669,62.1705972 C8.26133059,71.3368454 32.5139637,94.3712225 65.0046337,94.3712225 C86.1666845,94.3712225 106.29063,83.3057488 124.82006,61.4844481 C106.29063,39.6631474 86.1666845,28.596794 65.0046337,28.596794 C33.6408484,28.596794 9.25812251,51.2388346 2.38869669,62.1705972" id="Fill-1" fill="#FFFFFF"></path>
                        <path d="M86.476358,61.4843601 C86.476358,74.1262175 76.2359472,84.3735903 63.6046421,84.3735903 C50.9724581,84.3735903 40.7329262,74.1262175 40.7329262,61.4843601 C40.7329262,48.8425028 50.9724581,38.59513 63.6046421,38.59513 C76.2359472,38.59513 86.476358,48.8425028 86.476358,61.4843601" id="Fill-3" fill="#DDEBC1"></path>
                        <path d="M2.38869669,62.1705972 C8.26133059,71.3368454 32.5139637,94.3712225 65.0046337,94.3712225 C86.1666845,94.3712225 106.29063,83.3057488 124.82006,61.4844481 C106.29063,39.6631474 86.1666845,28.596794 65.0046337,28.596794 C33.6408484,28.596794 9.25812251,51.2388346 2.38869669,62.1705972 M65.0046337,96.5704184 C31.5409049,96.5704184 6.45849087,73.3354746 0.154265417,62.7362304 C-0.0514218055,62.3896371 -0.0514218055,61.9577151 0.154265417,61.6111218 C6.7160394,50.5799555 32.1535715,26.3975982 65.0046337,26.3975982 C86.8909848,26.3975982 107.623202,37.7753577 126.624658,60.2133129 L127.097563,60.771029 C127.447407,61.1818388 127.447407,61.7861778 127.097563,62.1969876 L126.624658,62.7555833 C107.623202,85.1935385 86.8909848,96.5704184 65.0046337,96.5704184" id="Fill-5" fill="#333333"></path>
                        <path d="M63.6795334,84.3734144 C51.0675664,84.3734144 40.8078175,74.1058089 40.8078175,61.4841842 C40.8078175,56.9635173 42.1236883,52.591516 44.6121521,48.8405675 L46.4422409,50.0571627 C44.1937456,53.4456836 43.0053305,57.3971987 43.0053305,61.4841842 C43.0053305,72.8927325 52.2797146,82.1742186 63.6795334,82.1742186 C75.0802311,82.1742186 84.3546152,72.8927325 84.3546152,61.4841842 C84.3546152,50.0756359 75.0802311,40.7941498 63.6795334,40.7941498 L63.6795334,38.594954 C76.2915003,38.594954 86.5521283,48.8625595 86.5521283,61.4841842 C86.5521283,74.1058089 76.2915003,84.3734144 63.6795334,84.3734144" id="Fill-7" fill="#333333"></path>
                        <polygon id="Fill-9" fill="#333333" points="28.1914555 28.2398205 18.1646429 17.2728708 19.7855286 15.7888534 29.8123411 26.7558032"></polygon>
                        <mask id="mask-6" fill="white">
                            <use xlink:href="#path-5"></use>
                        </mask>
                        <g id="Clip-12"></g>
                        <polygon id="Fill-11" fill="#333333" mask="url(#mask-6)" points="62.5805131 17.384502 64.7780262 17.384502 64.7780262 3.29293475 62.5805131 3.29293475"></polygon>
                        <polygon id="Fill-13" fill="#333333" mask="url(#mask-6)" points="99.4973261 27.171979 98.0329034 25.5322586 108.059716 16.5648177 109.524139 18.2045381"></polygon>
                        <polygon id="Fill-14" fill="#333333" mask="url(#mask-6)" points="19.7850891 107.180219 18.1642034 105.696201 28.191016 94.7292516 29.8119016 96.213269"></polygon>
                        <polygon id="Fill-15" fill="#333333" mask="url(#mask-6)" points="62.5805131 119.675258 64.7780262 119.675258 64.7780262 105.583691 62.5805131 105.583691"></polygon>
                        <polygon id="Fill-16" fill="#333333" mask="url(#mask-6)" points="108.059892 106.403639 98.0330792 97.4370775 99.4975019 95.7964774 109.524314 104.763918"></polygon>
                        <path d="M71.1990714,61.4843601 C71.1990714,65.6821851 67.7990792,69.0847809 63.6044663,69.0847809 C59.4098534,69.0847809 56.0098612,65.6821851 56.0098612,61.4843601 C56.0098612,57.2865351 59.4098534,53.8839394 63.6044663,53.8839394 C67.7990792,53.8839394 71.1990714,57.2865351 71.1990714,61.4843601" id="Fill-17" fill="#95C23E" mask="url(#mask-6)"></path>
                        <path d="M63.6795334,53.8303669 C59.4620663,53.8303669 56.0313089,57.2637515 56.0313089,61.4844481 C56.0313089,65.7051448 59.4620663,69.1385293 63.6795334,69.1385293 C67.8970004,69.1385293 71.3277578,65.7051448 71.3277578,61.4844481 C71.3277578,57.2637515 67.8970004,53.8303669 63.6795334,53.8303669 M63.6795334,71.3377251 C58.2499181,71.3377251 53.8337959,66.9173415 53.8337959,61.4844481 C53.8337959,56.0506751 58.2499181,51.6311711 63.6795334,51.6311711 C69.1091486,51.6311711 73.5252709,56.0506751 73.5252709,61.4844481 C73.5252709,66.9173415 69.1091486,71.3377251 63.6795334,71.3377251" id="Fill-18" fill="#333333" mask="url(#mask-6)"></path>
                    </g>
                </g>
            </g>
        </g>
    </g>
</svg>