<?xml version="1.0" encoding="UTF-8"?>
<svg width="455px" height="275px" viewBox="0 0 455 275" version="1.1" xmlns="http://www.w3.org/2000/svg" xmlns:xlink="http://www.w3.org/1999/xlink">
    <title>Group 6 Copy 28</title>
    <defs>
        <rect id="path-1" x="0" y="0" width="455" height="275"></rect>
    </defs>
    <g id="Page-2" stroke="none" stroke-width="1" fill="none" fill-rule="evenodd">
        <g id="annas-illustrationer-copy" transform="translate(-575.000000, -664.000000)">
            <g id="Group-6-Copy-28" transform="translate(575.000000, 664.000000)">
                <mask id="mask-2" fill="white">
                    <use xlink:href="#path-1"></use>
                </mask>
                <use id="Mask" fill="#F1F1F1" xlink:href="#path-1"></use>
                <g id="Group-35" mask="url(#mask-2)">
                    <g transform="translate(55.000000, 45.000000)">
                        <path d="M114.363918,45.4497467 L22.0676672,45.4497467 C9.93058914,45.4497467 0,35.5720791 0,23.4996814 L0,21.9500653 C0,9.87766756 9.93058914,0 22.0676672,0 L114.363918,0 C126.501393,0 136.431585,9.87766756 136.431585,21.9500653 L136.431585,23.4996814 C136.431585,35.5720791 126.501393,45.4497467 114.363918,45.4497467 Z" id="Stroke-1" stroke="#333333" stroke-width="1.386" fill="none"></path>
                        <path d="M38.4603831,22.7248339 C38.4603831,30.5546393 32.0790696,36.9019458 24.2073144,36.9019458 C16.3355592,36.9019458 9.95424569,30.5546393 9.95424569,22.7248339 C9.95424569,14.8950284 16.3355592,8.54772188 24.2073144,8.54772188 C32.0790696,8.54772188 38.4603831,14.8950284 38.4603831,22.7248339" id="Fill-3" stroke="none" fill="#333332" fill-rule="evenodd"></path>
                        <path d="M323.932333,185 L242.670114,185 C230.532639,185 220.602447,175.122332 220.602447,163.049935 L220.602447,161.500319 C220.602447,149.427921 230.532639,139.550253 242.670114,139.550253 L323.932333,139.550253 C336.069808,139.550253 346,149.427921 346,161.500319 L346,163.049935 C346,175.122332 336.069808,185 323.932333,185 Z" id="Stroke-5" stroke="#333333" stroke-width="1.386" fill="none"></path>
                        <path d="M259.062711,162.275127 C259.062711,170.104932 252.681398,176.452239 244.809642,176.452239 C236.937887,176.452239 230.556574,170.104932 230.556574,162.275127 C230.556574,154.445321 236.937887,148.098015 244.809642,148.098015 C252.681398,148.098015 259.062711,154.445321 259.062711,162.275127" id="Fill-7" stroke="none" fill="#96C23E" fill-rule="evenodd"></path>
                        <line x1="68.2158718" y1="45.4497467" x2="70.3957669" y2="46.4035995" id="Stroke-9" stroke="#333333" stroke-width="1.584" fill="none"></line>
                        <line x1="74.696257" y1="48.2849717" x2="278.970925" y2="137.655774" id="Stroke-11" stroke="#333333" stroke-width="1.584" fill="none" stroke-dasharray="4.687056398391724,4.687056398391724"></line>
                        <line x1="281.121249" y1="138.596479" x2="283.301144" y2="139.550332" id="Stroke-13" stroke="#333333" stroke-width="1.584" fill="none"></line>
                        <path d="M204.689927,89.6767771 C204.689927,109.115083 188.84798,124.872605 169.30553,124.872605 C149.76308,124.872605 133.921133,109.115083 133.921133,89.6767771 C133.921133,70.2388666 149.76308,54.4809488 169.30553,54.4809488 C188.84798,54.4809488 204.689927,70.2388666 204.689927,89.6767771" id="Fill-15" stroke="none" fill="#95C23F" fill-rule="evenodd"></path>
                        <path d="M204.689927,89.6767771 C204.689927,109.115083 188.84798,124.872605 169.30553,124.872605 C149.76308,124.872605 133.921133,109.115083 133.921133,89.6767771 C133.921133,70.2388666 149.76308,54.4809488 169.30553,54.4809488 C188.84798,54.4809488 204.689927,70.2388666 204.689927,89.6767771 Z" id="Stroke-17" stroke="#333333" stroke-width="1.584" fill="none" stroke-dasharray="4.752000188827515"></path>
                        <line x1="268.01719" y1="175.503795" x2="272.3099" y2="149.282316" id="Stroke-19" stroke="#333333" stroke-width="1.386" fill="none"></line>
                        <line x1="278.516409" y1="175.503795" x2="282.80912" y2="149.282316" id="Stroke-21" stroke="#333333" stroke-width="1.386" fill="none"></line>
                        <line x1="263.12219" y1="167.614729" x2="286.264722" y2="167.614729" id="Stroke-23" stroke="#333333" stroke-width="1.386" fill="none"></line>
                        <line x1="264.463627" y1="157.019697" x2="287.606159" y2="157.019697" id="Stroke-25" stroke="#333333" stroke-width="1.386" fill="none"></line>
                        <line x1="48.626982" y1="34.7691213" x2="52.9196924" y2="8.54764292" id="Stroke-27" stroke="#333333" stroke-width="1.386" fill="none"></line>
                        <line x1="59.1262014" y1="34.7691213" x2="63.4189118" y2="8.54764292" id="Stroke-29" stroke="#333333" stroke-width="1.386" fill="none"></line>
                        <line x1="43.7319823" y1="26.8800554" x2="66.8745139" y2="26.8800554" id="Stroke-31" stroke="#333333" stroke-width="1.386" fill="none"></line>
                        <line x1="45.0734195" y1="16.2850242" x2="68.2159512" y2="16.2850242" id="Stroke-33" stroke="#333333" stroke-width="1.386" fill="none"></line>
                    </g>
                </g>
            </g>
        </g>
    </g>
</svg>