{
  "button": {
    "color": {
      "background": {
        "primary": {
          "default": {
            "value": "{color.background.inverted-1}"
          },
          "hover": {
            "value": "{color.background.inverted-2}"
          },
          "focus": {
            "value": "{color.background.inverted-2}"
          },
          "active": {
            "value": "{color.background.inverted-3}"
          }
        },
        "secondary": {
          "default": {
            "value": "{color.background.primary}"
          },
          "hover": {
            "value": "{color.background.neutral-1}"
          },
          "focus": {
            "value": "{color.background.secondary}"
          },
          "active": {
            "value": "{color.background.tertiary}"
          }
        },
        "function": {
          "default": {
            "value": "transparent"
          },
          "hover": {
            "value": "transparent"
          },
          "focus": {
            "value": "transparent"
          },
          "active": {
            "value": "transparent"
          }
        }
      },
      "text": {
        "primary": {
          "default": {
            "value": "{color.text.inverted}"
          },
          "hover": {
            "value": "{color.text.inverted}"
          },
          "focus": {
            "value": "{color.text.inverted}"
          },
          "active": {
            "value": "{color.text.inverted}"
          }
        },
        "secondary": {
          "default": {
            "value": "{color.text.secondary}"
          },
          "hover": {
            "value": "{color.text.secondary}"
          },
          "focus": {
            "value": "{color.text.secondary}"
          },
          "active": {
            "value": "{color.text.secondary}"
          }
        },
        "function": {
          "default": {
            "value": "{color.text.link}"
          },
          "hover": {
            "value": "{color.text.link-hover}"
          },
          "focus": {
            "value": "{color.text.secondary}"
          },
          "active": {
            "value": "{color.text.secondary}"
          }
        }
      },
      "border": {
        "primary": {
          "default": {
            "value": "{color.border.secondary}"
          },
          "hover": {
            "value": "{color.border.informative}"
          },
          "focus": {
            "value": "{color.border.tertiary}"
          },
          "active": {
            "value": "{color.border.quaternary}"
          }
        },
        "secondary": {
          "default": {
            "value": "{color.border.secondary}"
          },
          "hover": {
            "value": "{color.border.informative}"
          },
          "focus": {
            "value": "{color.border.primary}"
          },
          "active": {
            "value": "{color.border.primary}"
          }
        },
        "function": {
          "default": {
            "value": "initial"
          },
          "hover": {
            "value": "initial"
          },
          "focus": {
            "value": "initial"
          },
          "active": {
            "value": "initial"
          }
        }
      },
      "icon": {
        "primary": {
          "default": {
            "value": "{color.text.inverted}"
          },
          "hover": {
            "value": "{color.text.inverted}"
          },
          "focus": {
            "value": "{color.text.inverted}"
          },
          "active": {
            "value": "{color.text.inverted}"
          }
        },
        "secondary": {
          "default": {
            "value": "{color.text.secondary}"
          },
          "hover": {
            "value": "{color.text.secondary}"
          },
          "focus": {
            "value": "{color.text.secondary}"
          },
          "active": {
            "value": "{color.text.secondary}"
          }
        },
        "function": {
          "default": {
            "value": "{color.text.link}"
          },
          "hover": {
            "value": "{color.text.link}"
          },
          "focus": {
            "value": "{color.text.link}"
          },
          "active": {
            "value": "{color.text.link}"
          }
        }
      }
    },
    "border-width": {
      "primary": {
        "default": {
          "value": "{border-width.button}"
        },
        "hover": {
          "value": "{border-width.button}"
        }
      },
      "secondary": {
        "default": {
          "value": "{border-width.button}"
        },
        "hover": {
          "value": "{border-width.button}"
        }
      },
      "function": {
        "default": {
          "value": "initial"
        },
        "hover": {
          "value": "initial"
        }
      }
    },
    "border-style": {
      "primary": {
        "default": {
          "value": "{border-style.primary}"
        },
        "hover": {
          "value": "{border-style.primary}"
        },
        "focus": {
          "value": "{border-style.primary}"
        },
        "active": {
          "value": "{border-style.primary}"
        }
      },
      "secondary": {
        "default": {
          "value": "{border-style.primary}"
        },
        "hover": {
          "value": "{border-style.primary}"
        },
        "focus": {
          "value": "{border-style.primary}"
        },
        "active": {
          "value": "{border-style.primary}"
        }
      },
      "function": {
        "default": {
          "value": "{border-style.secondary}"
        },
        "hover": {
          "value": "{border-style.secondary}"
        },
        "focus": {
          "value": "{border-style.secondary}"
        },
        "active": {
          "value": "{border-style.secondary}"
        }
      }
    },
    "border-radius": {
      "primary": {
        "default": {
          "value": "{border-radius.button}"
        },
        "hover": {
          "value": "{border-radius.button}"
        },
        "focus": {
          "value": "{border-radius.button}"
        },
        "active": {
          "value": "{border-radius.button}"
        }
      },
      "secondary": {
        "default": {
          "value": "{border-radius.button}"
        },
        "hover": {
          "value": "{border-radius.button}"
        },
        "focus": {
          "value": "{border-radius.button}"
        },
        "active": {
          "value": "{border-radius.button}"
        }
      },
      "function": {
        "default": {
          "value": "initial"
        },
        "hover": {
          "value": "initial"
        },
        "focus": {
          "value": "initial"
        },
        "active": {
          "value": "initial"
        }
      }
    },
    "padding": {
      "small": {
        "value": "{gutter.button-block-small} {gutter.button-inline-small}"
      },
      "medium": {
        "value": "{gutter.button-block-medium} {gutter.button-inline-medium}"
      },
      "large": {
        "value": "{gutter.button-block-large} {gutter.button-inline-large}"
      }
    },
    "font-size": {
      "small": {
        "value": "{global.typography.font-size.interaction-small}"
      },
      "medium": {
        "value": "{global.typography.font-size.interaction-medium}"
      },
      "large": {
        "value": "{global.typography.font-size.interaction-large}"
      }
    },
    "font-family": {
      "value": "{global.typography.font-family.default}"
    },
    "font-weight": {
      "default": {
        "value": "{typography.button.font-weight.desktop}"
      },
      "function": {
        "value": "{typography.label.font-weight.desktop}"
      }
    },
    "width": {
      "value": "initial"
    },
    "display": {
      "value": "initial"
    },
    "justify-content": {
      "default": {
        "value": "initial"
      },
      "full-width": {
        "value": "center"
      }
    },
    "align-items": {
      "value": "center"
    },
    "text-align": {
      "default": {
        "value": "initial"
      },
      "full-width": {
        "value": "center"
      }
    },
    "outline": {
      "default": {
        "value": "initial"
      },
      "focus": {
        "value": "{color.border.focus} {border-style.primary} {border-width.secondary}"
      }
    },
    "cursor": {
      "value": "pointer"
    },
    "icon": {
      "spacing": {
        "value": "{gutter.large}"
      }
    },
    "min-height": {
      "small": {
        "value": "unset"
      },
      "large": {
        "value": "unset"
      }
    }
  }
}