{
  "link-external": {
    "gap": {
      "value": "var(--digi--gutter--medium)"
    },
    "color": {
      "default": {
        "value": "var(--digi--color--text--link)"
      },
      "hover": {
        "value": "var(--digi--color--text--link-hover)"
      },
      "visited": {
        "value": "var(--digi--color--text--link-visited)"
      }
    },
    "font-size": {
      "large": {
        "value": "var(--digi--typography--link--font-size--desktop-large)"
      },
      "small": {
        "value": "var(--digi--typography--link--font-size--desktop)"
      }
    },
    "font-family": {
      "value": "var(--digi--global--typography--font-family--default)"
    },
    "font-weight": {
      "value": "var(--digi--typography--link-bold--font-weight--desktop)"
    },
    "text-decoration": {
      "default": {
        "value": "var(--digi--global--typography--text-decoration--default)"
      },
      "hover": {
        "value": "var(--digi--typography--link--text-decoration--desktop)"
      },
      "icon": {
        "default": {
          "value": "var(--digi--global--typography--text-decoration--default)"
        },
        "hover": {
          "value": "var(--digi--typography--link--text-decoration--desktop)"
        }
      }
    }
  }
}
