<?xml version="1.0" encoding="UTF-8"?>
<svg width="194px" height="194px" viewBox="0 0 194 194" version="1.1" xmlns="http://www.w3.org/2000/svg" xmlns:xlink="http://www.w3.org/1999/xlink">
    <title>tal</title>
    <defs>
        <path d="M0,97 C0,150.572071 43.428288,194 97,194 L97,194 C150.571712,194 194,150.572071 194,97 L194,97 C194,43.4287309 150.571712,0 97,0 L97,0 C43.428288,0 0,43.4287309 0,97 L0,97 Z" id="path-1"></path>
    </defs>
    <g id="Forts-matris-grovskisser---david" stroke="none" stroke-width="1" fill="none" fill-rule="evenodd">
        <g id="Matris-annas-linjer" transform="translate(-345.000000, -2284.000000)">
            <g id="tal" transform="translate(345.000000, 2284.000000)">
                <g id="Group-3">
                    <mask id="mask-2" fill="white">
                        <use xlink:href="#path-1"></use>
                    </mask>
                    <g id="Clip-2"></g>
                    <polygon id="Fill-1" fill="#F3F3F3" mask="url(#mask-2)" points="-1.68789783 195.687082 195.687096 195.687082 195.687096 -1.68628018 -1.68789783 -1.68628018"></polygon>
                </g>
                <g id="Group-16" transform="translate(30.158200, 59.310796)">
                    <path d="M70.1362073,45.534376 C68.3929817,45.534376 66.6425395,45.4678229 64.9321898,45.3355184 L53.3013309,43.2595415 C48.5311151,41.8370684 43.5973216,39.1621132 40.9977184,36.6820064 C43.6454327,35.9178481 46.2370174,34.9885096 48.780491,33.8811616 C52.6718773,32.186863 56.004373,31.5991105 59.5678019,31.9807888 C61.1105646,32.1443652 62.2892866,32.3857205 63.3292882,32.5982095 L63.4150864,32.6158501 C64.7998843,32.8997032 66.0106803,33.1466715 67.7122096,33.1202106 C69.4650574,33.0985608 70.8153757,32.8539981 72.3789865,32.5701449 C73.4727122,32.3704855 74.712375,32.1443652 76.2495247,31.9807888 C80.5554683,31.5237371 84.0074398,32.1395541 87.1025874,33.9148391 C90.8761015,36.0774152 95.3648673,37.1142009 97.7038687,37.5399807 C97.7351409,37.5455936 97.772828,37.5512065 97.8057039,37.5568194 C93.0010085,42.3735027 82.211292,45.534376 70.1362073,45.534376 M133.712623,38.6344992 C133.694982,38.4973837 133.656493,38.3907383 133.627627,38.3193741 C133.584327,38.1429681 133.519377,37.9008109 133.379854,37.6594556 C133.278019,37.4806441 133.160949,37.35716 133.031851,37.2176389 C132.973316,37.1382563 132.874688,37.0043481 132.714318,36.8776566 C127.734819,32.9438047 118.006754,23.3713783 110.904753,16.3824966 C108.27468,13.7949426 106.003034,11.5593985 104.499562,10.1313125 C99.2297925,5.12138446 92.6554104,0 83.8534843,0 C77.6094651,0 71.7391089,2.049516 67.2214764,5.78932141 C62.7022402,2.05031784 56.8310821,0 50.5878647,0 C42.9462181,0 36.1898156,3.31242199 29.9313631,10.1265014 C29.4069521,10.6982169 28.8055633,11.360541 28.1384227,12.095031 C22.1542035,18.6869994 11.0164834,30.9552289 1.26997601,37.0123666 C0.596420582,37.4309297 0.144176224,38.1221202 0.0271058759,38.9135413 C-0.0851533619,39.7009531 0.154600296,40.4931761 0.684624269,41.0865414 C0.990129766,41.4289292 1.63161113,42.3005348 2.31318507,43.2258641 C7.27343968,49.9525423 20.4494668,67.820056 40.7282963,73.9317192 C44.3430437,75.0214266 47.3940894,75.3790495 50.2150037,75.3790495 C52.8386625,75.3790495 55.263462,75.0695373 57.7564189,74.7512048 C60.4851203,74.4040059 63.3060345,74.0455812 66.6994709,74.0455812 C70.094511,74.0455812 72.917029,74.4048078 75.647334,74.7520067 C78.0456725,75.0575097 80.5266016,75.3742385 83.168703,75.3742385 C86.3849301,75.3742385 89.4030999,74.9155831 92.66824,73.9317192 C112.944664,67.8208579 126.121493,49.954146 131.086559,43.2226567 C131.751294,42.320581 132.379945,41.466616 132.66781,41.135454 C132.849029,40.9983384 133.012606,40.8395731 133.155336,40.6607617 C133.175382,40.6359045 133.195429,40.6078399 133.213069,40.5797753 C133.371836,40.3616735 133.496925,40.110696 133.593949,39.8164188 C133.593949,39.8148151 133.594751,39.8140133 133.594751,39.8124096 C133.713425,39.4435609 133.755923,39.0763158 133.720641,38.7186929 C133.71984,38.6906283 133.716632,38.6625638 133.712623,38.6344992" id="Fill-4" fill="#FFFFFF"></path>
                    <path d="M5.40624781,38.9346298 L18.635999,39.2000405 C18.6440175,39.2000405 18.6528379,39.2000405 18.6608564,39.2008424 C29.5556154,39.6931752 39.2684451,38.0101024 48.3542266,34.052997 C52.5799851,32.2127626 56.2187881,31.5785031 60.1566818,31.9962644 C61.7860445,32.1702648 63.016085,32.4212423 64.1009903,32.6425515 L64.1859866,32.6601921 C65.5635678,32.9424416 66.5578639,33.1396955 68.0613359,33.1252623 C69.6465967,33.106018 70.9199372,32.8750866 72.3945424,32.6072703 C73.4666182,32.4116201 74.8017012,32.1686611 76.4126213,31.9962644 C81.1651963,31.4943094 84.9988493,32.1903109 88.4780838,34.1869051 C91.9877887,36.1979326 96.2263768,37.1745799 98.4402893,37.5779079 C103.640298,38.5256888 120.181696,38.8263807 129.73175,38.7173298 C124.36656,34.0970985 116.102677,25.9655876 109.857856,19.820247 C107.240612,17.2439188 104.97939,15.0187987 103.490351,13.604344 C98.2574671,8.6296972 92.3021146,4.02630465 84.2306754,4.02630465 C78.1678747,4.02630465 72.499585,6.10468707 68.2682136,9.87897182 C67.8865322,10.2189541 67.3083971,10.2205578 66.9267157,9.87897182 C62.6937406,6.10468707 57.0246491,4.02630465 50.9634521,4.02630465 C43.9175812,4.02630465 37.6454972,7.12623769 31.7887724,13.5025097 C31.2659651,14.0718197 30.6677837,14.7309363 30.0038505,15.462219 C24.4935256,21.5313844 14.6604183,32.3627076 5.40624781,38.9346298" id="Fill-6" fill="#D5E5B3"></path>
                    <path d="M132.61577,39.5065057 C132.692748,39.2683577 132.724822,39.0229931 132.694351,38.7800341 C132.69355,38.7768267 132.695153,38.7736193 132.695153,38.7704119 C132.687135,38.7126791 132.654259,38.6677757 132.640627,38.6124484 C132.604544,38.4552868 132.565253,38.298927 132.484266,38.1570004 C132.428137,38.0575716 132.342339,37.9854056 132.267766,37.9012119 C132.199609,37.8234329 132.1523,37.7320226 132.068907,37.6662713 C125.175388,32.2209414 109.301932,16.1038555 103.78439,10.8589869 C98.2668488,5.61411826 92.0605166,1.00431095 83.829509,1.00431095 C77.5149268,1.00431095 71.6124965,3.17330187 67.1966992,7.1127667 C62.7776945,3.17250002 56.8768678,1.00431095 50.5630875,1.00431095 C42.3328817,1.00431095 35.8579292,5.13060568 30.6450913,10.8060651 C25.4330553,16.4815245 12.7421484,31.0494457 1.77442091,37.864327 C1.35264692,38.1273322 1.06718771,38.5635359 0.995021061,39.0566706 C0.924458112,39.5498053 1.07600808,40.0493548 1.40717283,40.4206091 C1.73833759,40.7926652 2.33651895,41.6033306 3.09346696,42.6304941 C7.9999975,49.2842045 21.0308895,66.9584735 40.9929875,72.9739152 C47.7558047,75.0130072 52.5372464,74.4060105 57.5977325,73.7597234 C60.3601116,73.4085153 63.2147036,73.0452794 66.6746937,73.0452794 C70.1338819,73.0452794 72.988474,73.4085153 75.7492494,73.7597234 C78.1940952,74.0716411 80.5739911,74.3739367 83.1439257,74.3739367 C85.8926734,74.3739367 88.857921,74.0275397 92.3539944,72.9739152 C112.316092,66.9584735 125.346984,49.2842045 130.253515,42.6304941 C131.010463,41.6033306 131.608644,40.7926652 131.939809,40.4206091 C131.950233,40.4101851 131.959855,40.3989593 131.969478,40.3869316 C132.108198,40.2931157 132.236494,40.1752445 132.34715,40.0365253 C132.350357,40.0333179 132.350357,40.0285068 132.353565,40.0244976 C132.472239,39.8713452 132.554829,39.6933356 132.61577,39.5065057 Z" id="Stroke-8" stroke="#333333" stroke-width="2" stroke-linejoin="round"></path>
                    <path d="M132.640868,38.6122881 C123.682581,38.8263807 103.614638,37.6051707 97.8589468,36.5555555 C95.581688,36.1410016 91.2148037,35.1330823 87.5760006,33.0474833 C84.2843994,31.1591381 80.6415872,30.5072381 76.1191436,30.9851378 C74.559542,31.1519215 73.2918145,31.3820511 72.1748351,31.5857197 C70.6553261,31.8615544 69.3426949,32.0997024 67.6748433,32.1197485 C66.0318492,32.1422002 64.9268976,31.9088633 63.5052145,31.6185954 C62.4403554,31.4004935 61.2335686,31.1543271 59.6499115,30.9851378 C55.9028585,30.5874226 52.4156055,31.196023 48.3558304,32.9640914 C39.1433562,36.9757223 29.2902025,38.6948781 18.214225,38.1937249" id="Stroke-10" stroke="#333333" stroke-width="2" stroke-linejoin="round"></path>
                    <path d="M99.5907059,37.0263187 C95.378579,42.5614552 83.7709738,46.5386068 70.1114301,46.5386068 C68.311273,46.5386068 66.5471993,46.4696481 64.8304348,46.3365418" id="Stroke-12" stroke="#333333" stroke-width="2" stroke-linejoin="round"></path>
                    <path d="M52.9896511,44.2213547 C47.2876837,42.5214432 41.3988848,39.1280348 39.137663,36.1547933" id="Stroke-14" stroke="#333333" stroke-width="2" stroke-linejoin="round"></path>
                </g>
            </g>
        </g>
    </g>
</svg>