Place,Sex,Name,Event,Division,WeightClassKg,Equipment,BodyweightKg,Best3SquatKg,Best3BenchKg,Best3DeadliftKg,TotalKg,BirthYear
1,F,Faith Gilbert,SBD,T1,43,Single-ply,41.7,85,35,85,205,1998
1,F,Taylor LaChapelle,SBD,T1,47,Single-ply,45.8,140,65,145,350,1999
1,F,Rhiannon Mach,SBD,T1,57,Single-ply,56.5,130,55,120,305,1998
1,F,Hannah Poche,SBD,T1,57,Single-ply,55.1,107.5,67.5,117.5,292.5,1998
1,F,Amber Kierstyn,SBD,T1,72,Single-ply,71.3,142.5,77.5,142.5,362.5,1998
1,F,Cassie Guidry,SBD,T1,84+,Single-ply,126.3,155,85,142.5,382.5,1998
1,F,Melissa Reyes,SBD,T1,84+,Single-ply,84.7,155,72.5,152.5,380,1998
1,F,Stephanie Rattunde,SBD,T2,43,Single-ply,42.7,112.5,57.5,130,300,1997
2,F,Shanavia Black,SBD,T2,43,Single-ply,42.5,102.5,37.5,115,255,1997
1,F,Kassy Zamorano,SBD,T2,47,Single-ply,46.5,132.5,75,140,347.5,
2,F,Zyra Warfield,SBD,T2,47,Single-ply,46.4,90,40,102.5,232.5,1997
3,F,Amira Baloney,SBD,T2,47,Single-ply,46,77.5,42.5,90,210,1997
1,F,Tristyn Hutchins,SBD,T2,52,Single-ply,51.1,137.5,72.5,150,360,1997
2,F,Alejandra Elizondo,SBD,T2,52,Single-ply,52,127.5,72.5,135,335,
3,F,Janell Carrizales,SBD,T2,52,Single-ply,48.7,105,62.5,117.5,285,1996
4,F,Bethany Plaisance,SBD,T2,52,Single-ply,51.1,115,55,105,275,1997
1,F,Destiny Walker,SBD,T2,57,Single-ply,53.5,130,70,140,340,1996
2,F,Victoria Vicknair,SBD,T2,57,Single-ply,54.4,120,60,142.5,322.5,1997
1,F,Ja'Naija Miller,SBD,T2,63,Single-ply,60.5,140,67.5,162.5,370,1996
3,F,Tiara Jenkins,SBD,T2,63,Single-ply,62.6,140,60,140,340,1997
1,F,Delanie Hamilton,SBD,T2,63,Single-ply,58.8,125,65,135,325,1998
6,F,Carrigan Chauvin,SBD,T2,63,Single-ply,61.2,87.5,45,97.5,230,1996
1,F,Natalie Barrera,SBD,T2,72,Single-ply,69.9,165,97.5,152.5,415,1997
2,F,Molly Sorto,SBD,T2,72,Single-ply,66.5,135,57.5,150,342.5,1997
4,F,Natalie Picou,SBD,T2,72,Single-ply,66.9,115,47.5,110,272.5,1997
5,F,Jade Dardar,SBD,T2,72,Single-ply,66.2,87.5,47.5,130,265,1996
3,F,Brynna Shepard,SBD,T2,72,Single-ply,70.3,,60,140,200,1997
4,F,Shaina Hales,SBD,T2,72,Single-ply,68,,60,125,185,1996
5,F,Jaycee Courteaux,SBD,T2,72,Single-ply,70.4,,40,90,130,1997
1,F,Delicia Garza,SBD,T2,84,Single-ply,77.6,177.5,90,187.5,455,1996
2,F,Lacey Winters,SBD,T2,84,Single-ply,77.4,162.5,70,185,417.5,1997
1,F,Taylor Thomas,SBD,T2,84,Single-ply,83.4,157.5,80,172.5,410,1993
3,F,Amyri Davis,SBD,T2,84,Single-ply,79.7,137.5,92.5,162.5,392.5,1997
4,F,Arrial Harris,SBD,T2,84,Single-ply,80.4,145,62.5,177.5,385,1996
2,F,Amber Sawasaki,SBD,T2,84,Single-ply,72.6,97.5,42.5,115,255,1997
1,F,China Storks,SBD,T2,84+,Single-ply,101.1,197.5,112.5,207.5,517.5,1997
2,F,Heather Callejas,SBD,T2,84+,Single-ply,95.7,152.5,100,177.5,430,1997
3,F,Jasmine Davis,SBD,T2,84+,Single-ply,118.5,187.5,90,152.5,430,1996
4,F,Jacey Milton,SBD,T2,84+,Single-ply,98.8,160,82.5,125,367.5,1997
2,F,April St. Pierre,SBD,T2,84+,Single-ply,85,142.5,75,145,362.5,1997
1,F,Quinequa Hughes,SBD,T3,47,Single-ply,47,105,35,105,245,1995
2,F,Avery Huff,SBD,T3,47,Single-ply,46.8,85,30,97.5,212.5,1996
1,F,Ashley Garay,SBD,T3,52,Single-ply,51.1,147.5,67.5,150,365,1995
2,F,Brittany Weathersby,SBD,T3,52,Single-ply,51.9,120,50,125,295,1995
3,F,Kim Franklin,SBD,T3,52,Single-ply,50.9,117.5,52.5,107.5,277.5,1994
1,F,Ariel Bulmash,SBD,T3,57,Single-ply,54.5,152.5,115,172.5,440,1995
1,F,Aree' DeZort,SBD,T3,57,Single-ply,56.9,157.5,115,155,427.5,
2,F,Alyssa Galtan,SBD,T3,57,Single-ply,56.8,122.5,72.5,145,340,
3,F,Anna Kathryn Colbert,SBD,T3,57,Single-ply,56.6,130,50,125,305,
4,F,Giovanna Ortega,SBD,T3,57,Single-ply,56.9,,85,162.5,247.5,1994
1,F,Denisha Melancon,SBD,T3,63,Single-ply,62.5,165,77.5,185,427.5,1996
1,F,Laquanda Moffett,SBD,T3,72,Single-ply,72,180,70,192.5,442.5,1994
2,F,Leaja Batimon,SBD,T3,72,Single-ply,70.8,147.5,62.5,190,400,1995
1,F,Destiny Kliebert,SBD,T3,84,Single-ply,77.2,137.5,72.5,150,360,1995
2,F,Andrea Fields,SBD,T3,84,Single-ply,82.5,140,60,152.5,352.5,1995
3,F,Ty Jones,SBD,T3,84,Single-ply,77.1,97.5,52.5,115,265,
1,F,Desiree Trinidad,SBD,T3,84+,Single-ply,90.1,212.5,125,170,507.5,1995
1,F,Jaia Stewart,SBD,T3,84+,Single-ply,84.1,117.5,65,145,327.5,1995
2,F,Jerica Nichols,SBD,T3,84+,Single-ply,106.5,115,52.5,125,292.5,1995
2,F,Marlene Lapeyrouse,SBD,T3,84+,Single-ply,87.7,115,47.5,125,287.5,1995
3,F,Allison Garcia,SBD,T3,84+,Single-ply,112.3,,,175,175,1995
1,F,Kayli Alphonso,SBD,JR,52,Single-ply,51.6,157.5,100,152.5,410,1993
1,F,Michelle Van Dusen,SBD,JR,57,Single-ply,54.5,180,82.5,177.5,440,1993
1,F,Beverly Crawford,SBD,JR,63,Single-ply,62.7,185,95,185,465,1992
2,F,Stephanie Hamilton,SBD,JR,63,Single-ply,61.6,125,90,130,345,1992
3,F,Jodie Forsse,SBD,JR,63,Single-ply,60.2,125,,140,265,1990
2,F,Cierra Bernard,SBD,JR,72,Single-ply,70.1,140,72.5,170,382.5,1994
3,F,Stacie Pomrening,SBD,JR,72,Single-ply,70.8,,105,,105,1992
1,M,Alex Jackson,SBD,JR,74,Single-ply,72,202.5,130,190,522.5,1991
1,F,Mariah Hamm,SBD,JR,84,Single-ply,82.8,227.5,137.5,192.5,557.5,1992
1,F,Julia Shropshire,SBD,JR,84,Single-ply,81.6,165,75,160,400,1994
1,F,Alexis Wascom,SBD,JR,84+,Single-ply,111.2,192.5,115,205,512.5,1994
2,F,Alyssa Babineaux,SBD,JR,84+,Single-ply,110.2,150,87.5,135,372.5,1994
1,F,Shyanne Naquin,SBD,Y2,47,Single-ply,46.8,100,52.5,90,242.5,2000
1,F,Pauline MacAulay,SBD,Y2,84,Single-ply,78.7,55,32.5,87.5,175,2001
1,F,Macy Lambert,SBD,Y2,84+,Single-ply,106.4,162.5,47.5,135,345,2001
1,F,Taylor LaChapelle,SBD,O,47,Single-ply,45.8,140,65,145,350,1999
2,F,Zigler Ana,SBD,O,47,Single-ply,44.7,125,72.5,137.5,335,1987
3,F,Susan Elwyn,SBD,O,47,Single-ply,45.7,97.5,52.5,120,270,1947
1,F,Suzanne Hartwig-Gary,SBD,O,52,Single-ply,51.6,177.5,92.5,170,440,1968
2,F,Ren Yamashita,SBD,O,52,Single-ply,51.2,165,100,167.5,432.5,1989
3,F,Juanita Najera,SBD,O,52,Single-ply,51.5,152.5,90,170,412.5,1981
4,F,Kayli Alphonso,SBD,O,52,Single-ply,51.6,157.5,100,152.5,410,1993
5,F,Maura Shuttleworth,SBD,O,52,Single-ply,51.8,127.5,102.5,137.5,367.5,1976
1,F,Rowena Lopez,SBD,O,57,Single-ply,55.5,175,120,187.5,482.5,1977
2,F,Katherine Kasabuske,SBD,O,57,Single-ply,55.1,167.5,97.5,180,445,1980
3,F,Michelle Van Dusen,SBD,O,57,Single-ply,54.5,180,82.5,177.5,440,1993
4,F,Ariel Bulmash,SBD,O,57,Single-ply,54.5,152.5,115,172.5,440,1995
5,F,Danielle Bennett,SBD,O,57,Single-ply,55.6,170,92.5,147.5,410,1986
6,F,Melissa Hunt,SBD,O,57,Single-ply,55.7,115,75,140,330,
1,F,Jessica Stewart,SBD,O,57,Single-ply,56.3,112.5,67.5,120,300,1985
2,F,Giovanna Ortega,SBD,O,57,Single-ply,56.9,,85,162.5,247.5,1994
2,F,Katie Van Dusen,SBD,O,63,Single-ply,62.3,202.5,125,175,502.5,1988
3,F,Beverly Crawford,SBD,O,63,Single-ply,62.7,185,95,185,465,1992
4,F,Jennifer Rey-Gaudreau,SBD,O,63,Single-ply,61.4,172.5,102.5,165,440,1971
5,F,Lara Sturm,SBD,O,63,Single-ply,62.5,172.5,95,157.5,425,1968
6,F,Trish Southerland,SBD,O,63,Single-ply,60.8,147.5,90,155,392.5,1988
1,F,Priscilla Ribic,SBD,O,72,Single-ply,71.9,227.5,145,235,607.5,1972
1,F,Alyssa Hitchcock,SBD,O,72,Single-ply,67.4,215,120,235,570,1984
2,F,Jill Joiner-Wong,SBD,O,72,Single-ply,67.9,160,90,170,420,1969
3,F,Colleen Hansford,SBD,O,72,Single-ply,71,170,90,155,415,1968
4,F,Stacie Pomrening,SBD,O,72,Single-ply,70.8,,105,,105,1992
1,F,Liane Blyn,SBD,O,84,Single-ply,82.1,227.5,177.5,217.5,622.5,1972
2,F,Laura Styrlund,SBD,O,84,Single-ply,82.3,175,120,185,480,1964
1,F,Bonica Brown,SBD,O,84+,Single-ply,122.6,247.5,177.5,210,635,1988
2,F,Tiffany McKinney,SBD,O,84+,Single-ply,97.4,235,202.5,195,632.5,1989
1,F,Ariel Parker,SBD,O,84+,Single-ply,89.2,245,122.5,182.5,550,1990
3,F,Alexis Wascom,SBD,O,84+,Single-ply,111.2,192.5,115,205,512.5,1994
2,F,Jill Arnow,SBD,O,84+,Single-ply,88.6,172.5,120,177.5,470,1959
4,F,Alyssa Babineaux,SBD,O,84+,Single-ply,110.2,150,87.5,135,372.5,1994
5,F,Andrea Page,SBD,O,84+,Single-ply,120.2,,125,205,330,1977
6,F,Allison Garcia,SBD,O,84+,Single-ply,112.3,,,175,175,1995
1,F,Jennifer Rey-Gaudreau,SBD,M1a,63,Single-ply,61.4,172.5,102.5,165,440,1971
2,F,Janel Brown,SBD,M1a,63,Single-ply,60.5,142.5,65,142.5,350,1973
1,F,Priscilla Ribic,SBD,M1a,72,Single-ply,71.9,227.5,145,235,607.5,1972
2,F,Jill Joiner-Wong,SBD,M1a,72,Single-ply,67.9,160,90,170,420,1969
1,F,Liane Blyn,SBD,M1a,84,Single-ply,82.1,227.5,177.5,217.5,622.5,1972
2,F,Rachele Unson,SBD,M1a,84,Single-ply,78.4,145,105,152.5,402.5,
3,F,Sarah Bohlen,SBD,M1a,84,Single-ply,78.7,147.5,85,152.5,385,1969
1,F,Tammy Cutrona,SBD,M1b,52,Single-ply,51.7,115,75,127.5,317.5,1966
1,F,Lara Sturm,SBD,M1b,63,Single-ply,62.5,172.5,95,157.5,425,1968
2,F,Joni Mach,SBD,M1b,63,Single-ply,60.5,130,67.5,132.5,330,1965
3,F,Cathy Belben,SBD,M1b,63,Single-ply,61.6,115,55,120,290,1967
1,F,Colleen Hansford,SBD,M1b,72,Single-ply,71,170,90,155,415,1968
1,F,Laura Styrlund,SBD,M1b,84,Single-ply,82.3,175,120,185,480,1964
2,F,Rhonda Clark,SBD,M1b,84,Single-ply,75.3,167.5,90,202.5,460,1965
1,F,Kimberly Price,SBD,M2a,47,Single-ply,46.4,105,57.5,132.5,295,1962
1,F,Antoinette Kemper,SBD,M2a,57,Single-ply,55.2,150,87.5,155,392.5,1964
1,F,Lynne Homan,SBD,M2a,57,Single-ply,56.7,127.5,93,155,375.5,1962
1,F,Karen Blessington,SBD,M2a,57,Single-ply,56,100,70,137.5,307.5,1960
1,F,Caryn Daniel,SBD,M2a,63,Single-ply,61.9,117.5,65,120,302.5,1963
1,F,Donna Marts,SBD,M2a,72,Single-ply,70.8,160,107.5,170,437.5,1960
2,F,Chandra Armstead,SBD,M2a,84,Single-ply,73.4,102.5,65,122.5,290,1961
1,F,Jill Arnow,SBD,M2a,84+,Single-ply,88.6,172.5,120,177.5,470,1959
1,F,Monica Sobotka,SBD,M2b,57,Single-ply,57,100,,,100,1958
1,F,Sue Hallen,SBD,M2b,84+,Single-ply,104,140,90,150,380,1957
1,F,Annemarie Kemmerer,SBD,M3a,63,Single-ply,61.8,112.5,62.5,137.5,312.5,
1,F,Alma Kimura,SBD,M3a,72,Single-ply,71.7,130,70,135,335,1954
1,F,Susan Elwyn,SBD,M3b,47,Single-ply,45.7,97.5,52.5,120,270,1947
1,F,Denise Johnson,SBD,M3b,57,Single-ply,52.3,50,35,77.5,162.5,1947
1,F,Helen White,SBD,M3b,63,Single-ply,59.7,87.5,60,117.5,265,1945
1,F,Gail Moore,SBD,M3b,72,Single-ply,70.8,142.5,87.5,150,380,1947
2,F,Marsha Serre,SBD,M3b,72,Single-ply,70.5,107.5,37.5,137.5,282.5,1946
1,F,Marie Laurence,SBD,M4a,52,Single-ply,51.5,52.5,32.5,82.5,167.5,1942
1,F,Regina Hackney,SBD,M4b,84,Single-ply,82.1,85,72.5,122.5,280,1939
