Address of gint[0][0]: 00bfca60
Address of gint[0][1]: 00bfca64
Address of gint[0][2]: 00bfca68
Address of gint[1][0]: 00bfca6c
Address of gint[1][1]: 00bfca70
Address of gint[1][2]: 00bfca74
Address of gint[2][0]: 00bfca78
Address of gint[2][1]: 00bfca7c
Address of gint[2][2]: 00bfca80
