Return-Path: <root>
Received: by sunni.qualcomm.com. (SMI-8.6/SMI-SVR4)
	id LAA27969; Fri, 1 May 1998 11:39:00 -0700
Received: from oneworld.wa.com (oneworld.new-era.com [208.133.44.6]) by new-era.com (8.7.6/8.7.3) with SMTP id NAA26556 for <lgl@island-resort.com>; Wed, 30 Apr 1997 13:27:19 -0400
Received: by oneworld.wa.com (Smail3.1.29.1/NeXT 3.2)
	id m0wMczr-00074KC; Wed, 30 Apr 97 10:16 PDT
		  to Bahai-Tech-Request@BCCA.Org
X-Loop: Bahai-Tech-request@Bounty.BCCA.Org
Errors-To: Bahai-Tech-x@Bounty.BCCA.Org
Sender: Bahai-Tech-x@Bounty.BCCA.Org
X-IMPORTANT-NOTE: Please send unsubscribe messages
		  to Bahai-Tech-Request@BCCA.Org
To: "Baha'i Tech" <Bahai-Tech@BCCA.Org>
Mime-Version: 1.0
X-Priority: 3
Message-Id: <01E69D15DBBAD01189AC00609798672C0A25@zeus.commercialair.com>
Subject: Did anyone here go through the SCO Ace training?
X-Mailer: Internet Mail Service (5.0.1457.3)
Date: Wed, 30 Apr 1997 13:17:41 +0100
From: Kevin Genus <kdgenus@commercialair.com>
Content-Transfer-Encoding: quoted-printable
Content-Type: text/html
X-UIDL: :nb!!P5W!!h/3!!/K]d9
Status: RO

<!DOCTYPE HTML PUBLIC "-//W3C//DTD HTML 3.2//EN">
<HTML>
<HEAD>
<META HTTP-EQUIV=3D"Content-Type" CONTENT=3D"text/html; =
charset=3Dus-ascii">
<META NAME=3D"Generator" CONTENT=3D"MS Exchange Server version =
5.0.1457.3">

</HEAD>
<BODY>
<P>&nbsp;&nbsp;&nbsp;&nbsp;&nbsp;&nbsp;&nbsp; <FONT SIZE=3D2>Just =
wondering ... I'm going through it now and it just seemed a little bit =
on the easy side.&nbsp; The other question is if you 'actually' saw any =
benefit after having it.</FONT></P>
<BR>
<P><FONT SIZE=3D2>-Kevin</FONT>
</P>

</BODY>
</HTML>




