Return-Path: <root>
Received: by sunni.qualcomm.com. (SMI-8.6/SMI-SVR4)
	id XAA08858; Sun, 26 Apr 1998 23:22:06 -0700
Message-Id: <199804270622.XAA08858@sunni.qualcomm.com.>
X-Mailer: Direct Written out
Date: Sun, 26 Apr 1998 16:19:22 -0700
To: qpop@sunni.qualcomm.com
From: Praveen Yaramada <pyaramad@qualcomm.com>
Subject: A Test Message, Styled, Image
Mime-Version: 1.0
Content-Type: multipart/alternative;
	boundary="=====================_778346078==_.ALT"
X-UIDL: Ec"!!^`@e9I~)!!X1_d9
Status: RO

--=====================_778346078==_.ALT
Content-Type: text/plain; charset="us-ascii"


PLAIN Text here. Styled part
<http://hotsun.qualcomm.com/>a small size text

Eudora_h.bmp

Eudora_n.bmp

Eudora is HOT

--=====================_778346078==_.ALT
Content-Type: multipart/related;
	type="text/html";
	boundary="=====================_778346062==_.REL"

--=====================_778346062==_.REL
Content-Type: text/html; charset="us-ascii"

<html>
<br>
HTML Text here. <tt><font size=7 color="#0000FF">Styled part<br>
</font><font size=1 color="#0000FF"><a href="http://hotsun.qualcomm.com/">a
small size text</a><br>
<br>
<img src="cid:4.0.1.332.19980426161548.00dab3a0@sunni.qualcomm.com.0" width=48 height=48 alt="Eudora_h.bmp"><br>
<br>
<img src="cid:4.0.1.332.19980426161548.00dab3a0@sunni.qualcomm.com.1" width=48 height=48 alt="Eudora_n.bmp"><br>
<font size=1 color="#0000FF">Eudora is HOT<br>
</font></i></html>

--=====================_778346062==_.REL
Content-Type: application/octet-stream; name="Eudora_h.bmp";
 x-mac-type="424D5070"; x-mac-creator="4A565752"
Content-ID: <4.0.1.332.19980426161548.00dab3a0@sunni.qualcomm.com.0>
Content-Transfer-Encoding: base64
Content-Disposition: inline; filename="Eudora_h.bmp"

Qk32BAAAAAAAAHYAAAAoAAAAMAAAADAAAAABAAQAAAAAAIAEAAAAAAAAAAAAAAAAAAAAAAAAAAAA
AAAAgAAAgAAAAICAAIAAAACAAIAAgIAAAMDAwACAgIAAAAD/AAD/AAAA//8A/wAAAP8A/wD//wAA
////AA///////////////////////////////wD//////////////////////////////wCIiIiI
iIiIiIiIiIiIiIiIiIiIiIiI/wCIiIiIiIiIiIiIiIiIiIiIiIiIiIiI/wCIAACIAIiAAIgAiAiI
AAiAiIgIiACI/wCICIiAiAgIgICICAiAiAiAiIgIgIgI/wCICIiAiAgIgICICAiAiAiAiIgIgIgI
/wCIAAiAiAgIgICICACAiAiAAIgAgIgI/wCICIiAiAiAAIgAiAgIAAiAiAgICACI/wCICIiIiIiI
gIiIiIiIiIiAiAiIiIiI/
--=====================_778346062==_.REL
Content-Type: application/octet-stream; name="Eudora_n.bmp";
Content-ID: <4.0.1.332.19980426161548.00dab3a0@sunni.qualcomm.com.1>
Content-Transfer-Encoding: base64
Content-Disposition: inline; filename="Eudora_n.bmp"

Qk32BAAAAAAAAHYAAAAoAAAAMAAAADAAAAABAAQAAAAAAIAEAAAAAAAAAAAAAAAAAAAAAAAAAAAA
AAAAgAAAgAAAAICAAIAAAACAAIAAgIAAAMDAwACAgIAAAAD/AAD/AAAA//8A/wAAAP8A/wD//wAA
////AI///////////////////////////////4j//////////////////////////////4h3d3d3
iIiIiIiIiIiIiIiIiIiIiA==
--=====================_778346062==_.REL--
--=====================_778346078==_.ALT--




