Return-Path: <root>
Received: by sunni.qualcomm.com. (SMI-8.6/SMI-SVR4)
	id LAA27727; Fri, 1 May 1998 11:28:36 -0700
Message-Id: <199805011828.LAA27727@sunni.qualcomm.com.>
Date: Thu, 2 Jan 1992 12:21:18 -0800 (PST)
From: Laurence Lundblade <lgl@cac.washington.edu>
Subject: Pine source distribution
To: Bill Bathurst <bill@cpac.washington.edu>
MIME-Version: 1.0
Content-Type: text/html
X-UIDL: d\C!!*6H!!;0/e9J#~e9
Status: RO


<html>
<head>
   <title></title>
   <meta name="Author" content="The Grinch">
   <meta name="GENERATOR" content="Mozilla/2.01Gold (Win32)">
</head>
<body text="#1C6AA4" bgcolor="#C0C0C0" link="#0000EE" vlink="#551A8B" alink="#FF0000">

<h3>Hueiras Residence 
<hr width="100%" ></h3>

<p><img src="hr_dway4.jpg" border=0 height=163 width=250><a href="hr_dway3.jpg">Full
size image</a></p>

<p>The Hueiras residence is located on lake Tapps, near Tacoma, Washington.</p>

<p>
<hr width="100%" ></p>

<p>[<a href="barbara.htm">Barbara's Main Page</a>] [<a href="index.htm">Island
Resort</a>] [<a href="hindex.htm">Index</a>]</p>

Here's some weird characters:
AElig:&AElig;<br>
A pair of ampersands:&AMP&amp;<br>
y Umlaut:&yuml;<br>
super 3:&sup3;<br>
not:&not;<br>
A Umlaut:&auml;<br>
ae ligature:&aelig; <br>
O accute:&oacute; <br>
Quote:&QUOT; <br>
Thorn: &THORN; <br>


These are entities that are not normally understood:
&foo;&goo;&zoo;
&thisisaverylongentitywhatwillshow;


</body>
</html>



