Return-Path: <root>
Received: by sunni.qualcomm.com. (SMI-8.6/SMI-SVR4)
	id TAA24765; Thu, 30 Apr 1998 19:24:58 -0700
Received: from nala.qualcomm.com (nala.qualcomm.com [129.46.50.44])
	by booray.new-era.com (8.8.5/8.8.5) with ESMTP id VAA05358
	for <lgl@island-resort.com>; Tue, 30 Sep 1997 21:08:41 -0400
Received: from [129.46.137.174] (llundblade-mac.qualcomm.com [129.46.137.174]) by nala.qualcomm.com (8.8.5/1.4/8.7.2/1.13) with ESMTP id SAA01897 for <lgl@island-resort.com>; Tue, 30 Sep 1997 18:08:24 -0700 (PDT)
X-Sender: llundbla@mrw.qualcomm.com
Message-Id: <v04001326b0574c1ecbca@[129.46.137.174]>
Mime-Version: 1.0
Date: Tue, 30 Sep 1997 17:39:41 -0700
To: lgl@island-resort.com
From: Laurence Lundblade <lgl@qualcomm.com>
Subject: test: a binhexed attachment
Content-Type: multipart/mixed; boundary="============_-1336454508==_============"
X-UIDL: mWDe9<(9!!kpE!!Z?C!!
Status: RO

--============_-1336454508==_============
Content-Type: text/plain; charset="us-ascii"

this is text....


--============_-1336454508==_============
Content-Id: <v04001326b0574c1ecbca@[129.46.137.174].1>
Content-Type: application/mac-binhex40; name="LLundblade.key"
Content-Disposition: attachment; filename="LLundblade.key"
 ; modification-date="Tue, 2 Jul 1996 16:29:37 -0700"

(This file must be converted with BinHex 4.0)

:$Na-G@jNBQaKC'8ZDf9j!#j,49P&6P4b!3!!!!CN!!!"(JHU@f0Z28aKGA*PEQ0
P)%aeEQ4LE'&NC9d06@&RD@-J6R9YBQ9b289ZG(*eFh3J5f9j)%CTE'804@jMFRP
`G'P[EN0PFR4TCQPMBA4P28e*58*+4%0#-9&*48eNE'TdHN&)3QG9FN4R680"HN&
S69)iGdK4@84@89&%4AKD8PC9$9pMEfjdD@jeC9mp4Ne4-$P19&0#4Q*Z8RPN@%i
`589'Df*AE(903ePB494V-Ne%BhG0DN9i684"H8ejFhG24%&h4RK&GdjU33eIBfp
ZG'PZG@9I26004%Pi694"GdeU6A*04'Gh684"C%e5FhG(89P%9P&44%9i5NeC@&C
j@PFeDPT63NeN9c9V@@eiD&T(9AF0Af0[ER4TER9PAceADN&-3QGVF@KVD8FjGc"
#39&&4&0h3AG638T"FNe"1%jf0h0*GMP"3NYPFR-eCQ989hTC9A"S3NP6GR4f$9p
MEfjdD@jeC9mp8N)cD83[3c"N4%Pk-dpjH%*Z89Pd,e"f0RBd@&T5-&*Z@'KR0c&
@8f0SD8`dCN`a9fG,C9&*48&"38&"HJeIBfpZG'PZG@9I28&)3QG9FN4R680"Gdj
#38&5CdP-1&"a3h%d9QT'DPK(5ACcGf4(Edj,C5Y*0%a#-dTRELY'-%KjE&K-5dm
0Af0[ER4TER9PAceKF8%[G&0"6NaAGfKC8$C",hSV8c*P9QTACdSjCh9&F9KP9&G
RGe0R23e6D@GZD@jR3f9bG'PQD@0KG'8p68P*3NT%3d)a88P&6@4XDR4U38K#Ce9
b4'G03d&k3@K08MKh5&&C4&C4884&H&T59P9'69%0Af0[ER4TER9PAcd`18j88d*
'BQj5H@4B6M"*48CVBPGXG8e$@9K&9'Xb684MGdeU4AK04%&j6@PcGdp%3AG'H%9
h6QT"-de%$9pMEfjdD@jeC9mp5AK09%&h6@T*FNe%ChG04%&N69*cGdG4@84@89&
%4AK+69PB9RPD9c9U@P0#6@4A0@YCEAKS@NG9GeGU33eIBfpZG'PZG@9I28a#CfY
aD'YT4cPh-%*"889%8hG"Ge0"5N%b-@YM6QC@D@YL35phDPPe0d0D-8e,4fj,Bf9
34$Ce-h-f9Q80Af0[ER4TER9PAcdc1&0#9%p)6Q4A58eb5Q4#0d4V69"KER&[38p
"+cC*4'0eDQe"989PBA%hD'*e594@GdP&38&"38&k38K#$9pMEfjdD@jeC9mpCe9
b4'G03d&h6N*"4N465ePN8@T'8M9ABh90Gf9+08T95%p-4'CK0$K@8A3i8d9&F%a
46fec9("b0$Gh63eIBfpZG'PZG@9I2@4T36"Y0940@NBf4(TA-RKbDc4,D@YcD(J
fChBjGR"@-&BV8NNp$80K3f9bG'PQD@0KG'8p68P*3NY%3d)b88P&6@4XD&Kk38K
#Ce9b4'G03d&k3@K08MKh5&&C4&C4884&H&T59P9'69%`18j88`eIBfpZG'PZG@9
I28*'BQj5H@4B6M"*48CVBPGXG8e$@9K&9'Xb684MGdeU4AG19%&j6APcGdp%3AG
'H%9h6QT"-de%5AK04&80Af0[ER4TER9PAceh6@T0FNe%ChG04%&S69)iGdK4@84
@89&%4AKD8PC94Ne4-$P19&0#4Q*Z8RPN@%i`589'Df*AE(904Qph$9pMEfjdD@j
eC9mp3hGC5NY[@NPSGQ0139&&3N%`Fd&04@G$88j#GACRC8TM+e4-3f4586C,5'Y
U5NK*5QKA4cK(EA*bHRCaFJeIBfpZG'PZG@9I28Ci6h"A6QPKG&9[-6Ja9NGh0hG
Y5d&6EcK`BfYPGc&M96PPFP0@18K+19TZH&!b8%Yc3d*"38&"38eh3RF0Af0[ER4
TER9PAceC4NYh0%4"Cde%89&#8d4D4&&CBd8`9RCdE(Sa9f04HQib4dBVCc9b38G
"C&41DLXd4NP,@8PABMK,99K3$9pMEfjdD@jeC9mpD%jc390B4$G%Dda096K88%a
CFf0U0%p-FdT[4M99F8pkHN4&C`e%BA4K8fPREQ&dGA*P29PXCe*f48&Q0A&e+eT
a58PaGP"&BdKj8h)[-Npe66Ni6M"BG&8j6dj$4A0V@9!iCe!dHNXb5f454R%0Af0
[ER4TER9PAcehEPTcD$JiD&9P5fP2D@Y&-89XFc"D6M06G("h26d0$6-V!!!"!!!
!!3!!!!!!!!!!(NjH6R919[q@51FI'("3,8$rq&@2,bi!##mZ!!`[2'KQ$Na-G@j
NBQaKC'8ZDf9jC!)!!J!Z5d9C48j8FJ%!!48#!#j,49P&6P4b!3!"&30H!!!!!!!
!!!!!!!!!!!!!!!!!VIlqm3!!"Q3!!!%H!2iJE[qBS#NJE[qB)&!YD!!-rj`JE[q
B*P"(k`!3F!!Y32qJB!!!c#!6X+i!&'B!!,C`!"m!UCYCMbm62bX!"UQJ,9rrT(!
"(`#TQk4KiS!Y32rm@Bm[,[qNUD8U(lUZrra9`d3$C`3J"@!%)#lrr#e!rrbK(LK
))!aQ#Memrj3!'!!!!3!!!!%!!!!!!!!!!"i!!!!!!!!!!!!F!"lrrj-`:
--============_-1336454508==_============--



