Return-Path: <root>
Received: by sunni.qualcomm.com. (SMI-8.6/SMI-SVR4)
	id MAA28093; Fri, 1 May 1998 12:07:42 -0700
Message-Id: <199805011907.MAA28093@sunni.qualcomm.com.>
Date: Thu, 2 Jan 1992 12:21:18 -0800 (PST)
From: Laurence Lundblade <lgl@cac.washington.edu>
Reply-To: Laurence Lundblade <lgl@cac.washington.edu>
Subject: Pine source distribution
To: Bill Bathurst <bill@cpac.washington.edu>
MIME-Version: 1.0
Content-Type: multipart/mixed; boundary = level1
X-UIDL: Dl2e9@b%!!SZpd9f#Z!!
Status: RO

--level1

Text of level 1 part

--level1
content-type: multipart/mixed; boundary=level2

--level2

Text of level 2 part

--level2
content-type: multipart/mixed; boundary=level3

--level3

Text of level 3 part

--level3
content-type: multipart/mixed; boundary=level4

--level4

Text of level 4 part

--level4
content-type: multipart/mixed; boundary=level5

--level5

Text of level 5 part

--level5
content-type: multipart/mixed; boundary=level6

--level6

Text of level 6 part

--level6
content-type: multipart/mixed; boundary=level7

--level7

Text of level 7 part

--level7--
--level6--
--level5--

--level4

Trailing level 4 text

--level4--
--level3--
--level2--

--level1

Trailing level 1 text

--level1--



