Return-Path: <root>
Received: by sunni.qualcomm.com. (SMI-8.6/SMI-SVR4)
	id LAA27979; Fri, 1 May 1998 11:39:05 -0700
Received: from bcca.org (bounty.bcca.org [208.133.44.40])
	by booray.new-era.com (8.8.5/8.8.5) with SMTP id JAA04055
	for <lgl@island-resort.com>; Fri, 19 Sep 1997 09:00:37 -0400
Received: by bcca.org (Smail3.1.29.1 #3)
	id m0xC2c8-0003txC; Fri, 19 Sep 97 08:56 EDT
		  to Bahai-Women-Request@BCCA.Org
X-Loop: Bahai-Women-request@Bounty.BCCA.Org
Errors-To: Bahai-Women-x@Bounty.BCCA.Org
Sender: Bahai-Women-x@Bounty.BCCA.Org
X-IMPORTANT-NOTE: Please send unsubscribe messages
		  to Bahai-Women-Request@BCCA.Org
To: "Baha'i Women Converse" <Bahai-Women@BCCA.Org>
Mime-Version: 1.0
Message-Id: <342275FD.3B7B26D4@access.mountain.net>
Subject: index2
X-Mailer: Mozilla 4.03 [en] (Win95; U)
From: Stephanie Heck <bahai@access.mountain.net>
Date: Fri, 19 Sep 1997 08:54:21 -0400
Content-Type: multipart/mixed; boundary="------------527FB4238546A2E7E34FBB42"
X-UIDL: &'U!!eT:!!5*@e9\Nk!!
Status: RO

This is a multi-part message in MIME format.
--------------527FB4238546A2E7E34FBB42
Content-Type: text/plain; charset=us-ascii
Content-Transfer-Encoding: 7bit

Attached to this page is a Baha'i page .when you click on the link it
reads the Unity prayer in about one minute.All you need is a computer
with speakers.Im trying to make it easy for you to recieve voice files.
http://www.tristate-online.com/bahai/unity.html

--------------527FB4238546A2E7E34FBB42
Content-Type: text/html; charset=us-ascii; name="unity.html"
Content-Transfer-Encoding: 7bit
Content-Disposition: inline; filename="unity.html"
Content-Base: "http://www.tristate-online.com/bahai/u
	nity.html"

<HTML>
<HEAD>
   <META HTTP-EQUIV="Content-Type" CONTENT="text/html; charset=iso-8859-1">
   <META NAME="Author" CONTENT="Stephanie Heck">
   <META NAME="GENERATOR" CONTENT="Mozilla/4.03 [en] (Win95; U) [Netscape]">
   <META NAME="Description" CONTENT="Bahai Faith">
   <META NAME="KeyWords" CONTENT="bahai,bahai,bahai,bahai,bahai,bahai,bahai">
   <TITLE>index2</TITLE>
</HEAD>
<BODY BACKGROUND="19star3.gif">
&nbsp;
<BR>&nbsp;
<BR>&nbsp;
<BR>&nbsp;
<BR>&nbsp;
<BR>&nbsp;
<BR>&nbsp;
<BR>&nbsp;
<BR>&nbsp;
<BR>&nbsp;
<BR>&nbsp;
<CENTER><TABLE BORDER=3 WIDTH="100%" BGCOLOR="#CC6600" >
<TR>
<TD><B><FONT COLOR="#FFFFFF"><FONT SIZE=+3>GREETINGS FRIENDS .</FONT></FONT></B>&nbsp;
<BR><B><FONT COLOR="#FFFFFF">CLICK ON THIS LINK ...<FONT SIZE=+3><A HREF="unity.wav">VOICE
/ UNITY PRAYER&nbsp;</A></FONT></FONT></B>&nbsp;
<BR><B><FONT COLOR="#FFFFFF">A VOICE GREETING FROM THE BAHA'I PRAYERS AS
READ BY</FONT></B>
<BR><B><FONT COLOR="#FFFFFF">STEPHANIE HECK.</FONT></B>&nbsp;

<P><B><FONT COLOR="#FFFFFF"><FONT SIZE=+1>I AM A MEMBER OF THE BAHA'I FAITH&nbsp;</FONT></FONT></B>&nbsp;

<P><B><FONT COLOR="#FFFFFF"><FONT SIZE=+1>"In just over 100 years, the
Baha'i Faith [Founded by Baha'u'llah (1817 -</FONT></FONT></B>&nbsp;
<BR><B><FONT COLOR="#FFFFFF"><FONT SIZE=+1>1892) has grown from an obscure
movement in the Middle East to the</FONT></FONT></B>&nbsp;
<BR><B><FONT COLOR="#FFFFFF"><FONT SIZE=+1>second-most widespread of the
independent world religions. Embracing</FONT></FONT></B>&nbsp;
<BR><B><FONT COLOR="#FFFFFF"><FONT SIZE=+1>people from more than 2,100
ethnic, racial and tribal groups, it is quite likely the most diverse organized
body of people on the planet. Its unity challenges</FONT></FONT></B>&nbsp;
<BR><B><FONT COLOR="#FFFFFF"><FONT SIZE=+1>prevailing theories about human
nature and the prospects for our common</FONT></FONT></B>&nbsp;
<BR><B><FONT COLOR="#FFFFFF"><FONT SIZE=+1>future.&nbsp;&nbsp;</FONT></FONT></B>&nbsp;
<BR><B><FONT COLOR="#FFFFFF"><FONT SIZE=+1>The main theme of Baha'u'llah's
message is unity. He taught that there is only</FONT></FONT></B>&nbsp;
<BR><B><FONT COLOR="#FFFFFF"><FONT SIZE=+1>one God, that all the world's
religions represent one changeless and eternal</FONT></FONT></B>&nbsp;
<BR><B><FONT COLOR="#FFFFFF"><FONT SIZE=+1>Faith of God, and that all humanity
is one race, destined to live in peace and</FONT></FONT></B>&nbsp;
<BR><B><FONT COLOR="#FFFFFF"><FONT SIZE=+1>harmony." --- Excerpted from
The Baha'is, a publication of the Baha'i</FONT></FONT></B>&nbsp;
<BR><B><FONT COLOR="#FFFFFF"><FONT SIZE=+1>International Community.&nbsp;&nbsp;</FONT></FONT></B>&nbsp;

<P><B><FONT COLOR="#FFFFFF"><FONT SIZE=+3>BAHA'I LINKS&nbsp;</FONT></FONT></B>&nbsp;
<BR><B><FONT COLOR="#FFFFFF"><FONT SIZE=+3>&nbsp;&nbsp;&nbsp;&nbsp;&nbsp;&nbsp;&nbsp;</FONT></FONT></B>&nbsp;
<BR><B><FONT COLOR="#FFFFFF"><FONT SIZE=+3>&nbsp;&nbsp;&nbsp;&nbsp;&nbsp;&nbsp;&nbsp;&nbsp;&nbsp;</FONT></FONT></B>&nbsp;
<BR>&nbsp;</TD>
</TR>
</TABLE></CENTER>
<FONT COLOR="#FFFFFF"><FONT SIZE=+3>&nbsp;</FONT></FONT>
</BODY>
</HTML>

--------------527FB4238546A2E7E34FBB42--



