Return-Path: <root>
Received: by sunni.qualcomm.com. (SMI-8.6/SMI-SVR4)
	id MAA28140; Fri, 1 May 1998 12:13:19 -0700
Received: from nala.qualcomm.com (nala.qualcomm.com [129.46.50.44])
	by booray.new-era.com (8.8.5/8.8.5) with ESMTP id TAA24777
	for <lgl@island-resort.com>; Thu, 2 Oct 1997 19:58:26 -0400
Received: from llundbla (llundblade.qualcomm.com [129.46.137.63]) by nala.qualcomm.com (8.8.5/1.4/8.7.2/1.13) with ESMTP id QAA21356; Thu, 2 Oct 1997 16:57:54 -0700 (PDT)
Message-ID: <34343205.F6BC57E3@booray.new-era.com>
Date: Thu, 02 Oct 1997 16:45:10 -0700
From: Laurence Lundblade <lgl@booray.new-era.com>
X-Mailer: Mozilla 4.01 [en] (WinNT; I)
MIME-Version: 1.0
To: lgl@island-resort.com, lgl@qualcomm.com
Subject: test
X-Priority: 3 (Normal)
Content-Transfer-Encoding: 7bit
Content-Type: text/html; charset=us-ascii
X-UIDL: S>Ke9=\$"!mo3!!E:Xd9
Status: RO

<HTML>
<U>This is HTML only</U>
<BR>&nbsp;</HTML>



