Return-Path: <root>
Received: by sunni.qualcomm.com. (SMI-8.6/SMI-SVR4)
	id MAA28078; Fri, 1 May 1998 12:05:49 -0700
Message-Id: <199805011905.MAA28078@sunni.qualcomm.com.>
Date: Thu, 2 Jan 1992 12:21:18 -0800 (PST)
From: Laurence Lundblade <lgl@cac.washington.edu>
Sender: Laurence Lundblade <lgl@cac.washington.edu>
Reply-To: Laurence Lundblade <lgl@cac.washington.edu>
Subject: Pine source distribution
To: Bill Bathurst <bill@cpac.washington.edu>
yyy: extra header
xx: extra header
MIME-Version: 1.0
Content-Type: "multipart"
 /
 (slkdfjslkfj) 
 alternative (sdlfkj_ ) ;
 boundary
 =
 "\A\b\C"
X-UIDL: K(od94WU!!f@md9,Vp!!
Status: RO


--AbC
content-type: multipart/mixed; boundary=xxx

--xxx
content-type: text/enriched

This is is the start of a token: <<


Greetings,
<bold>  This message is to let you know the official Pine 2.0 </bold>source release
date will be Jan 17, 1992. We're sorry we didn't <p>quite make the December
release date. We want to make sure we've got our act together. The
January<p>
<nofill>
This is
a single
line
</nofill>
These

are

on separate

lines

<color><param>
red
</param>What color is this
line<color>

--xxx
content-type: application/xxxxxxxxxxxxxxxxxxxxxxxxxxxxxxxxxxxxxxxxxxxxxxxxxxyyyyyyyyyyzzzzzzzzzzaaaaaaaaaabbbbbbbbbbcccccccccc
content-disposition: attachment; filename="a123456789b123456789c123456789d123456789e123456789f123456789g123456789h123456789i123456789j123456789.QCP"
content-description: A third alternative....

release is firm and we don't expect it to slip. I'll be sending out
another message on the actual date and you are all on the list. Pine 2.0
is the official source release; you will be able to redistribute freely if
you like.

--xxx
content-type: multipart/alternative; boundary=xxu

--xxu
content-type: text/plain

This is the first in the second alternative part

--xxu
content-type: model/foogoo

lksdjflksdjflksjdflkjsf
sdfkjlsdlkfjdslkjfdslkj
sdlkfjdslkjf

--xxu--
--xxx--

--AbC
content-type: application/foo-bar
content-description: extra junk

Second part of outside multipart/alternative

--AbC--



