Return-Path: <root>
Received: by sunni.qualcomm.com. (SMI-8.6/SMI-SVR4)
	id TAA16686; Tue, 28 Apr 1998 19:02:26 -0700
Received: from nala.qualcomm.com (nala.qualcomm.com [129.46.50.44])
	by booray.new-era.com (8.8.5/8.8.5) with ESMTP id VAA05350
	for <lgl@island-resort.com>; Tue, 30 Sep 1997 21:08:20 -0400
Received: from [129.46.137.174] (llundblade-mac.qualcomm.com [129.46.137.174]) by nala.qualcomm.com (8.8.5/1.4/8.7.2/1.13) with ESMTP id SAA01880 for <lgl@island-resort.com>; Tue, 30 Sep 1997 18:08:10 -0700 (PDT)
X-Sender: llundbla@mrw.qualcomm.com
Message-Id: <v04001324b0574b4e9ac2@[129.46.137.174]>
Mime-Version: 1.0
Date: Tue, 30 Sep 1997 17:36:40 -0700
To: lgl@island-resort.com
From: Laurence Lundblade <lgl@qualcomm.com>
Subject: test pseudo sign
Mime-Version: 1.0
Content-Type: multipart/signed;
  protocol="application/x.hashed-signature";
  boundary="=-=-=-=15089212873114=-=-=-="
X-UIDL: @>Me9~^ed9n2g!!97&e9
Status: RO

--=-=-=-=15089212873114=-=-=-=
Mime-Version: 1.0
Content-Type: text/plain; charset="us-ascii"

Here's a little bit of text.....



--=-=-=-=15089212873114=-=-=-=
Content-Type: application/x.hashed-signature

8298
--=-=-=-=15089212873114=-=-=-=--



