Return-Path: <root>
Received: by sunni.qualcomm.com. (SMI-8.6/SMI-SVR4)
	id UAA18860; Tue, 28 Apr 1998 20:35:10 -0700
Message-Id: <199804290335.UAA18860@sunni.qualcomm.com.>
Date: Thu, 2 Jan 1992 12:21:18 -0800 (PST)
From: =?iso-8859-1?Q?=60=61=20Laurence=20Lundblade?= <lgl@cac.washington.edu>
Sender: Laurence Lundblade <lgl@cac.washington.edu>
Reply-To: Laurence Lundblade <lgl@cac.washington.edu>
Subject: =?isoxx?Q?=C0=C1=C2=C3=C4=C5=C6=C7=C8=C9=CA=CB=CC=CD=CE=CF?= xxy
  =?isofoo?B?B64SUCKS?=
To: =?iso-8859-1?Q?Keld_J=F8rn_Simonsen?= <keld>,
        =?iso-8859-1?Q?Olle_J=E4arnefors?=
yyy: extra header
xx: extra header
MIME-Version: 1.0
Content-transfer-encoding: quoted-printable
Content-Type: text/plain;
X-UIDL: :4V!!)(J!!$;T!!e&M!!
Status: RO

This=20has=20spaces=20and=
 is one line.




