Return-Path: <qpop>
Received: by sunni.qualcomm.com. (SMI-8.6/SMI-SVR4)
	id OAA20444; Fri, 26 Jun 1998 14:11:27 -0700
Received: from warlock.qualcomm.com (warlock.qualcomm.com [129.46.52.129]) by clea.qualcomm.com (8.8.5/1.4/8.7.2/1.13) with ESMTP id GAA28450 for <jwashek@clea.qualcomm.com>; Tue, 22 Jul 1997 06:29:50 -0700 (PDT)
Received: from qualcomm.com (qualcomm.com [192.35.156.11]) by warlock.qualcomm.com (8.8.5/1.4/8.7.2/1.13) with ESMTP id GAA13846; Tue, 22 Jul 1997 06:28:38 -0700 (PDT)
Received: from gateway.fedex.com (gateway.fedex.com [198.80.10.2]) by qualcomm.com  with SMTP id GAA25834; Tue, 22 Jul 1997 06:30:07 -0700 (PDT)
Received: by gateway.fedex.com id AA29816
  (InterLock SMTP Gateway 3.0); Tue, 22 Jul 1997 08:29:41 -0500
Received: by gateway.fedex.com (Internal Mail Agent-1);
  Tue, 22 Jul 1997 08:29:41 -0500
Message-Id: <199707221329.AA29816@gateway.fedex.com>
X-Mailer: Microsoft Outlook Express 4.71.0544.0
From: "Richard Terry" <raterry@fedex.com>
To: <jnichols>, <jwashek>, <ksjones>, <kagricol>, <lstudley>, <ntdo>,
        <RHINO81@JUNO.COM>, <zliu>, <INita@aol.com>, <admarkart@JUNO.COM>,
        <billblessing@nmcc.sprintspectrum.com>, <ccarlgo@aol.com>,
        <syn-d@msn.com>, <danamarkart@JUNO.COM>, <Faith394@aol.com>,
        <crabang@aol.com>, <raterry@fedex.com>, "Stephen Boehning" <sboehnin>
Subject: Re: [Yea for the Farmer!
Date: Tue, 22 Jul 1997 08:27:47 -0500
X-Priority: 3
X-Msmail-Priority: Normal
Mime-Version: 1.0
X-Mimeole: Produced By Microsoft MimeOLE Engine V4.71.0544.0
X-UIDL: YE`d9hV9e9Sn,!!5kn!!
Status: RO
Content-Type: multipart/alternative;
 boundary="----=_NextPart_000_01BC9679.2263B420"

This is a multi-part message in MIME format.

------=_NextPart_000_01BC9679.2263B420
Content-Type: text/plain;
 charset="US-ASCII"
Content-Transfer-Encoding: quoted-printable

That Was good...

RT
 ----
From: Stephen Boehning <sboehnin%qualcomm.com@internet.fedex.com>
To: jnichols%qualcomm.com@internet.fedex.com; =
jwashek%qualcomm.com@internet.fedex.com; =
ksjones%qualcomm.com@internet.fedex.com; =
kagricol%qualcomm.com@internet.fedex.com; =
lstudley%qualcomm.com@internet.fedex.com; =
ntdo%qualcomm.com@internet.fedex.com; =
RHINO81%JUNO.COM@internet.fedex.com; =
zliu%qualcomm.com@internet.fedex.com; INita%aol.com@internet.fedex.com; =
admarkart%JUNO.COM@internet.fedex.com; =
billblessing%nmcc.sprintspectrum.com@internet.fedex.com; =
ccarlgo%aol.com@internet.fedex.com; syn-d%msn.com@internet.fedex.com; =
danamarkart%JUNO.COM@internet.fedex.com; =
Faith394%aol.com@internet.fedex.com; crabang%aol.com@internet.fedex.com; =
rt61451@harpo.telecom.fedex.com
Date: Monday, July 21, 1997 12:07 PM
Subject: FW: [Yea for the Farmer!



------=_NextPart_000_01BC9679.2263B420
Content-Type: text/html;
 charset="US-ASCII"
Content-Transfer-Encoding: quoted-printable

<!DOCTYPE HTML PUBLIC "-//W3C//DTD W3 HTML 3.2//EN">
<HTML>
<HEAD>
<META content=3Dtext/html;charset=3Diso-8859-1 =
http-equiv=3DContent-Type>
<META content=3D'"Trident 4.71.0544.0"' name=3DGENERATOR>

</HEAD>
<BODY><FONT face=3DArial size=3D2>
<P>That Was good...</P>

<P>&nbsp;

<P>RT</P>
 ----<BR>
<B>From: </B>Stephen Boehning=20
&lt;sboehnin%qualcomm.com@internet.fedex.com&gt;<BR>
<B>To: </B>jnichols%qualcomm.com@internet.fedex.com;=20
jwashek%qualcomm.com@internet.fedex.com;=20
ksjones%qualcomm.com@internet.fedex.com;=20
kagricol%qualcomm.com@internet.fedex.com;=20
lstudley%qualcomm.com@internet.fedex.com; =
ntdo%qualcomm.com@internet.fedex.com;=20
RHINO81%JUNO.COM@internet.fedex.com; =
zliu%qualcomm.com@internet.fedex.com;=20
INita%aol.com@internet.fedex.com; admarkart%JUNO.COM@internet.fedex.com; =

billblessing%nmcc.sprintspectrum.com@internet.fedex.com;=20
ccarlgo%aol.com@internet.fedex.com; syn-d%msn.com@internet.fedex.com;=20
danamarkart%JUNO.COM@internet.fedex.com; =
Faith394%aol.com@internet.fedex.com;=20
crabang%aol.com@internet.fedex.com; rt61451@harpo.telecom.fedex.com<BR>
<B>Date: </B>Monday, July 21, 1997 12:07 PM<BR>
<B>Subject: </B>FW: [Yea for the Farmer!<BR>
<BR>
</FONT>
</BODY></HTML>

------=_NextPart_000_01BC9679.2263B420--








