Return-Path: <root>
Received: by sunni.qualcomm.com. (SMI-8.6/SMI-SVR4)
	id UAA18879; Tue, 28 Apr 1998 20:38:02 -0700
Message-Id: <199804290338.UAA18879@sunni.qualcomm.com.>
Date: Thu, 2 Jan 1992 12:21:18 -0800 (PST)
From: Laurence Lundblade <lgl@cac.washington.edu>
Sender: Laurence Lundblade <lgl@cac.washington.edu>
Reply-To: Laurence Lundblade <lgl@cac.washington.edu>
Subject: Pine source distribution
To: Bill Bathurst <bill@cpac.washington.edu>
yyy: extra header
xx: extra header
MIME-Version: 1.0
Content-Type: "multipart"
 /
 (slkdfjslkfj) 
 mixed (sdlfkj_ ) ;
 boundary
 =
 "\A\b\C"
X-UIDL: ;`g!!BHgd9*(~!!@g`!!
Status: RO


--AbC
content-type: application/xxxxxxxxxxxxxxxxxxxxxxxxxxxxxxxxxxxxxxxxxxxxxxxxxxyyyyyyyyyyzzzzzzzzzzaaaaaaaaaabbbbbbbbbbcccccccccc
content-disposition: attachment; filename="a123456789b123456789c123456789d123456789e123456789f123456789g123456789h123456789i123456789j123456789.QCP"

xxxxxxxxxxx


--AbC
content-type: "application"/"fozboz"
content-disposition: attachment; filename="a123456789b123456789c123456789d123456789e123456789f123456789g123456789h123456789i123456789j123456789.QCP"

xxxxxxxxxxx

--AbC
content-type: application/foo
content-disposition: attachment; filename=xxx

xxxxxxxxxxx

--AbC
content-type: application(ffo)/(uuu")")foo
content-disposition: "attachment"; filename=xxx

--AbC
content-type: application"/""xxx"
content-disposition: "inline";filename="pp()pp"

xxxxxxxxxxx

--AbC
content-type: application"/""xxx"
content-disposition: attachment;filename=pp()pp

xxxxxxxxxxx

--AbC
content-type: (((()())))application (( ")))"
   )) "/"()()()
   (xxx"\"") "xyz"
content-disposition: attachment;filename=pp()pp

xxxxxxxxxxx

--AbC--








