Return-Path: <root>
Received: by sunni.qualcomm.com. (SMI-8.6/SMI-SVR4)
	id MAA28755; Fri, 1 May 1998 12:40:01 -0700
Date: Sun, 20 Jul 1997 22:30:46 -0700
From: Mail Delivery Subsystem <MAILER-DAEMON>
Subject: Warning: could not send message for past 4 hours
Message-Id: <199707210530.WAA15686@island-resort.com>
To: <lorenzo@java.island-resort.com>
MIME-Version: 1.0
Content-Type: multipart/mixed; 
	boundary="WAA15686.869463046/island-resort.com"
X-UIDL: 3P&e9<j'!!,p&!!C>Ud9
Status: RO


--WAA15686.869463046/island-resort.com

The first 
--WAA15686.869463046/island-resort.com

text line

--WAA15686.869463046/island-resort.com

The second line with no CR at end
--WAA15686.869463046/island-resort.com--

xxx




