Return-Path: <root>
Received: by sunni.qualcomm.com. (SMI-8.6/SMI-SVR4)
	id LAA27589; Fri, 1 May 1998 11:24:36 -0700
Message-Id: <199805011824.LAA27589@sunni.qualcomm.com.>
Date: Thu, 2 Jan 1992 12:21:18 -0800 (PST)
From: Laurence Lundblade <lgl@cac.washington.edu>
Sender: Laurence Lundblade <lgl@cac.washington.edu>
Reply-To: Laurence Lundblade <lgl@cac.washington.edu>
Subject: Pine source distribution
To: Bill Bathurst <bill@cpac.washington.edu>
yyy: extra header
xx: extra header
MIME-Version: 1.0
Content-Type: text/html
X-UIDL: F\Td9^c<e9:TLe9;A:!!
Status: RO


<HTML>
<TITLE>
sldkfj
</TITLE>
<BODY>
This should be displayed...<p>

<PRE>
 t 
  h
   i
    s
</PRE>

this
is
text
<br>
and so
is 
this
&AMP
&aacute
&Ograve

<P>
</BODY>
</HTML>



