Return-Path: <root>
Received: by sunni.qualcomm.com. (SMI-8.6/SMI-SVR4)
	id LAA28039; Fri, 1 May 1998 11:52:31 -0700
Received: from nala.qualcomm.com (nala.qualcomm.com [129.46.50.44])
	by booray.new-era.com (8.8.5/8.8.5) with ESMTP id TAA24715
	for <lgl@island-resort.com>; Thu, 2 Oct 1997 19:47:36 -0400
Received: from llundbla (llundblade.qualcomm.com [129.46.137.63]) by nala.qualcomm.com (8.8.5/1.4/8.7.2/1.13) with ESMTP id QAA19883; Thu, 2 Oct 1997 16:46:56 -0700 (PDT)
Message-ID: <34342F71.FAA9943E@booray.new-era.com>
Date: Thu, 02 Oct 1997 16:34:10 -0700
From: Laurence Lundblade <lgl@booray.new-era.com>
X-Mailer: Mozilla 4.01 [en] (WinNT; I)
MIME-Version: 1.0
To: lgl@island-resort.com
CC: lgl@qualcomm.com
Subject: [Fwd: test html]
X-Priority: 3 (Normal)
Content-Type: multipart/mixed; boundary="------------98A7F260AF0069C1EC9A669C"
X-UIDL: D(+e9@f;e9P@/!!_:pd9
Status: RO

This is a multi-part message in MIME format.
--------------98A7F260AF0069C1EC9A669C
Content-Type: text/plain; charset=us-ascii
Content-Type: text/plain; charset=us-ascii
Content-Transfer-Encoding: 7bit
Content-Transfer-Encoding: 7bit



--------------98A7F260AF0069C1EC9A669C
Content-Type: message/rfc822
Content-Transfer-Encoding: 7bit
Content-Disposition: inline

Message-ID: <34319DEE.9B87137C@booray.new-era.com>
Date: Tue, 30 Sep 1997 17:48:50 -0700
From: Laurence Lundblade <lgl@booray.new-era.com>
X-Mailer: Mozilla 4.01 [en] (WinNT; I)
MIME-Version: 1.0
To: lgl@island-resort.com
Subject: test html
X-Priority: 3 (Normal)
Content-Type: multipart/alternative;
  boundary="------------A5E79AA665717C9A11DA4A65";
  types="text/plain,text/html"



--------------A5E79AA665717C9A11DA4A65
Content-Type: text/plain; charset=us-ascii
Content-Transfer-Encoding: 7bit

This was fancy HTML....
sdfsdfsdfsdfsdfsdfsdfsdf

sdfsdfsdfsdfsdf

sdf

sdf

*sdfsdf
*sdf
*sdf
*sdf
*
   * sdfsdfsdf
   * ttttttt
   * eeeeeeeee
   * eeeeee




   * [Image]
     indented.....
     blue...


--------------A5E79AA665717C9A11DA4A65
Content-Type: text/html; charset=us-ascii
Content-Transfer-Encoding: 7bit

<HTML>
This<I> is fan</I>cy H<U>TM</U>L....
<BR>sdfsdfsdfs<FONT FACE="Braggadocio">dfsdfsdfsdfsdf</FONT>
<PRE><FONT FACE="Braggadocio">sdfsd<FONT SIZE=+4>fsdfs</FONT>dfsdf</FONT></PRE>

<PRE><FONT FACE="Braggadocio">sdf</FONT></PRE>

<PRE><FONT FACE="Braggadocio">sdf</FONT></PRE>

<LI>
<FONT FACE="Braggadocio">sdfsdf</FONT></LI>

<LI>
<FONT FACE="Braggadocio">sdf</FONT></LI>

<LI>
<FONT FACE="Braggadocio">sdf</FONT></LI>

<LI>
<FONT FACE="Braggadocio">sdf</FONT></LI>

<LI>
<FONT FACE="Braggadocio"></FONT></LI>

<UL>
<LI>
sdfsdfsdf</LI>

<LI>
ttttttt</LI>

<LI>
eeeeeeeee</LI>

<LI>
eeeeee</LI>
</UL>
&nbsp;
<BR>&nbsp;
<UL>
<LI>
<IMG SRC="cid:part1.34319DEE.58CF1C88@booray.new-era.com" HEIGHT=2120 WIDTH=2128></LI>

<BR>indented.....
<BR><FONT COLOR="#3333FF">blue...</FONT>
<BR>&nbsp;</UL>
</HTML>


--------------A5E79AA665717C9A11DA4A65--



--------------98A7F260AF0069C1EC9A669C--



