Return-Path: <root>
Received: by sunni.qualcomm.com. (SMI-8.6/SMI-SVR4)
	id MAA28167; Fri, 1 May 1998 12:20:48 -0700
Date: Sun, 20 Jul 1997 22:30:46 -0700
From: Mail Delivery Subsystem <MAILER-DAEMON>
Subject: hey...
Message-Id: <199707210530.WAA15686@island-resort.com>
To: <lorenzo@java.island-resort.com>
Content-Type: text
X-UIDL: "jNe9L?Ke9:/Ee9G&7e9
Status: RO

Hi dad





