{
  "project_info": {
    "project_number": "849197595340",
    "project_id": "infit-2a740",
    "storage_bucket": "infit-2a740.appspot.com"
  },
  "client": [
    {
      "client_info": {
        "mobilesdk_app_id": "1:849197595340:android:1b473c9f911bc915d2e069",
        "android_client_info": {
          "package_name": "com.example.testeteladelogin"
        }
      },
      "oauth_client": [
        {
          "client_id": "849197595340-2a8bco3e9lmudev6vomcchus6028l98b.apps.googleusercontent.com",
          "client_type": 3
        }
      ],
      "api_key": [
        {
          "current_key": "AIzaSyBhg51wPbVa6uiiyHoL7CkXbihyqKkNws0"
        }
      ],
      "services": {
        "appinvite_service": {
          "other_platform_oauth_client": [
            {
              "client_id": "849197595340-2a8bco3e9lmudev6vomcchus6028l98b.apps.googleusercontent.com",
              "client_type": 3
            }
          ]
        }
      }
    }
  ],
  "configuration_version": "1"
}