{
    "intents": [
        {
            "patterns": [
                "Oi",
                "Tudo bem?",
                "Como vai?"
            ],
            "responses": [
                "Ol\u00e1!",
                "Claro como o dia!",
                "Sou seu amigo, em que posso ajudar?"
            ],
            "tag": ""
        },
        {
            "patterns": [
                "Adeus!",
                "Tchau!",
                "At\u00e9 mais!",
                "Nos falamos"
            ],
            "responses": [
                "Claro como o dia!",
                "Adios?!"
            ],
            "tag": "despedida"
        },
        {
            "patterns": [
                "Pode me informar sobre a fatura?",
                "fatura",
                "Quanto eu devo?"
            ],
            "responses": [
                "Me de um minuto",
                "J\u00e1 respondo"
            ],
            "tag": "info_fatura"
        },
        {
            "patterns": [
                ""
            ],
            "responses": [
                "N\u00e3o entendir",
                "Voc\u00ea pode repetir de uma forma mais clara?",
                "Pode tentar explicar com mais detalhes?"
            ],
            "tag": "nada"
        }
    ]
}
