{
	"info": {
		"_postman_id": "1b7cf67a-04ab-4897-94bd-5ccef0792de4",
		"name": "batch127_bookingSystem",
		"schema": "https://schema.getpostman.com/json/collection/v2.1.0/collection.json"
	},
	"item": [
		{
			"name": "Users",
			"item": [
				{
					"name": "check duplicate email",
					"request": {
						"method": "POST",
						"header": [],
						"body": {
							"mode": "raw",
							"raw": "{\r\n    \"email\": \"john@mail.com\"\r\n}",
							"options": {
								"raw": {
									"language": "json"
								}
							}
						},
						"url": {
							"raw": "localhost:4000/users/checkEmail",
							"host": [
								"localhost"
							],
							"port": "4000",
							"path": [
								"users",
								"checkEmail"
							]
						}
					},
					"response": []
				},
				{
					"name": "register a user",
					"request": {
						"method": "POST",
						"header": [],
						"body": {
							"mode": "raw",
							"raw": "{\r\n    \"firstName\": \"admin\",\r\n    \"lastName\": \"admin\",\r\n    \"email\": \"admin@mail.com\",\r\n    \"mobileNo\": \"09123456789\",\r\n    \"password\": \"admin\"\r\n}",
							"options": {
								"raw": {
									"language": "json"
								}
							}
						},
						"url": {
							"raw": "localhost:4000/users/register",
							"host": [
								"localhost"
							],
							"port": "4000",
							"path": [
								"users",
								"register"
							]
						}
					},
					"response": []
				},
				{
					"name": "login a user",
					"request": {
						"method": "POST",
						"header": [],
						"body": {
							"mode": "raw",
							"raw": "{\r\n    \"email\": \"admin@mail.com\",\r\n    \"password\": \"admin\"\r\n}",
							"options": {
								"raw": {
									"language": "json"
								}
							}
						},
						"url": {
							"raw": "localhost:4000/users/login",
							"host": [
								"localhost"
							],
							"port": "4000",
							"path": [
								"users",
								"login"
							]
						}
					},
					"response": []
				},
				{
					"name": "get user details",
					"request": {
						"auth": {
							"type": "bearer",
							"bearer": [
								{
									"key": "token",
									"value": "eyJhbGciOiJIUzI1NiIsInR5cCI6IkpXVCJ9.eyJpZCI6IjYxNDlkMzk5ODAyMTY1ZWMwZTZhYjEzNSIsImVtYWlsIjoiamFzbWluZUBtYWlsLmNvbSIsImlzQWRtaW4iOmZhbHNlLCJpYXQiOjE2MzIzODM0NjJ9.vFueT7DnnWq-wzxE2Huqc5VAL-wwXCbHQknF6j1JkiE",
									"type": "string"
								}
							]
						},
						"method": "GET",
						"header": [],
						"url": {
							"raw": "localhost:4000/users/details",
							"host": [
								"localhost"
							],
							"port": "4000",
							"path": [
								"users",
								"details"
							]
						}
					},
					"response": []
				},
				{
					"name": "Enroll",
					"request": {
						"auth": {
							"type": "bearer",
							"bearer": [
								{
									"key": "token",
									"value": "eyJhbGciOiJIUzI1NiIsInR5cCI6IkpXVCJ9.eyJpZCI6IjYxNDlkMWNmNDM0ZmMwMTBjMzExYjU2YSIsImVtYWlsIjoiamFuZWRvZUBtYWlsLmNvbSIsImlzQWRtaW4iOmZhbHNlLCJpYXQiOjE2MzI0ODU3ODl9.zDumsroXWA8WRj2ZgRV9vw4la34HX6YtZaoNTjYmAOA",
									"type": "string"
								}
							]
						},
						"method": "POST",
						"header": [],
						"body": {
							"mode": "raw",
							"raw": "{\r\n    \"courseId\": \"614dae78dd775b7490695728\"\r\n}",
							"options": {
								"raw": {
									"language": "json"
								}
							}
						},
						"url": {
							"raw": "localhost:4000/users/enroll",
							"host": [
								"localhost"
							],
							"port": "4000",
							"path": [
								"users",
								"enroll"
							]
						}
					},
					"response": []
				}
			]
		},
		{
			"name": "Courses",
			"item": [
				{
					"name": "add a course",
					"request": {
						"auth": {
							"type": "bearer",
							"bearer": [
								{
									"key": "token",
									"value": "eyJhbGciOiJIUzI1NiIsInR5cCI6IkpXVCJ9.eyJpZCI6IjYxNGM1NGE4NGQ3MzM0MjQyNzJkMjBmOSIsImVtYWlsIjoiYWRtaW5AbWFpbC5jb20iLCJpc0FkbWluIjp0cnVlLCJpYXQiOjE2MzI0Njg3Mjl9.htQXWjvgBjzfTOgC1bWevK7mZRDt2N5AZThFEAlfzTE",
									"type": "string"
								}
							]
						},
						"method": "POST",
						"header": [],
						"body": {
							"mode": "raw",
							"raw": "{\r\n    \"name\": \"Bootstrap\",\r\n    \"description\": \"A sample description\",\r\n    \"price\": 5000\r\n}",
							"options": {
								"raw": {
									"language": "json"
								}
							}
						},
						"url": {
							"raw": "localhost:4000/courses/",
							"host": [
								"localhost"
							],
							"port": "4000",
							"path": [
								"courses",
								""
							]
						}
					},
					"response": []
				},
				{
					"name": "get ALL courses",
					"request": {
						"method": "GET",
						"header": [],
						"url": {
							"raw": "localhost:4000/courses/all",
							"host": [
								"localhost"
							],
							"port": "4000",
							"path": [
								"courses",
								"all"
							]
						}
					},
					"response": []
				},
				{
					"name": "get all ACTIVE courses",
					"request": {
						"method": "GET",
						"header": [],
						"url": {
							"raw": "localhost:4000/courses/",
							"host": [
								"localhost"
							],
							"port": "4000",
							"path": [
								"courses",
								""
							]
						}
					},
					"response": []
				},
				{
					"name": "get SPECIFIC course",
					"request": {
						"method": "GET",
						"header": [],
						"url": {
							"raw": "localhost:4000/courses/614c5f8be19dabd223245f90",
							"host": [
								"localhost"
							],
							"port": "4000",
							"path": [
								"courses",
								"614c5f8be19dabd223245f90"
							]
						}
					},
					"response": []
				},
				{
					"name": "Update a Course",
					"request": {
						"auth": {
							"type": "bearer",
							"bearer": [
								{
									"key": "token",
									"value": "eyJhbGciOiJIUzI1NiIsInR5cCI6IkpXVCJ9.eyJpZCI6IjYxNGM1NGE4NGQ3MzM0MjQyNzJkMjBmOSIsImVtYWlsIjoiYWRtaW5AbWFpbC5jb20iLCJpc0FkbWluIjp0cnVlLCJpYXQiOjE2MzI0Nzg2MzR9.LQTUlIsDj58Q53uIIpKx7MX9on3RWelUlvnxwSMLvcc",
									"type": "string"
								}
							]
						},
						"method": "PUT",
						"header": [],
						"body": {
							"mode": "raw",
							"raw": "{\r\n    \"name\": \"HTML Revision\",\r\n    \"description\": \"Sample Description\",\r\n    \"price\": 1000\r\n}",
							"options": {
								"raw": {
									"language": "json"
								}
							}
						},
						"url": {
							"raw": "localhost:4000/courses/614c5f8be19dabd223245f90",
							"host": [
								"localhost"
							],
							"port": "4000",
							"path": [
								"courses",
								"614c5f8be19dabd223245f90"
							]
						}
					},
					"response": []
				},
				{
					"name": "archive a course",
					"request": {
						"auth": {
							"type": "bearer",
							"bearer": [
								{
									"key": "token",
									"value": "eyJhbGciOiJIUzI1NiIsInR5cCI6IkpXVCJ9.eyJpZCI6IjYxNGM1NGE4NGQ3MzM0MjQyNzJkMjBmOSIsImVtYWlsIjoiYWRtaW5AbWFpbC5jb20iLCJpc0FkbWluIjp0cnVlLCJpYXQiOjE2MzI0ODA5MzF9.SC5BbEM27X_uXzonWBZ_Dh8C37v95usGVmwst6uTgPY",
									"type": "string"
								}
							]
						},
						"method": "PUT",
						"header": [],
						"url": {
							"raw": "localhost:4000/courses/614dae78dd775b7490695728/archive",
							"host": [
								"localhost"
							],
							"port": "4000",
							"path": [
								"courses",
								"614dae78dd775b7490695728",
								"archive"
							]
						}
					},
					"response": []
				}
			]
		}
	]
}