<?xml version="1.0" standalone="no"?>
<svg width="90" height="20" version="1.1" xmlns="http://www.w3.org/2000/svg">
  <rect x="0" y="0" width="25" height="20" fill="rgb(209, 34, 41)"/>
  <rect x="15" y="0" width="25" height="20" fill="rgb(246, 138, 30)"/>
  <rect x="30" y="0" width="25" height="20" fill="rgb(253, 224, 26)"/>
  <rect x="45" y="0" width="25" height="20" fill="rgb(0, 121, 64)"/>
  <rect x="60" y="0" width="25" height="20" fill="rgb(36, 64, 142)"/>
  <rect x="75" y="0" width="25" height="20" fill="rgb(115, 41, 130)"/>
</svg>
