asgiref==3.4.1
Django==3.2.7
django-ckeditor==6.1.0
django-crispy-forms==1.13.0
django-debug-toolbar==3.2.2
django-js-asset==1.2.2
Markdown==3.3.4
protobuf==3.18.0
psycopg2==2.9.1
pytz==2021.1
sqlparse==0.4.2
